lucene-dev mailing list archives

Site index · List index
Message view « Date » · « Thread »
Top « Date » · « Thread »
From Policeman Jenkins Server <jenk...@thetaphi.de>
Subject [JENKINS] Lucene-Solr-5.x-Windows (32bit/jdk1.7.0_80) - Build # 4808 - Failure!
Date Mon, 15 Jun 2015 02:19:48 GMT
Build: http://jenkins.thetaphi.de/job/Lucene-Solr-5.x-Windows/4808/
Java: 32bit/jdk1.7.0_80 -server -XX:+UseG1GC

3 tests failed.
FAILED:  junit.framework.TestSuite.org.apache.solr.core.TestLazyCores

Error Message:
ERROR: SolrIndexSearcher opens=51 closes=50

Stack Trace:
java.lang.AssertionError: ERROR: SolrIndexSearcher opens=51 closes=50
	at __randomizedtesting.SeedInfo.seed([28A2B9423857B45]:0)
	at org.junit.Assert.fail(Assert.java:93)
	at org.apache.solr.SolrTestCaseJ4.endTrackingSearchers(SolrTestCaseJ4.java:472)
	at org.apache.solr.SolrTestCaseJ4.afterClass(SolrTestCaseJ4.java:232)
	at sun.reflect.GeneratedMethodAccessor32.invoke(Unknown Source)
	at sun.reflect.DelegatingMethodAccessorImpl.invoke(DelegatingMethodAccessorImpl.java:43)
	at java.lang.reflect.Method.invoke(Method.java:606)
	at com.carrotsearch.randomizedtesting.RandomizedRunner.invoke(RandomizedRunner.java:1627)
	at com.carrotsearch.randomizedtesting.RandomizedRunner$5.evaluate(RandomizedRunner.java:799)
	at com.carrotsearch.randomizedtesting.rules.StatementAdapter.evaluate(StatementAdapter.java:36)
	at com.carrotsearch.randomizedtesting.rules.SystemPropertiesRestoreRule$1.evaluate(SystemPropertiesRestoreRule.java:57)
	at org.apache.lucene.util.AbstractBeforeAfterRule$1.evaluate(AbstractBeforeAfterRule.java:46)
	at com.carrotsearch.randomizedtesting.rules.StatementAdapter.evaluate(StatementAdapter.java:36)
	at org.apache.lucene.util.TestRuleStoreClassName$1.evaluate(TestRuleStoreClassName.java:42)
	at com.carrotsearch.randomizedtesting.rules.NoShadowingOrOverridesOnMethodsRule$1.evaluate(NoShadowingOrOverridesOnMethodsRule.java:39)
	at com.carrotsearch.randomizedtesting.rules.NoShadowingOrOverridesOnMethodsRule$1.evaluate(NoShadowingOrOverridesOnMethodsRule.java:39)
	at com.carrotsearch.randomizedtesting.rules.StatementAdapter.evaluate(StatementAdapter.java:36)
	at com.carrotsearch.randomizedtesting.rules.StatementAdapter.evaluate(StatementAdapter.java:36)
	at com.carrotsearch.randomizedtesting.rules.StatementAdapter.evaluate(StatementAdapter.java:36)
	at org.apache.lucene.util.TestRuleAssertionsRequired$1.evaluate(TestRuleAssertionsRequired.java:54)
	at org.apache.lucene.util.TestRuleMarkFailure$1.evaluate(TestRuleMarkFailure.java:48)
	at org.apache.lucene.util.TestRuleIgnoreAfterMaxFailures$1.evaluate(TestRuleIgnoreAfterMaxFailures.java:65)
	at org.apache.lucene.util.TestRuleIgnoreTestSuites$1.evaluate(TestRuleIgnoreTestSuites.java:55)
	at com.carrotsearch.randomizedtesting.rules.StatementAdapter.evaluate(StatementAdapter.java:36)
	at com.carrotsearch.randomizedtesting.ThreadLeakControl$StatementRunner.run(ThreadLeakControl.java:365)
	at java.lang.Thread.run(Thread.java:745)


FAILED:  junit.framework.TestSuite.org.apache.solr.core.TestLazyCores

Error Message:
1 thread leaked from SUITE scope at org.apache.solr.core.TestLazyCores:     1) Thread[id=9716, name=searcherExecutor-4618-thread-1, state=WAITING, group=TGRP-TestLazyCores]         at sun.misc.Unsafe.park(Native Method)         at java.util.concurrent.locks.LockSupport.park(LockSupport.java:186)         at java.util.concurrent.locks.AbstractQueuedSynchronizer$ConditionObject.await(AbstractQueuedSynchronizer.java:2043)         at java.util.concurrent.LinkedBlockingQueue.take(LinkedBlockingQueue.java:442)         at java.util.concurrent.ThreadPoolExecutor.getTask(ThreadPoolExecutor.java:1068)         at java.util.concurrent.ThreadPoolExecutor.runWorker(ThreadPoolExecutor.java:1130)         at java.util.concurrent.ThreadPoolExecutor$Worker.run(ThreadPoolExecutor.java:615)         at java.lang.Thread.run(Thread.java:745)

Stack Trace:
com.carrotsearch.randomizedtesting.ThreadLeakError: 1 thread leaked from SUITE scope at org.apache.solr.core.TestLazyCores: 
   1) Thread[id=9716, name=searcherExecutor-4618-thread-1, state=WAITING, group=TGRP-TestLazyCores]
        at sun.misc.Unsafe.park(Native Method)
        at java.util.concurrent.locks.LockSupport.park(LockSupport.java:186)
        at java.util.concurrent.locks.AbstractQueuedSynchronizer$ConditionObject.await(AbstractQueuedSynchronizer.java:2043)
        at java.util.concurrent.LinkedBlockingQueue.take(LinkedBlockingQueue.java:442)
        at java.util.concurrent.ThreadPoolExecutor.getTask(ThreadPoolExecutor.java:1068)
        at java.util.concurrent.ThreadPoolExecutor.runWorker(ThreadPoolExecutor.java:1130)
        at java.util.concurrent.ThreadPoolExecutor$Worker.run(ThreadPoolExecutor.java:615)
        at java.lang.Thread.run(Thread.java:745)
	at __randomizedtesting.SeedInfo.seed([28A2B9423857B45]:0)


FAILED:  junit.framework.TestSuite.org.apache.solr.core.TestLazyCores

Error Message:
There are still zombie threads that couldn't be terminated:    1) Thread[id=9716, name=searcherExecutor-4618-thread-1, state=WAITING, group=TGRP-TestLazyCores]         at sun.misc.Unsafe.park(Native Method)         at java.util.concurrent.locks.LockSupport.park(LockSupport.java:186)         at java.util.concurrent.locks.AbstractQueuedSynchronizer$ConditionObject.await(AbstractQueuedSynchronizer.java:2043)         at java.util.concurrent.LinkedBlockingQueue.take(LinkedBlockingQueue.java:442)         at java.util.concurrent.ThreadPoolExecutor.getTask(ThreadPoolExecutor.java:1068)         at java.util.concurrent.ThreadPoolExecutor.runWorker(ThreadPoolExecutor.java:1130)         at java.util.concurrent.ThreadPoolExecutor$Worker.run(ThreadPoolExecutor.java:615)         at java.lang.Thread.run(Thread.java:745)

Stack Trace:
com.carrotsearch.randomizedtesting.ThreadLeakError: There are still zombie threads that couldn't be terminated:
   1) Thread[id=9716, name=searcherExecutor-4618-thread-1, state=WAITING, group=TGRP-TestLazyCores]
        at sun.misc.Unsafe.park(Native Method)
        at java.util.concurrent.locks.LockSupport.park(LockSupport.java:186)
        at java.util.concurrent.locks.AbstractQueuedSynchronizer$ConditionObject.await(AbstractQueuedSynchronizer.java:2043)
        at java.util.concurrent.LinkedBlockingQueue.take(LinkedBlockingQueue.java:442)
        at java.util.concurrent.ThreadPoolExecutor.getTask(ThreadPoolExecutor.java:1068)
        at java.util.concurrent.ThreadPoolExecutor.runWorker(ThreadPoolExecutor.java:1130)
        at java.util.concurrent.ThreadPoolExecutor$Worker.run(ThreadPoolExecutor.java:615)
        at java.lang.Thread.run(Thread.java:745)
	at __randomizedtesting.SeedInfo.seed([28A2B9423857B45]:0)




Build Log:
[...truncated 10819 lines...]
   [junit4] Suite: org.apache.solr.core.TestLazyCores
   [junit4]   2> Creating dataDir: C:\Users\JenkinsSlave\workspace\Lucene-Solr-5.x-Windows\solr\build\solr-core\test\J0\temp\solr.core.TestLazyCores_28A2B9423857B45-001\init-core-data-001
   [junit4]   2> 2046516 INFO  (SUITE-TestLazyCores-seed#[28A2B9423857B45]-worker) [    ] o.a.s.SolrTestCaseJ4 Randomized ssl (false) and clientAuth (false)
   [junit4]   2> 2046520 INFO  (TEST-TestLazyCores.testCachingLimit-seed#[28A2B9423857B45]) [    ] o.a.s.SolrTestCaseJ4 ###Starting testCachingLimit
   [junit4]   2> 2046568 INFO  (TEST-TestLazyCores.testCachingLimit-seed#[28A2B9423857B45]) [    ] o.a.s.c.SolrResourceLoader new SolrResourceLoader for directory: 'C:\Users\JenkinsSlave\workspace\Lucene-Solr-5.x-Windows\solr\build\solr-core\test\J0\temp\solr.core.TestLazyCores_28A2B9423857B45-001\tempDir-001\'
   [junit4]   2> 2046594 INFO  (TEST-TestLazyCores.testCachingLimit-seed#[28A2B9423857B45]) [    ] o.a.s.c.CoreContainer New CoreContainer 31512280
   [junit4]   2> 2046594 INFO  (TEST-TestLazyCores.testCachingLimit-seed#[28A2B9423857B45]) [    ] o.a.s.c.CoreContainer Loading cores into CoreContainer [instanceDir=C:\Users\JenkinsSlave\workspace\Lucene-Solr-5.x-Windows\solr\build\solr-core\test\J0\temp\solr.core.TestLazyCores_28A2B9423857B45-001\tempDir-001\]
   [junit4]   2> 2046594 INFO  (TEST-TestLazyCores.testCachingLimit-seed#[28A2B9423857B45]) [    ] o.a.s.c.CoreContainer loading shared library: C:\Users\JenkinsSlave\workspace\Lucene-Solr-5.x-Windows\solr\build\solr-core\test\J0\temp\solr.core.TestLazyCores_28A2B9423857B45-001\tempDir-001\lib
   [junit4]   2> 2046594 WARN  (TEST-TestLazyCores.testCachingLimit-seed#[28A2B9423857B45]) [    ] o.a.s.c.SolrResourceLoader Can't find (or read) directory to add to classloader: lib (resolved as: C:\Users\JenkinsSlave\workspace\Lucene-Solr-5.x-Windows\solr\build\solr-core\test\J0\temp\solr.core.TestLazyCores_28A2B9423857B45-001\tempDir-001\lib).
   [junit4]   2> 2046603 INFO  (TEST-TestLazyCores.testCachingLimit-seed#[28A2B9423857B45]) [    ] o.a.s.h.c.HttpShardHandlerFactory created with socketTimeout : 600000,connTimeout : 60000,maxConnectionsPerHost : 20,maxConnections : 10000,corePoolSize : 0,maximumPoolSize : 2147483647,maxThreadIdleTime : 5,sizeOfQueue : -1,fairnessPolicy : false,useRetries : false,
   [junit4]   2> 2046606 INFO  (TEST-TestLazyCores.testCachingLimit-seed#[28A2B9423857B45]) [    ] o.a.s.u.UpdateShardHandler Creating UpdateShardHandler HTTP client with params: socketTimeout=600000&connTimeout=60000&retry=true
   [junit4]   2> 2046606 INFO  (TEST-TestLazyCores.testCachingLimit-seed#[28A2B9423857B45]) [    ] o.a.s.c.CoreContainer Allocating transient cache for 4 transient cores
   [junit4]   2> 2046610 INFO  (TEST-TestLazyCores.testCachingLimit-seed#[28A2B9423857B45]) [    ] o.a.s.l.LogWatcher SLF4J impl is org.slf4j.impl.Log4jLoggerFactory
   [junit4]   2> 2046610 INFO  (TEST-TestLazyCores.testCachingLimit-seed#[28A2B9423857B45]) [    ] o.a.s.l.LogWatcher Registering Log Listener [Log4j (org.slf4j.impl.Log4jLoggerFactory)]
   [junit4]   2> 2046610 INFO  (TEST-TestLazyCores.testCachingLimit-seed#[28A2B9423857B45]) [    ] o.a.s.c.CoreContainer No authentication plugin used.
   [junit4]   2> 2046612 INFO  (TEST-TestLazyCores.testCachingLimit-seed#[28A2B9423857B45]) [    ] o.a.s.c.SolrCore Created CoreDescriptor: {name=collection1, loadOnStartup=true, schema=schema.xml, instanceDir=collection1, dataDir=data\, absoluteInstDir=C:\Users\JenkinsSlave\workspace\Lucene-Solr-5.x-Windows\solr\build\solr-core\test\J0\temp\solr.core.TestLazyCores_28A2B9423857B45-001\tempDir-001\collection1\, transient=false, config=solrconfig.xml}
   [junit4]   2> 2046613 INFO  (TEST-TestLazyCores.testCachingLimit-seed#[28A2B9423857B45]) [    ] o.a.s.c.SolrCore Created CoreDescriptor: {transient=true, config=solrconfig.xml, name=collectionLazy2, schema=schema.xml, absoluteInstDir=C:\Users\JenkinsSlave\workspace\Lucene-Solr-5.x-Windows\solr\build\solr-core\test\J0\temp\solr.core.TestLazyCores_28A2B9423857B45-001\tempDir-001\collection2\, dataDir=data\, loadOnStartup=true, instanceDir=collection2}
   [junit4]   2> 2046614 INFO  (TEST-TestLazyCores.testCachingLimit-seed#[28A2B9423857B45]) [    ] o.a.s.c.SolrCore Created CoreDescriptor: {absoluteInstDir=C:\Users\JenkinsSlave\workspace\Lucene-Solr-5.x-Windows\solr\build\solr-core\test\J0\temp\solr.core.TestLazyCores_28A2B9423857B45-001\tempDir-001\collection3\, dataDir=data\, transient=on, config=solrconfig.xml, loadOnStartup=false, instanceDir=collection3, schema=schema.xml, name=collectionLazy3}
   [junit4]   2> 2046614 INFO  (TEST-TestLazyCores.testCachingLimit-seed#[28A2B9423857B45]) [    ] o.a.s.c.SolrCore Created CoreDescriptor: {name=collectionLazy4, config=solrconfig.xml, loadOnStartup=false, dataDir=data\, schema=schema.xml, instanceDir=collection4, transient=false, absoluteInstDir=C:\Users\JenkinsSlave\workspace\Lucene-Solr-5.x-Windows\solr\build\solr-core\test\J0\temp\solr.core.TestLazyCores_28A2B9423857B45-001\tempDir-001\collection4\}
   [junit4]   2> 2046615 INFO  (TEST-TestLazyCores.testCachingLimit-seed#[28A2B9423857B45]) [    ] o.a.s.c.SolrCore Created CoreDescriptor: {transient=false, absoluteInstDir=C:\Users\JenkinsSlave\workspace\Lucene-Solr-5.x-Windows\solr\build\solr-core\test\J0\temp\solr.core.TestLazyCores_28A2B9423857B45-001\tempDir-001\collection5\, schema=schema.xml, loadOnStartup=true, name=collectionLazy5, dataDir=data\, config=solrconfig.xml, instanceDir=collection5}
   [junit4]   2> 2046616 INFO  (TEST-TestLazyCores.testCachingLimit-seed#[28A2B9423857B45]) [    ] o.a.s.c.SolrCore Created CoreDescriptor: {loadOnStartup=false, config=solrconfig.xml, instanceDir=collection6, dataDir=data\, transient=true, name=collectionLazy6, schema=schema.xml, absoluteInstDir=C:\Users\JenkinsSlave\workspace\Lucene-Solr-5.x-Windows\solr\build\solr-core\test\J0\temp\solr.core.TestLazyCores_28A2B9423857B45-001\tempDir-001\collection6\}
   [junit4]   2> 2046616 INFO  (TEST-TestLazyCores.testCachingLimit-seed#[28A2B9423857B45]) [    ] o.a.s.c.SolrCore Created CoreDescriptor: {absoluteInstDir=C:\Users\JenkinsSlave\workspace\Lucene-Solr-5.x-Windows\solr\build\solr-core\test\J0\temp\solr.core.TestLazyCores_28A2B9423857B45-001\tempDir-001\collection7\, instanceDir=collection7, dataDir=data\, loadOnStartup=false, transient=true, config=solrconfig.xml, name=collectionLazy7, schema=schema.xml}
   [junit4]   2> 2046616 INFO  (TEST-TestLazyCores.testCachingLimit-seed#[28A2B9423857B45]) [    ] o.a.s.c.SolrCore Created CoreDescriptor: {absoluteInstDir=C:\Users\JenkinsSlave\workspace\Lucene-Solr-5.x-Windows\solr\build\solr-core\test\J0\temp\solr.core.TestLazyCores_28A2B9423857B45-001\tempDir-001\collection8\, transient=true, dataDir=data\, schema=schema.xml, config=solrconfig.xml, loadOnStartup=false, name=collectionLazy8, instanceDir=collection8}
   [junit4]   2> 2046616 INFO  (TEST-TestLazyCores.testCachingLimit-seed#[28A2B9423857B45]) [    ] o.a.s.c.SolrCore Created CoreDescriptor: {schema=schema.xml, dataDir=data\, config=solrconfig.xml, transient=true, absoluteInstDir=C:\Users\JenkinsSlave\workspace\Lucene-Solr-5.x-Windows\solr\build\solr-core\test\J0\temp\solr.core.TestLazyCores_28A2B9423857B45-001\tempDir-001\collection9\, name=collectionLazy9, instanceDir=collection9, loadOnStartup=false}
   [junit4]   2> 2046617 INFO  (coreLoadExecutor-4616-thread-1) [    ] o.a.s.c.SolrResourceLoader new SolrResourceLoader for directory: 'C:\Users\JenkinsSlave\workspace\Lucene-Solr-5.x-Windows\solr\build\solr-core\test\J0\temp\solr.core.TestLazyCores_28A2B9423857B45-001\tempDir-001\collection1\'
   [junit4]   2> 2046617 INFO  (coreLoadExecutor-4616-thread-3) [    ] o.a.s.c.SolrResourceLoader new SolrResourceLoader for directory: 'C:\Users\JenkinsSlave\workspace\Lucene-Solr-5.x-Windows\solr\build\solr-core\test\J0\temp\solr.core.TestLazyCores_28A2B9423857B45-001\tempDir-001\collection5\'
   [junit4]   2> 2046617 INFO  (coreLoadExecutor-4616-thread-2) [    ] o.a.s.c.SolrResourceLoader new SolrResourceLoader for directory: 'C:\Users\JenkinsSlave\workspace\Lucene-Solr-5.x-Windows\solr\build\solr-core\test\J0\temp\solr.core.TestLazyCores_28A2B9423857B45-001\tempDir-001\collection2\'
   [junit4]   2> 2046659 INFO  (coreLoadExecutor-4616-thread-3) [    ] o.a.s.c.SolrConfig current version of requestparams : -1
   [junit4]   2> 2046659 INFO  (coreLoadExecutor-4616-thread-2) [    ] o.a.s.c.SolrConfig current version of requestparams : -1
   [junit4]   2> 2046676 INFO  (coreLoadExecutor-4616-thread-3) [    ] o.a.s.c.SolrConfig Using Lucene MatchVersion: 5.3.0
   [junit4]   2> 2046676 INFO  (coreLoadExecutor-4616-thread-2) [    ] o.a.s.c.SolrConfig Using Lucene MatchVersion: 5.3.0
   [junit4]   2> 2046695 INFO  (coreLoadExecutor-4616-thread-1) [    ] o.a.s.c.SolrConfig current version of requestparams : -1
   [junit4]   2> 2046705 INFO  (coreLoadExecutor-4616-thread-2) [    ] o.a.s.c.Config Loaded SolrConfig: solrconfig.xml
   [junit4]   2> 2046705 INFO  (coreLoadExecutor-4616-thread-3) [    ] o.a.s.c.Config Loaded SolrConfig: solrconfig.xml
   [junit4]   2> 2046706 INFO  (coreLoadExecutor-4616-thread-3) [    ] o.a.s.s.IndexSchema Reading Solr Schema from C:\Users\JenkinsSlave\workspace\Lucene-Solr-5.x-Windows\solr\build\solr-core\test\J0\temp\solr.core.TestLazyCores_28A2B9423857B45-001\tempDir-001\collection5\conf\schema.xml
   [junit4]   2> 2046711 INFO  (coreLoadExecutor-4616-thread-1) [    ] o.a.s.c.SolrConfig Using Lucene MatchVersion: 5.3.0
   [junit4]   2> 2046712 INFO  (coreLoadExecutor-4616-thread-3) [    ] o.a.s.s.IndexSchema [collectionLazy5] Schema name=tiny
   [junit4]   2> 2046713 INFO  (coreLoadExecutor-4616-thread-2) [    ] o.a.s.s.IndexSchema Reading Solr Schema from C:\Users\JenkinsSlave\workspace\Lucene-Solr-5.x-Windows\solr\build\solr-core\test\J0\temp\solr.core.TestLazyCores_28A2B9423857B45-001\tempDir-001\collection2\conf\schema.xml
   [junit4]   2> 2046718 INFO  (coreLoadExecutor-4616-thread-2) [    ] o.a.s.s.IndexSchema [collectionLazy2] Schema name=tiny
   [junit4]   2> 2046755 INFO  (coreLoadExecutor-4616-thread-3) [    ] o.a.s.s.IndexSchema unique key field: id
   [junit4]   2> 2046756 INFO  (coreLoadExecutor-4616-thread-3) [    ] o.a.s.c.CoreContainer Creating SolrCore 'collectionLazy5' using configuration from instancedir C:\Users\JenkinsSlave\workspace\Lucene-Solr-5.x-Windows\solr\build\solr-core\test\J0\temp\solr.core.TestLazyCores_28A2B9423857B45-001\tempDir-001\collection5\
   [junit4]   2> 2046756 INFO  (coreLoadExecutor-4616-thread-3) [    x:collectionLazy5] o.a.s.c.SolrCore org.apache.solr.core.MockDirectoryFactory
   [junit4]   2> 2046756 INFO  (coreLoadExecutor-4616-thread-3) [    x:collectionLazy5] o.a.s.c.SolrCore [[collectionLazy5] ] Opening new SolrCore at [C:\Users\JenkinsSlave\workspace\Lucene-Solr-5.x-Windows\solr\build\solr-core\test\J0\temp\solr.core.TestLazyCores_28A2B9423857B45-001\tempDir-001\collection5\], dataDir=[null]
   [junit4]   2> 2046756 INFO  (coreLoadExecutor-4616-thread-3) [    x:collectionLazy5] o.a.s.c.SolrCore JMX monitoring not detected for core: collectionLazy5
   [junit4]   2> 2046757 INFO  (coreLoadExecutor-4616-thread-3) [    x:collectionLazy5] o.a.s.c.CachingDirectoryFactory return new directory for C:\Users\JenkinsSlave\workspace\Lucene-Solr-5.x-Windows\solr\build\solr-core\test\J0\temp\solr.core.TestLazyCores_28A2B9423857B45-001\tempDir-001\collection5\data\
   [junit4]   2> 2046757 INFO  (coreLoadExecutor-4616-thread-3) [    x:collectionLazy5] o.a.s.c.SolrCore New index directory detected: old=null new=C:\Users\JenkinsSlave\workspace\Lucene-Solr-5.x-Windows\solr\build\solr-core\test\J0\temp\solr.core.TestLazyCores_28A2B9423857B45-001\tempDir-001\collection5\data\index/
   [junit4]   2> 2046757 WARN  (coreLoadExecutor-4616-thread-3) [    x:collectionLazy5] o.a.s.c.SolrCore [collectionLazy5] Solr index directory 'C:\Users\JenkinsSlave\workspace\Lucene-Solr-5.x-Windows\solr\build\solr-core\test\J0\temp\solr.core.TestLazyCores_28A2B9423857B45-001\tempDir-001\collection5\data\index' doesn't exist. Creating new index...
   [junit4]   2> 2046757 INFO  (coreLoadExecutor-4616-thread-3) [    x:collectionLazy5] o.a.s.c.CachingDirectoryFactory return new directory for C:\Users\JenkinsSlave\workspace\Lucene-Solr-5.x-Windows\solr\build\solr-core\test\J0\temp\solr.core.TestLazyCores_28A2B9423857B45-001\tempDir-001\collection5\data\index
   [junit4]   2> 2046758 INFO  (coreLoadExecutor-4616-thread-3) [    x:collectionLazy5] o.a.s.u.RandomMergePolicy RandomMergePolicy wrapping class org.apache.lucene.index.LogByteSizeMergePolicy: [LogByteSizeMergePolicy: minMergeSize=1677721, mergeFactor=14, maxMergeSize=2147483648, maxMergeSizeForForcedMerge=9223372036854775807, calibrateSizeByDeletes=true, maxMergeDocs=2147483647, maxCFSSegmentSizeMB=8.796093022207999E12, noCFSRatio=1.0]
   [junit4]   2> 2046758 INFO  (coreLoadExecutor-4616-thread-3) [    x:collectionLazy5] o.a.s.c.SolrCore SolrDeletionPolicy.onCommit: commits: num=1
   [junit4]   2> 	commit{dir=MockDirectoryWrapper(RAMDirectory@10f2128 lockFactory=org.apache.lucene.store.SingleInstanceLockFactory@49da0c),segFN=segments_1,generation=1}
   [junit4]   2> 2046758 INFO  (coreLoadExecutor-4616-thread-3) [    x:collectionLazy5] o.a.s.c.SolrCore newest commit generation = 1
   [junit4]   2> 2046759 INFO  (coreLoadExecutor-4616-thread-2) [    ] o.a.s.s.IndexSchema unique key field: id
   [junit4]   2> 2046760 INFO  (coreLoadExecutor-4616-thread-2) [    ] o.a.s.c.CoreContainer Creating SolrCore 'collectionLazy2' using configuration from instancedir C:\Users\JenkinsSlave\workspace\Lucene-Solr-5.x-Windows\solr\build\solr-core\test\J0\temp\solr.core.TestLazyCores_28A2B9423857B45-001\tempDir-001\collection2\
   [junit4]   2> 2046760 INFO  (coreLoadExecutor-4616-thread-2) [    x:collectionLazy2] o.a.s.c.SolrCore org.apache.solr.core.MockDirectoryFactory
   [junit4]   2> 2046761 INFO  (coreLoadExecutor-4616-thread-2) [    x:collectionLazy2] o.a.s.c.SolrCore [[collectionLazy2] ] Opening new SolrCore at [C:\Users\JenkinsSlave\workspace\Lucene-Solr-5.x-Windows\solr\build\solr-core\test\J0\temp\solr.core.TestLazyCores_28A2B9423857B45-001\tempDir-001\collection2\], dataDir=[null]
   [junit4]   2> 2046761 INFO  (coreLoadExecutor-4616-thread-2) [    x:collectionLazy2] o.a.s.c.SolrCore JMX monitoring not detected for core: collectionLazy2
   [junit4]   2> 2046761 INFO  (coreLoadExecutor-4616-thread-2) [    x:collectionLazy2] o.a.s.c.CachingDirectoryFactory return new directory for C:\Users\JenkinsSlave\workspace\Lucene-Solr-5.x-Windows\solr\build\solr-core\test\J0\temp\solr.core.TestLazyCores_28A2B9423857B45-001\tempDir-001\collection2\data\
   [junit4]   2> 2046761 INFO  (coreLoadExecutor-4616-thread-2) [    x:collectionLazy2] o.a.s.c.SolrCore New index directory detected: old=null new=C:\Users\JenkinsSlave\workspace\Lucene-Solr-5.x-Windows\solr\build\solr-core\test\J0\temp\solr.core.TestLazyCores_28A2B9423857B45-001\tempDir-001\collection2\data\index/
   [junit4]   2> 2046761 WARN  (coreLoadExecutor-4616-thread-2) [    x:collectionLazy2] o.a.s.c.SolrCore [collectionLazy2] Solr index directory 'C:\Users\JenkinsSlave\workspace\Lucene-Solr-5.x-Windows\solr\build\solr-core\test\J0\temp\solr.core.TestLazyCores_28A2B9423857B45-001\tempDir-001\collection2\data\index' doesn't exist. Creating new index...
   [junit4]   2> 2046762 INFO  (coreLoadExecutor-4616-thread-2) [    x:collectionLazy2] o.a.s.c.CachingDirectoryFactory return new directory for C:\Users\JenkinsSlave\workspace\Lucene-Solr-5.x-Windows\solr\build\solr-core\test\J0\temp\solr.core.TestLazyCores_28A2B9423857B45-001\tempDir-001\collection2\data\index
   [junit4]   2> 2046762 INFO  (coreLoadExecutor-4616-thread-2) [    x:collectionLazy2] o.a.s.u.RandomMergePolicy RandomMergePolicy wrapping class org.apache.lucene.index.LogByteSizeMergePolicy: [LogByteSizeMergePolicy: minMergeSize=1677721, mergeFactor=14, maxMergeSize=2147483648, maxMergeSizeForForcedMerge=9223372036854775807, calibrateSizeByDeletes=true, maxMergeDocs=2147483647, maxCFSSegmentSizeMB=8.796093022207999E12, noCFSRatio=1.0]
   [junit4]   2> 2046762 INFO  (OldIndexDirectoryCleanupThreadForCore-collectionLazy5) [    x:collectionLazy5] o.a.s.c.SolrCore Looking for old index directories to cleanup for core collectionLazy5 in C:\Users\JenkinsSlave\workspace\Lucene-Solr-5.x-Windows\solr\build\solr-core\test\J0\temp\solr.core.TestLazyCores_28A2B9423857B45-001\tempDir-001\collection5\data\
   [junit4]   2> 2046763 WARN  (OldIndexDirectoryCleanupThreadForCore-collectionLazy5) [    x:collectionLazy5] o.a.s.c.DirectoryFactory C:\Users\JenkinsSlave\workspace\Lucene-Solr-5.x-Windows\solr\build\solr-core\test\J0\temp\solr.core.TestLazyCores_28A2B9423857B45-001\tempDir-001\collection5\data\ does not point to a valid data directory; skipping clean-up of old index directories.
   [junit4]   2> 2046763 INFO  (coreLoadExecutor-4616-thread-2) [    x:collectionLazy2] o.a.s.c.SolrCore SolrDeletionPolicy.onCommit: commits: num=1
   [junit4]   2> 	commit{dir=MockDirectoryWrapper(RAMDirectory@57459d lockFactory=org.apache.lucene.store.SingleInstanceLockFactory@19b831d),segFN=segments_1,generation=1}
   [junit4]   2> 2046764 INFO  (coreLoadExecutor-4616-thread-2) [    x:collectionLazy2] o.a.s.c.SolrCore newest commit generation = 1
   [junit4]   2> 2046766 INFO  (coreLoadExecutor-4616-thread-2) [    x:collectionLazy2] o.a.s.c.SolrCore no updateRequestProcessorChain defined as default, creating implicit default
   [junit4]   2> 2046767 INFO  (OldIndexDirectoryCleanupThreadForCore-collectionLazy2) [    x:collectionLazy2] o.a.s.c.SolrCore Looking for old index directories to cleanup for core collectionLazy2 in C:\Users\JenkinsSlave\workspace\Lucene-Solr-5.x-Windows\solr\build\solr-core\test\J0\temp\solr.core.TestLazyCores_28A2B9423857B45-001\tempDir-001\collection2\data\
   [junit4]   2> 2046767 INFO  (coreLoadExecutor-4616-thread-3) [    x:collectionLazy5] o.a.s.c.SolrCore no updateRequestProcessorChain defined as default, creating implicit default
   [junit4]   2> 2046767 WARN  (OldIndexDirectoryCleanupThreadForCore-collectionLazy2) [    x:collectionLazy2] o.a.s.c.DirectoryFactory C:\Users\JenkinsSlave\workspace\Lucene-Solr-5.x-Windows\solr\build\solr-core\test\J0\temp\solr.core.TestLazyCores_28A2B9423857B45-001\tempDir-001\collection2\data\ does not point to a valid data directory; skipping clean-up of old index directories.
   [junit4]   2> 2046776 INFO  (coreLoadExecutor-4616-thread-3) [    x:collectionLazy5] o.a.s.h.l.XMLLoader xsltCacheLifetimeSeconds=60
   [junit4]   2> 2046777 INFO  (coreLoadExecutor-4616-thread-3) [    x:collectionLazy5] o.a.s.h.l.XMLLoader xsltCacheLifetimeSeconds=60
   [junit4]   2> 2046779 INFO  (coreLoadExecutor-4616-thread-3) [    x:collectionLazy5] o.a.s.h.l.XMLLoader xsltCacheLifetimeSeconds=60
   [junit4]   2> 2046781 INFO  (coreLoadExecutor-4616-thread-3) [    x:collectionLazy5] o.a.s.h.l.XMLLoader xsltCacheLifetimeSeconds=60
   [junit4]   2> 2046781 INFO  (coreLoadExecutor-4616-thread-1) [    ] o.a.s.c.Config Loaded SolrConfig: solrconfig.xml
   [junit4]   2> 2046782 INFO  (coreLoadExecutor-4616-thread-2) [    x:collectionLazy2] o.a.s.h.l.XMLLoader xsltCacheLifetimeSeconds=60
   [junit4]   2> 2046782 INFO  (coreLoadExecutor-4616-thread-3) [    x:collectionLazy5] o.a.s.c.RequestHandlers Registered paths: /admin/ping,/replication,/admin/mbeans,/get,/update/csv,/update,/select,/update/json/docs,/admin/logging,/admin/threads,/admin/system,/config,/admin/properties,/admin/luke,/admin/file,/admin/segments,/admin/plugins,/schema,/update/json
   [junit4]   2> 2046783 INFO  (coreLoadExecutor-4616-thread-2) [    x:collectionLazy2] o.a.s.h.l.XMLLoader xsltCacheLifetimeSeconds=60
   [junit4]   2> 2046783 INFO  (coreLoadExecutor-4616-thread-3) [    x:collectionLazy5] o.a.s.c.SolrCore Using default statsCache cache: org.apache.solr.search.stats.LocalStatsCache
   [junit4]   2> 2046784 INFO  (coreLoadExecutor-4616-thread-3) [    x:collectionLazy5] o.a.s.c.SolrCore Hard AutoCommit: disabled
   [junit4]   2> 2046784 INFO  (coreLoadExecutor-4616-thread-3) [    x:collectionLazy5] o.a.s.c.SolrCore Soft AutoCommit: disabled
   [junit4]   2> 2046784 INFO  (coreLoadExecutor-4616-thread-3) [    x:collectionLazy5] o.a.s.u.RandomMergePolicy RandomMergePolicy wrapping class org.apache.lucene.index.LogDocMergePolicy: [LogDocMergePolicy: minMergeSize=1000, mergeFactor=25, maxMergeSize=9223372036854775807, maxMergeSizeForForcedMerge=9223372036854775807, calibrateSizeByDeletes=true, maxMergeDocs=2147483647, maxCFSSegmentSizeMB=8.796093022207999E12, noCFSRatio=0.49264461801157944]
   [junit4]   2> 2046784 INFO  (coreLoadExecutor-4616-thread-2) [    x:collectionLazy2] o.a.s.h.l.XMLLoader xsltCacheLifetimeSeconds=60
   [junit4]   2> 2046784 INFO  (coreLoadExecutor-4616-thread-3) [    x:collectionLazy5] o.a.s.c.SolrCore SolrDeletionPolicy.onInit: commits: num=1
   [junit4]   2> 	commit{dir=MockDirectoryWrapper(RAMDirectory@10f2128 lockFactory=org.apache.lucene.store.SingleInstanceLockFactory@49da0c),segFN=segments_1,generation=1}
   [junit4]   2> 2046784 INFO  (coreLoadExecutor-4616-thread-3) [    x:collectionLazy5] o.a.s.c.SolrCore newest commit generation = 1
   [junit4]   2> 2046785 INFO  (coreLoadExecutor-4616-thread-3) [    x:collectionLazy5] o.a.s.s.SolrIndexSearcher Opening Searcher@1cef2c8[collectionLazy5] main
   [junit4]   2> 2046785 INFO  (coreLoadExecutor-4616-thread-3) [    x:collectionLazy5] o.a.s.r.ManagedResourceStorage File-based storage initialized to use dir: C:\Users\JenkinsSlave\workspace\Lucene-Solr-5.x-Windows\solr\build\solr-core\test\J0\temp\solr.core.TestLazyCores_28A2B9423857B45-001\tempDir-001\collection5\conf
   [junit4]   2> 2046785 INFO  (coreLoadExecutor-4616-thread-3) [    x:collectionLazy5] o.a.s.r.RestManager Initializing RestManager with initArgs: {storageDir=C:\Users\JenkinsSlave\workspace\Lucene-Solr-5.x-Windows\solr\build\solr-core\test\J0\temp\solr.core.TestLazyCores_28A2B9423857B45-001\tempDir-001\collection5\conf}
   [junit4]   2> 2046785 INFO  (coreLoadExecutor-4616-thread-3) [    x:collectionLazy5] o.a.s.r.ManagedResourceStorage Reading _rest_managed.json using file:dir=C:\Users\JenkinsSlave\workspace\Lucene-Solr-5.x-Windows\solr\build\solr-core\test\J0\temp\solr.core.TestLazyCores_28A2B9423857B45-001\tempDir-001\collection5\conf
   [junit4]   2> 2046785 INFO  (coreLoadExecutor-4616-thread-2) [    x:collectionLazy2] o.a.s.h.l.XMLLoader xsltCacheLifetimeSeconds=60
   [junit4]   2> 2046786 INFO  (coreLoadExecutor-4616-thread-3) [    x:collectionLazy5] o.a.s.r.RestManager Initializing 0 registered ManagedResources
   [junit4]   2> 2046786 INFO  (coreLoadExecutor-4616-thread-3) [    x:collectionLazy5] o.a.s.h.ReplicationHandler Commits will be reserved for  10000
   [junit4]   2> 2046786 INFO  (coreLoadExecutor-4616-thread-3) [    x:collectionLazy5] o.a.s.c.CoreContainer registering core: collectionLazy5
   [junit4]   2> 2046787 INFO  (searcherExecutor-4617-thread-1-processing-x:collectionLazy5) [    x:collectionLazy5] o.a.s.c.SolrCore [collectionLazy5] Registered new searcher Searcher@1cef2c8[collectionLazy5] main{ExitableDirectoryReader(UninvertingDirectoryReader())}
   [junit4]   2> 2046787 INFO  (coreLoadExecutor-4616-thread-1) [    ] o.a.s.s.IndexSchema Reading Solr Schema from C:\Users\JenkinsSlave\workspace\Lucene-Solr-5.x-Windows\solr\build\solr-core\test\J0\temp\solr.core.TestLazyCores_28A2B9423857B45-001\tempDir-001\collection1\conf\schema.xml
   [junit4]   2> 2046787 INFO  (coreLoadExecutor-4616-thread-2) [    x:collectionLazy2] o.a.s.c.RequestHandlers Registered paths: /admin/ping,/replication,/admin/mbeans,/get,/update/csv,/update,/select,/update/json/docs,/admin/logging,/admin/threads,/admin/system,/config,/admin/properties,/admin/luke,/admin/file,/admin/segments,/admin/plugins,/schema,/update/json
   [junit4]   2> 2046788 INFO  (coreLoadExecutor-4616-thread-2) [    x:collectionLazy2] o.a.s.c.SolrCore Using default statsCache cache: org.apache.solr.search.stats.LocalStatsCache
   [junit4]   2> 2046789 INFO  (coreLoadExecutor-4616-thread-2) [    x:collectionLazy2] o.a.s.c.SolrCore Hard AutoCommit: disabled
   [junit4]   2> 2046789 INFO  (coreLoadExecutor-4616-thread-2) [    x:collectionLazy2] o.a.s.c.SolrCore Soft AutoCommit: disabled
   [junit4]   2> 2046790 INFO  (coreLoadExecutor-4616-thread-2) [    x:collectionLazy2] o.a.s.u.RandomMergePolicy RandomMergePolicy wrapping class org.apache.lucene.index.LogDocMergePolicy: [LogDocMergePolicy: minMergeSize=1000, mergeFactor=25, maxMergeSize=9223372036854775807, maxMergeSizeForForcedMerge=9223372036854775807, calibrateSizeByDeletes=true, maxMergeDocs=2147483647, maxCFSSegmentSizeMB=8.796093022207999E12, noCFSRatio=0.49264461801157944]
   [junit4]   2> 2046790 INFO  (coreLoadExecutor-4616-thread-2) [    x:collectionLazy2] o.a.s.c.SolrCore SolrDeletionPolicy.onInit: commits: num=1
   [junit4]   2> 	commit{dir=MockDirectoryWrapper(RAMDirectory@57459d lockFactory=org.apache.lucene.store.SingleInstanceLockFactory@19b831d),segFN=segments_1,generation=1}
   [junit4]   2> 2046790 INFO  (coreLoadExecutor-4616-thread-2) [    x:collectionLazy2] o.a.s.c.SolrCore newest commit generation = 1
   [junit4]   2> 2046790 INFO  (coreLoadExecutor-4616-thread-2) [    x:collectionLazy2] o.a.s.s.SolrIndexSearcher Opening Searcher@a953b7[collectionLazy2] main
   [junit4]   2> 2046791 INFO  (coreLoadExecutor-4616-thread-2) [    x:collectionLazy2] o.a.s.r.ManagedResourceStorage File-based storage initialized to use dir: C:\Users\JenkinsSlave\workspace\Lucene-Solr-5.x-Windows\solr\build\solr-core\test\J0\temp\solr.core.TestLazyCores_28A2B9423857B45-001\tempDir-001\collection2\conf
   [junit4]   2> 2046791 INFO  (coreLoadExecutor-4616-thread-2) [    x:collectionLazy2] o.a.s.r.RestManager Initializing RestManager with initArgs: {storageDir=C:\Users\JenkinsSlave\workspace\Lucene-Solr-5.x-Windows\solr\build\solr-core\test\J0\temp\solr.core.TestLazyCores_28A2B9423857B45-001\tempDir-001\collection2\conf}
   [junit4]   2> 2046791 INFO  (coreLoadExecutor-4616-thread-2) [    x:collectionLazy2] o.a.s.r.ManagedResourceStorage Reading _rest_managed.json using file:dir=C:\Users\JenkinsSlave\workspace\Lucene-Solr-5.x-Windows\solr\build\solr-core\test\J0\temp\solr.core.TestLazyCores_28A2B9423857B45-001\tempDir-001\collection2\conf
   [junit4]   2> 2046791 INFO  (coreLoadExecutor-4616-thread-2) [    x:collectionLazy2] o.a.s.r.RestManager Initializing 0 registered ManagedResources
   [junit4]   2> 2046791 INFO  (coreLoadExecutor-4616-thread-2) [    x:collectionLazy2] o.a.s.h.ReplicationHandler Commits will be reserved for  10000
   [junit4]   2> 2046791 INFO  (coreLoadExecutor-4616-thread-2) [    x:collectionLazy2] o.a.s.c.CoreContainer Opening transient core collectionLazy2
   [junit4]   2> 2046792 INFO  (coreLoadExecutor-4616-thread-2) [    x:collectionLazy2] o.a.s.c.CoreContainer registering core: collectionLazy2
   [junit4]   2> 2046792 INFO  (coreLoadExecutor-4616-thread-1) [    ] o.a.s.s.IndexSchema [collection1] Schema name=tiny
   [junit4]   2> 2046793 INFO  (searcherExecutor-4618-thread-1-processing-x:collectionLazy2) [    x:collectionLazy2] o.a.s.c.SolrCore [collectionLazy2] Registered new searcher Searcher@a953b7[collectionLazy2] main{ExitableDirectoryReader(UninvertingDirectoryReader())}
   [junit4]   2> 2046802 INFO  (coreLoadExecutor-4616-thread-1) [    ] o.a.s.s.IndexSchema unique key field: id
   [junit4]   2> 2046803 INFO  (coreLoadExecutor-4616-thread-1) [    ] o.a.s.c.CoreContainer Creating SolrCore 'collection1' using configuration from instancedir C:\Users\JenkinsSlave\workspace\Lucene-Solr-5.x-Windows\solr\build\solr-core\test\J0\temp\solr.core.TestLazyCores_28A2B9423857B45-001\tempDir-001\collection1\
   [junit4]   2> 2046803 INFO  (coreLoadExecutor-4616-thread-1) [    x:collection1] o.a.s.c.SolrCore org.apache.solr.core.MockDirectoryFactory
   [junit4]   2> 2046803 INFO  (coreLoadExecutor-4616-thread-1) [    x:collection1] o.a.s.c.SolrCore [[collection1] ] Opening new SolrCore at [C:\Users\JenkinsSlave\workspace\Lucene-Solr-5.x-Windows\solr\build\solr-core\test\J0\temp\solr.core.TestLazyCores_28A2B9423857B45-001\tempDir-001\collection1\], dataDir=[null]
   [junit4]   2> 2046803 INFO  (coreLoadExecutor-4616-thread-1) [    x:collection1] o.a.s.c.SolrCore JMX monitoring not detected for core: collection1
   [junit4]   2> 2046804 INFO  (coreLoadExecutor-4616-thread-1) [    x:collection1] o.a.s.c.CachingDirectoryFactory return new directory for C:\Users\JenkinsSlave\workspace\Lucene-Solr-5.x-Windows\solr\build\solr-core\test\J0\temp\solr.core.TestLazyCores_28A2B9423857B45-001\tempDir-001\collection1\data\
   [junit4]   2> 2046804 INFO  (coreLoadExecutor-4616-thread-1) [    x:collection1] o.a.s.c.SolrCore New index directory detected: old=null new=C:\Users\JenkinsSlave\workspace\Lucene-Solr-5.x-Windows\solr\build\solr-core\test\J0\temp\solr.core.TestLazyCores_28A2B9423857B45-001\tempDir-001\collection1\data\index/
   [junit4]   2> 2046804 WARN  (coreLoadExecutor-4616-thread-1) [    x:collection1] o.a.s.c.SolrCore [collection1] Solr index directory 'C:\Users\JenkinsSlave\workspace\Lucene-Solr-5.x-Windows\solr\build\solr-core\test\J0\temp\solr.core.TestLazyCores_28A2B9423857B45-001\tempDir-001\collection1\data\index' doesn't exist. Creating new index...
   [junit4]   2> 2046804 INFO  (coreLoadExecutor-4616-thread-1) [    x:collection1] o.a.s.c.CachingDirectoryFactory return new directory for C:\Users\JenkinsSlave\workspace\Lucene-Solr-5.x-Windows\solr\build\solr-core\test\J0\temp\solr.core.TestLazyCores_28A2B9423857B45-001\tempDir-001\collection1\data\index
   [junit4]   2> 2046804 INFO  (coreLoadExecutor-4616-thread-1) [    x:collection1] o.a.s.u.RandomMergePolicy RandomMergePolicy wrapping class org.apache.lucene.index.LogByteSizeMergePolicy: [LogByteSizeMergePolicy: minMergeSize=1677721, mergeFactor=14, maxMergeSize=2147483648, maxMergeSizeForForcedMerge=9223372036854775807, calibrateSizeByDeletes=true, maxMergeDocs=2147483647, maxCFSSegmentSizeMB=8.796093022207999E12, noCFSRatio=1.0]
   [junit4]   2> 2046805 INFO  (coreLoadExecutor-4616-thread-1) [    x:collection1] o.a.s.c.SolrCore SolrDeletionPolicy.onCommit: commits: num=1
   [junit4]   2> 	commit{dir=MockDirectoryWrapper(RAMDirectory@1339704 lockFactory=org.apache.lucene.store.SingleInstanceLockFactory@1ffb769),segFN=segments_1,generation=1}
   [junit4]   2> 2046805 INFO  (coreLoadExecutor-4616-thread-1) [    x:collection1] o.a.s.c.SolrCore newest commit generation = 1
   [junit4]   2> 2046806 INFO  (OldIndexDirectoryCleanupThreadForCore-collection1) [    x:collection1] o.a.s.c.SolrCore Looking for old index directories to cleanup for core collection1 in C:\Users\JenkinsSlave\workspace\Lucene-Solr-5.x-Windows\solr\build\solr-core\test\J0\temp\solr.core.TestLazyCores_28A2B9423857B45-001\tempDir-001\collection1\data\
   [junit4]   2> 2046807 WARN  (OldIndexDirectoryCleanupThreadForCore-collection1) [    x:collection1] o.a.s.c.DirectoryFactory C:\Users\JenkinsSlave\workspace\Lucene-Solr-5.x-Windows\solr\build\solr-core\test\J0\temp\solr.core.TestLazyCores_28A2B9423857B45-001\tempDir-001\collection1\data\ does not point to a valid data directory; skipping clean-up of old index directories.
   [junit4]   2> 2046809 INFO  (coreLoadExecutor-4616-thread-1) [    x:collection1] o.a.s.c.SolrCore no updateRequestProcessorChain defined as default, creating implicit default
   [junit4]   2> 2046811 INFO  (coreLoadExecutor-4616-thread-1) [    x:collection1] o.a.s.h.l.XMLLoader xsltCacheLifetimeSeconds=60
   [junit4]   2> 2046812 INFO  (coreLoadExecutor-4616-thread-1) [    x:collection1] o.a.s.h.l.XMLLoader xsltCacheLifetimeSeconds=60
   [junit4]   2> 2046814 INFO  (coreLoadExecutor-4616-thread-1) [    x:collection1] o.a.s.h.l.XMLLoader xsltCacheLifetimeSeconds=60
   [junit4]   2> 2046815 INFO  (coreLoadExecutor-4616-thread-1) [    x:collection1] o.a.s.h.l.XMLLoader xsltCacheLifetimeSeconds=60
   [junit4]   2> 2046817 INFO  (coreLoadExecutor-4616-thread-1) [    x:collection1] o.a.s.c.RequestHandlers Registered paths: /admin/ping,/replication,/admin/mbeans,/get,/update/csv,/update,/select,/update/json/docs,/admin/logging,/admin/threads,/admin/system,/config,/admin/properties,/admin/luke,/admin/file,/admin/segments,/admin/plugins,/schema,/update/json
   [junit4]   2> 2046818 INFO  (coreLoadExecutor-4616-thread-1) [    x:collection1] o.a.s.c.SolrCore Using default statsCache cache: org.apache.solr.search.stats.LocalStatsCache
   [junit4]   2> 2046819 INFO  (coreLoadExecutor-4616-thread-1) [    x:collection1] o.a.s.c.SolrCore Hard AutoCommit: disabled
   [junit4]   2> 2046819 INFO  (coreLoadExecutor-4616-thread-1) [    x:collection1] o.a.s.c.SolrCore Soft AutoCommit: disabled
   [junit4]   2> 2046819 INFO  (coreLoadExecutor-4616-thread-1) [    x:collection1] o.a.s.u.RandomMergePolicy RandomMergePolicy wrapping class org.apache.lucene.index.LogDocMergePolicy: [LogDocMergePolicy: minMergeSize=1000, mergeFactor=25, maxMergeSize=9223372036854775807, maxMergeSizeForForcedMerge=9223372036854775807, calibrateSizeByDeletes=true, maxMergeDocs=2147483647, maxCFSSegmentSizeMB=8.796093022207999E12, noCFSRatio=0.49264461801157944]
   [junit4]   2> 2046819 INFO  (coreLoadExecutor-4616-thread-1) [    x:collection1] o.a.s.c.SolrCore SolrDeletionPolicy.onInit: commits: num=1
   [junit4]   2> 	commit{dir=MockDirectoryWrapper(RAMDirectory@1339704 lockFactory=org.apache.lucene.store.SingleInstanceLockFactory@1ffb769),segFN=segments_1,generation=1}
   [junit4]   2> 2046819 INFO  (coreLoadExecutor-4616-thread-1) [    x:collection1] o.a.s.c.SolrCore newest commit generation = 1
   [junit4]   2> 2046820 INFO  (coreLoadExecutor-4616-thread-1) [    x:collection1] o.a.s.s.SolrIndexSearcher Opening Searcher@447d08[collection1] main
   [junit4]   2> 2046820 INFO  (coreLoadExecutor-4616-thread-1) [    x:collection1] o.a.s.r.ManagedResourceStorage File-based storage initialized to use dir: C:\Users\JenkinsSlave\workspace\Lucene-Solr-5.x-Windows\solr\build\solr-core\test\J0\temp\solr.core.TestLazyCores_28A2B9423857B45-001\tempDir-001\collection1\conf
   [junit4]   2> 2046820 INFO  (coreLoadExecutor-4616-thread-1) [    x:collection1] o.a.s.r.RestManager Initializing RestManager with initArgs: {storageDir=C:\Users\JenkinsSlave\workspace\Lucene-Solr-5.x-Windows\solr\build\solr-core\test\J0\temp\solr.core.TestLazyCores_28A2B9423857B45-001\tempDir-001\collection1\conf}
   [junit4]   2> 2046820 INFO  (coreLoadExecutor-4616-thread-1) [    x:collection1] o.a.s.r.ManagedResourceStorage Reading _rest_managed.json using file:dir=C:\Users\JenkinsSlave\workspace\Lucene-Solr-5.x-Windows\solr\build\solr-core\test\J0\temp\solr.core.TestLazyCores_28A2B9423857B45-001\tempDir-001\collection1\conf
   [junit4]   2> 2046821 INFO  (coreLoadExecutor-4616-thread-1) [    x:collection1] o.a.s.r.RestManager Initializing 0 registered ManagedResources
   [junit4]   2> 2046821 INFO  (coreLoadExecutor-4616-thread-1) [    x:collection1] o.a.s.h.ReplicationHandler Commits will be reserved for  10000
   [junit4]   2> 2046821 INFO  (coreLoadExecutor-4616-thread-1) [    x:collection1] o.a.s.c.CoreContainer registering core: collection1
   [junit4]   2> 2046821 INFO  (searcherExecutor-4625-thread-1-processing-x:collection1) [    x:collection1] o.a.s.c.SolrCore [collection1] Registered new searcher Searcher@447d08[collection1] main{ExitableDirectoryReader(UninvertingDirectoryReader())}
   [junit4]   2> 2046823 INFO  (TEST-TestLazyCores.testCachingLimit-seed#[28A2B9423857B45]) [    ] o.a.s.c.SolrResourceLoader new SolrResourceLoader for directory: 'C:\Users\JenkinsSlave\workspace\Lucene-Solr-5.x-Windows\solr\build\solr-core\test\J0\temp\solr.core.TestLazyCores_28A2B9423857B45-001\tempDir-001\collection3\'
   [junit4]   2> 2046855 INFO  (TEST-TestLazyCores.testCachingLimit-seed#[28A2B9423857B45]) [    ] o.a.s.c.SolrConfig current version of requestparams : -1
   [junit4]   2> 2046869 INFO  (TEST-TestLazyCores.testCachingLimit-seed#[28A2B9423857B45]) [    ] o.a.s.c.SolrConfig Using Lucene MatchVersion: 5.3.0
   [junit4]   2> 2046898 INFO  (TEST-TestLazyCores.testCachingLimit-seed#[28A2B9423857B45]) [    ] o.a.s.c.Config Loaded SolrConfig: solrconfig.xml
   [junit4]   2> 2046899 INFO  (TEST-TestLazyCores.testCachingLimit-seed#[28A2B9423857B45]) [    ] o.a.s.s.IndexSchema Reading Solr Schema from C:\Users\JenkinsSlave\workspace\Lucene-Solr-5.x-Windows\solr\build\solr-core\test\J0\temp\solr.core.TestLazyCores_28A2B9423857B45-001\tempDir-001\collection3\conf\schema.xml
   [junit4]   2> 2046913 INFO  (TEST-TestLazyCores.testCachingLimit-seed#[28A2B9423857B45]) [    ] o.a.s.s.IndexSchema [collectionLazy3] Schema name=tiny
   [junit4]   2> 2046924 INFO  (TEST-TestLazyCores.testCachingLimit-seed#[28A2B9423857B45]) [    ] o.a.s.s.IndexSchema unique key field: id
   [junit4]   2> 2046925 INFO  (TEST-TestLazyCores.testCachingLimit-seed#[28A2B9423857B45]) [    ] o.a.s.c.CoreContainer Creating SolrCore 'collectionLazy3' using configuration from instancedir C:\Users\JenkinsSlave\workspace\Lucene-Solr-5.x-Windows\solr\build\solr-core\test\J0\temp\solr.core.TestLazyCores_28A2B9423857B45-001\tempDir-001\collection3\
   [junit4]   2> 2046925 INFO  (TEST-TestLazyCores.testCachingLimit-seed#[28A2B9423857B45]) [    x:collectionLazy3] o.a.s.c.SolrCore org.apache.solr.core.MockDirectoryFactory
   [junit4]   2> 2046925 INFO  (TEST-TestLazyCores.testCachingLimit-seed#[28A2B9423857B45]) [    x:collectionLazy3] o.a.s.c.SolrCore [[collectionLazy3] ] Opening new SolrCore at [C:\Users\JenkinsSlave\workspace\Lucene-Solr-5.x-Windows\solr\build\solr-core\test\J0\temp\solr.core.TestLazyCores_28A2B9423857B45-001\tempDir-001\collection3\], dataDir=[null]
   [junit4]   2> 2046925 INFO  (TEST-TestLazyCores.testCachingLimit-seed#[28A2B9423857B45]) [    x:collectionLazy3] o.a.s.c.SolrCore JMX monitoring not detected for core: collectionLazy3
   [junit4]   2> 2046926 INFO  (TEST-TestLazyCores.testCachingLimit-seed#[28A2B9423857B45]) [    x:collectionLazy3] o.a.s.c.CachingDirectoryFactory return new directory for C:\Users\JenkinsSlave\workspace\Lucene-Solr-5.x-Windows\solr\build\solr-core\test\J0\temp\solr.core.TestLazyCores_28A2B9423857B45-001\tempDir-001\collection3\data\
   [junit4]   2> 2046926 INFO  (TEST-TestLazyCores.testCachingLimit-seed#[28A2B9423857B45]) [    x:collectionLazy3] o.a.s.c.SolrCore New index directory detected: old=null new=C:\Users\JenkinsSlave\workspace\Lucene-Solr-5.x-Windows\solr\build\solr-core\test\J0\temp\solr.core.TestLazyCores_28A2B9423857B45-001\tempDir-001\collection3\data\index/
   [junit4]   2> 2046926 WARN  (TEST-TestLazyCores.testCachingLimit-seed#[28A2B9423857B45]) [    x:collectionLazy3] o.a.s.c.SolrCore [collectionLazy3] Solr index directory 'C:\Users\JenkinsSlave\workspace\Lucene-Solr-5.x-Windows\solr\build\solr-core\test\J0\temp\solr.core.TestLazyCores_28A2B9423857B45-001\tempDir-001\collection3\data\index' doesn't exist. Creating new index...
   [junit4]   2> 2046926 INFO  (TEST-TestLazyCores.testCachingLimit-seed#[28A2B9423857B45]) [    x:collectionLazy3] o.a.s.c.CachingDirectoryFactory return new directory for C:\Users\JenkinsSlave\workspace\Lucene-Solr-5.x-Windows\solr\build\solr-core\test\J0\temp\solr.core.TestLazyCores_28A2B9423857B45-001\tempDir-001\collection3\data\index
   [junit4]   2> 2046927 INFO  (TEST-TestLazyCores.testCachingLimit-seed#[28A2B9423857B45]) [    x:collectionLazy3] o.a.s.u.RandomMergePolicy RandomMergePolicy wrapping class org.apache.lucene.index.TieredMergePolicy: [TieredMergePolicy: maxMergeAtOnce=19, maxMergeAtOnceExplicit=35, maxMergedSegmentMB=19.5234375, floorSegmentMB=1.3056640625, forceMergeDeletesPctAllowed=18.12429238179398, segmentsPerTier=30.0, maxCFSSegmentSizeMB=8.796093022207999E12, noCFSRatio=0.15519090395442625
   [junit4]   2> 2046927 INFO  (TEST-TestLazyCores.testCachingLimit-seed#[28A2B9423857B45]) [    x:collectionLazy3] o.a.s.c.SolrCore SolrDeletionPolicy.onCommit: commits: num=1
   [junit4]   2> 	commit{dir=MockDirectoryWrapper(RAMDirectory@16f3443 lockFactory=org.apache.lucene.store.SingleInstanceLockFactory@1d03b3e),segFN=segments_1,generation=1}
   [junit4]   2> 2046927 INFO  (TEST-TestLazyCores.testCachingLimit-seed#[28A2B9423857B45]) [    x:collectionLazy3] o.a.s.c.SolrCore newest commit generation = 1
   [junit4]   2> 2046928 INFO  (OldIndexDirectoryCleanupThreadForCore-collectionLazy3) [    x:collectionLazy3] o.a.s.c.SolrCore Looking for old index directories to cleanup for core collectionLazy3 in C:\Users\JenkinsSlave\workspace\Lucene-Solr-5.x-Windows\solr\build\solr-core\test\J0\temp\solr.core.TestLazyCores_28A2B9423857B45-001\tempDir-001\collection3\data\
   [junit4]   2> 2046928 WARN  (OldIndexDirectoryCleanupThreadForCore-collectionLazy3) [    x:collectionLazy3] o.a.s.c.DirectoryFactory C:\Users\JenkinsSlave\workspace\Lucene-Solr-5.x-Windows\solr\build\solr-core\test\J0\temp\solr.core.TestLazyCores_28A2B9423857B45-001\tempDir-001\collection3\data\ does not point to a valid data directory; skipping clean-up of old index directories.
   [junit4]   2> 2046930 INFO  (TEST-TestLazyCores.testCachingLimit-seed#[28A2B9423857B45]) [    x:collectionLazy3] o.a.s.c.SolrCore no updateRequestProcessorChain defined as default, creating implicit default
   [junit4]   2> 2046932 INFO  (TEST-TestLazyCores.testCachingLimit-seed#[28A2B9423857B45]) [    x:collectionLazy3] o.a.s.h.l.XMLLoader xsltCacheLifetimeSeconds=60
   [junit4]   2> 2046934 INFO  (TEST-TestLazyCores.testCachingLimit-seed#[28A2B9423857B45]) [    x:collectionLazy3] o.a.s.h.l.XMLLoader xsltCacheLifetimeSeconds=60
   [junit4]   2> 2046936 INFO  (TEST-TestLazyCores.testCachingLimit-seed#[28A2B9423857B45]) [    x:collectionLazy3] o.a.s.h.l.XMLLoader xsltCacheLifetimeSeconds=60
   [junit4]   2> 2046937 INFO  (TEST-TestLazyCores.testCachingLimit-seed#[28A2B9423857B45]) [    x:collectionLazy3] o.a.s.h.l.XMLLoader xsltCacheLifetimeSeconds=60
   [junit4]   2> 2046939 INFO  (TEST-TestLazyCores.testCachingLimit-seed#[28A2B9423857B45]) [    x:collectionLazy3] o.a.s.c.RequestHandlers Registered paths: /admin/ping,/replication,/admin/mbeans,/get,/update/csv,/update,/select,/update/json/docs,/admin/logging,/admin/threads,/admin/system,/config,/admin/properties,/admin/luke,/admin/file,/admin/segments,/admin/plugins,/schema,/update/json
   [junit4]   2> 2046940 INFO  (TEST-TestLazyCores.testCachingLimit-seed#[28A2B9423857B45]) [    x:collectionLazy3] o.a.s.c.SolrCore Using default statsCache cache: org.apache.solr.search.stats.LocalStatsCache
   [junit4]   2> 2046941 INFO  (TEST-TestLazyCores.testCachingLimit-seed#[28A2B9423857B45]) [    x:collectionLazy3] o.a.s.c.SolrCore Hard AutoCommit: disabled
   [junit4]   2> 2046941 INFO  (TEST-TestLazyCores.testCachingLimit-seed#[28A2B9423857B45]) [    x:collectionLazy3] o.a.s.c.SolrCore Soft AutoCommit: disabled
   [junit4]   2> 2046941 INFO  (TEST-TestLazyCores.testCachingLimit-seed#[28A2B9423857B45]) [    x:collectionLazy3] o.a.s.u.RandomMergePolicy RandomMergePolicy wrapping class org.apache.lucene.index.TieredMergePolicy: [TieredMergePolicy: maxMergeAtOnce=15, maxMergeAtOnceExplicit=50, maxMergedSegmentMB=90.6396484375, floorSegmentMB=0.427734375, forceMergeDeletesPctAllowed=18.938254626283694, segmentsPerTier=14.0, maxCFSSegmentSizeMB=8.796093022207999E12, noCFSRatio=0.8224002404331394
   [junit4]   2> 2046941 INFO  (TEST-TestLazyCores.testCachingLimit-seed#[28A2B9423857B45]) [    x:collectionLazy3] o.a.s.c.SolrCore SolrDeletionPolicy.onInit: commits: num=1
   [junit4]   2> 	commit{dir=MockDirectoryWrapper(RAMDirectory@16f3443 lockFactory=org.apache.lucene.store.SingleInstanceLockFactory@1d03b3e),segFN=segments_1,generation=1}
   [junit4]   2> 2046942 INFO  (TEST-TestLazyCores.testCachingLimit-seed#[28A2B9423857B45]) [    x:collectionLazy3] o.a.s.c.SolrCore newest commit generation = 1
   [junit4]   2> 2046942 INFO  (TEST-TestLazyCores.testCachingLimit-seed#[28A2B9423857B45]) [    x:collectionLazy3] o.a.s.s.SolrIndexSearcher Opening Searcher@19a4621[collectionLazy3] main
   [junit4]   2> 2046942 INFO  (TEST-TestLazyCores.testCachingLimit-seed#[28A2B9423857B45]) [    x:collectionLazy3] o.a.s.r.ManagedResourceStorage File-based storage initialized to use dir: C:\Users\JenkinsSlave\workspace\Lucene-Solr-5.x-Windows\solr\build\solr-core\test\J0\temp\solr.core.TestLazyCores_28A2B9423857B45-001\tempDir-001\collection3\conf
   [junit4]   2> 2046942 INFO  (TEST-TestLazyCores.testCachingLimit-seed#[28A2B9423857B45]) [    x:collectionLazy3] o.a.s.r.RestManager Initializing RestManager with initArgs: {storageDir=C:\Users\JenkinsSlave\workspace\Lucene-Solr-5.x-Windows\solr\build\solr-core\test\J0\temp\solr.core.TestLazyCores_28A2B9423857B45-001\tempDir-001\collection3\conf}
   [junit4]   2> 2046943 INFO  (TEST-TestLazyCores.testCachingLimit-seed#[28A2B9423857B45]) [    x:collectionLazy3] o.a.s.r.ManagedResourceStorage Reading _rest_managed.json using file:dir=C:\Users\JenkinsSlave\workspace\Lucene-Solr-5.x-Windows\solr\build\solr-core\test\J0\temp\solr.core.TestLazyCores_28A2B9423857B45-001\tempDir-001\collection3\conf
   [junit4]   2> 2046943 INFO  (TEST-TestLazyCores.testCachingLimit-seed#[28A2B9423857B45]) [    x:collectionLazy3] o.a.s.r.RestManager Initializing 0 registered ManagedResources
   [junit4]   2> 2046943 INFO  (TEST-TestLazyCores.testCachingLimit-seed#[28A2B9423857B45]) [    x:collectionLazy3] o.a.s.h.ReplicationHandler Commits will be reserved for  10000
   [junit4]   2> 2046943 INFO  (TEST-TestLazyCores.testCachingLimit-seed#[28A2B9423857B45]) [    x:collectionLazy3] o.a.s.c.CoreContainer Opening transient core collectionLazy3
   [junit4]   2> 2046943 INFO  (TEST-TestLazyCores.testCachingLimit-seed#[28A2B9423857B45]) [    x:collectionLazy3] o.a.s.c.CoreContainer registering core: collectionLazy3
   [junit4]   2> 2046943 INFO  (searcherExecutor-4629-thread-1-processing-x:collectionLazy3) [    x:collectionLazy3] o.a.s.c.SolrCore [collectionLazy3] Registered new searcher Searcher@19a4621[collectionLazy3] main{ExitableDirectoryReader(UninvertingDirectoryReader())}
   [junit4]   2> 2046943 INFO  (TEST-TestLazyCores.testCachingLimit-seed#[28A2B9423857B45]) [    x:collectionLazy3] o.a.s.c.SolrResourceLoader new SolrResourceLoader for directory: 'C:\Users\JenkinsSlave\workspace\Lucene-Solr-5.x-Windows\solr\build\solr-core\test\J0\temp\solr.core.TestLazyCores_28A2B9423857B45-001\tempDir-001\collection4\'
   [junit4]   2> 2046970 INFO  (TEST-TestLazyCores.testCachingLimit-seed#[28A2B9423857B45]) [    x:collectionLazy3] o.a.s.c.SolrConfig current version of requestparams : -1
   [junit4]   2> 2046987 INFO  (TEST-TestLazyCores.testCachingLimit-seed#[28A2B9423857B45]) [    x:collectionLazy3] o.a.s.c.SolrConfig Using Lucene MatchVersion: 5.3.0
   [junit4]   2> 2047031 INFO  (TEST-TestLazyCores.testCachingLimit-seed#[28A2B9423857B45]) [    x:collectionLazy3] o.a.s.c.Config Loaded SolrConfig: solrconfig.xml
   [junit4]   2> 2047031 INFO  (TEST-TestLazyCores.testCachingLimit-seed#[28A2B9423857B45]) [    x:collectionLazy3] o.a.s.s.IndexSchema Reading Solr Schema from C:\Users\JenkinsSlave\workspace\Lucene-Solr-5.x-Windows\solr\build\solr-core\test\J0\temp\solr.core.TestLazyCores_28A2B9423857B45-001\tempDir-001\collection4\conf\schema.xml
   [junit4]   2> 2047035 INFO  (TEST-TestLazyCores.testCachingLimit-seed#[28A2B9423857B45]) [    x:collectionLazy3] o.a.s.s.IndexSchema [collectionLazy4] Schema name=tiny
   [junit4]   2> 2047049 INFO  (TEST-TestLazyCores.testCachingLimit-seed#[28A2B9423857B45]) [    x:collectionLazy3] o.a.s.s.IndexSchema unique key field: id
   [junit4]   2> 2047050 INFO  (TEST-TestLazyCores.testCachingLimit-seed#[28A2B9423857B45]) [    x:collectionLazy3] o.a.s.c.CoreContainer Creating SolrCore 'collectionLazy4' using configuration from instancedir C:\Users\JenkinsSlave\workspace\Lucene-Solr-5.x-Windows\solr\build\solr-core\test\J0\temp\solr.core.TestLazyCores_28A2B9423857B45-001\tempDir-001\collection4\
   [junit4]   2> 2047050 INFO  (TEST-TestLazyCores.testCachingLimit-seed#[28A2B9423857B45]) [    x:collectionLazy4] o.a.s.c.SolrCore org.apache.solr.core.MockDirectoryFactory
   [junit4]   2> 2047050 INFO  (TEST-TestLazyCores.testCachingLimit-seed#[28A2B9423857B45]) [    x:collectionLazy4] o.a.s.c.SolrCore [[collectionLazy4] ] Opening new SolrCore at [C:\Users\JenkinsSlave\workspace\Lucene-Solr-5.x-Windows\solr\build\solr-core\test\J0\temp\solr.core.TestLazyCores_28A2B9423857B45-001\tempDir-001\collection4\], dataDir=[null]
   [junit4]   2> 2047050 INFO  (TEST-TestLazyCores.testCachingLimit-seed#[28A2B9423857B45]) [    x:collectionLazy4] o.a.s.c.SolrCore JMX monitoring not detected for core: collectionLazy4
   [junit4]   2> 2047051 INFO  (TEST-TestLazyCores.testCachingLimit-seed#[28A2B9423857B45]) [    x:collectionLazy4] o.a.s.c.CachingDirectoryFactory return new directory for C:\Users\JenkinsSlave\workspace\Lucene-Solr-5.x-Windows\solr\build\solr-core\test\J0\temp\solr.core.TestLazyCores_28A2B9423857B45-001\tempDir-001\collection4\data\
   [junit4]   2> 2047051 INFO  (TEST-TestLazyCores.testCachingLimit-seed#[28A2B9423857B45]) [    x:collectionLazy4] o.a.s.c.SolrCore New index directory detected: old=null new=C:\Users\JenkinsSlave\workspace\Lucene-Solr-5.x-Windows\solr\build\solr-core\test\J0\temp\solr.core.TestLazyCores_28A2B9423857B45-001\tempDir-001\collection4\data\index/
   [junit4]   2> 2047051 WARN  (TEST-TestLazyCores.testCachingLimit-seed#[28A2B9423857B45]) [    x:collectionLazy4] o.a.s.c.SolrCore [collectionLazy4] Solr index directory 'C:\Users\JenkinsSlave\workspace\Lucene-Solr-5.x-Windows\solr\build\solr-core\test\J0\temp\solr.core.TestLazyCores_28A2B9423857B45-001\tempDir-001\collection4\data\index' doesn't exist. Creating new index...
   [junit4]   2> 2047052 INFO  (TEST-TestLazyCores.testCachingLimit-seed#[28A2B9423857B45]) [    x:collectionLazy4] o.a.s.c.CachingDirectoryFactory return new directory for C:\Users\JenkinsSlave\workspace\Lucene-Solr-5.x-Windows\solr\build\solr-core\test\J0\temp\solr.core.TestLazyCores_28A2B9423857B45-001\tempDir-001\collection4\data\index
   [junit4]   2> 2047052 INFO  (TEST-TestLazyCores.testCachingLimit-seed#[28A2B9423857B45]) [    x:collectionLazy4] o.a.s.u.RandomMergePolicy RandomMergePolicy wrapping class org.apache.lucene.index.AlcoholicMergePolicy: [AlcoholicMergePolicy: minMergeSize=0, mergeFactor=10, maxMergeSize=641050624, maxMergeSizeForForcedMerge=9223372036854775807, calibrateSizeByDeletes=true, maxMergeDocs=2147483647, maxCFSSegmentSizeMB=8.796093022207999E12, noCFSRatio=0.1]
   [junit4]   2> 2047052 INFO  (TEST-TestLazyCores.testCachingLimit-seed#[28A2B9423857B45]) [    x:collectionLazy4] o.a.s.c.SolrCore SolrDeletionPolicy.onCommit: commits: num=1
   [junit4]   2> 	commit{dir=MockDirectoryWrapper(RAMDirectory@11f458 lockFactory=org.apache.lucene.store.SingleInstanceLockFactory@c0e158),segFN=segments_1,generation=1}
   [junit4]   2> 2047052 INFO  (TEST-TestLazyCores.testCachingLimit-seed#[28A2B9423857B45]) [    x:collectionLazy4] o.a.s.c.SolrCore newest commit generation = 1
   [junit4]   2> 2047056 INFO  (TEST-TestLazyCores.testCachingLimit-seed#[28A2B9423857B45]) [    x:collectionLazy4] o.a.s.c.SolrCore no updateRequestProcessorChain defined as default, creating implicit default
   [junit4]   2> 2047058 INFO  (TEST-TestLazyCores.testCachingLimit-seed#[28A2B9423857B45]) [    x:collectionLazy4] o.a.s.h.l.XMLLoader xsltCacheLifetimeSeconds=60
   [junit4]   2> 2047060 INFO  (TEST-TestLazyCores.testCachingLimit-seed#[28A2B9423857B45]) [    x:collectionLazy4] o.a.s.h.l.XMLLoader xsltCacheLifetimeSeconds=60
   [junit4]   2> 2047061 INFO  (TEST-TestLazyCores.testCachingLimit-seed#[28A2B9423857B45]) [    x:collectionLazy4] o.a.s.h.l.XMLLoader xsltCacheLifetimeSeconds=60
   [junit4]   2> 2047063 INFO  (TEST-TestLazyCores.testCachingLimit-seed#[28A2B9423857B45]) [    x:collectionLazy4] o.a.s.h.l.XMLLoader xsltCacheLifetimeSeconds=60
   [junit4]   2> 2047065 INFO  (TEST-TestLazyCores.testCachingLimit-seed#[28A2B9423857B45]) [    x:collectionLazy4] o.a.s.c.RequestHandlers Registered paths: /admin/ping,/replication,/admin/mbeans,/get,/update/csv,/update,/select,/update/json/docs,/admin/logging,/admin/threads,/admin/system,/config,/admin/properties,/admin/luke,/admin/file,/admin/segments,/admin/plugins,/schema,/update/json
   [junit4]   2> 2047066 INFO  (TEST-TestLazyCores.testCachingLimit-seed#[28A2B9423857B45]) [    x:collectionLazy4] o.a.s.c.SolrCore Using default statsCache cache: org.apache.solr.search.stats.LocalStatsCache
   [junit4]   2> 2047067 INFO  (OldIndexDirectoryCleanupThreadForCore-collectionLazy4) [    x:collectionLazy4] o.a.s.c.SolrCore Looking for old index directories to cleanup for core collectionLazy4 in C:\Users\JenkinsSlave\workspace\Lucene-Solr-5.x-Windows\solr\build\solr-core\test\J0\temp\solr.core.TestLazyCores_28A2B9423857B45-001\tempDir-001\collection4\data\
   [junit4]   2> 2047067 WARN  (OldIndexDirectoryCleanupThreadForCore-collectionLazy4) [    x:collectionLazy4] o.a.s.c.DirectoryFactory C:\Users\JenkinsSlave\workspace\Lucene-Solr-5.x-Windows\solr\build\solr-core\test\J0\temp\solr.core.TestLazyCores_28A2B9423857B45-001\tempDir-001\collection4\data\ does not point to a valid data directory; skipping clean-up of old index directories.
   [junit4]   2> 2047067 INFO  (TEST-TestLazyCores.testCachingLimit-seed#[28A2B9423857B45]) [    x:collectionLazy4] o.a.s.c.SolrCore Hard AutoCommit: disabled
   [junit4]   2> 2047067 INFO  (TEST-TestLazyCores.testCachingLimit-seed#[28A2B9423857B45]) [    x:collectionLazy4] o.a.s.c.SolrCore Soft AutoCommit: disabled
   [junit4]   2> 2047068 INFO  (TEST-TestLazyCores.testCachingLimit-seed#[28A2B9423857B45]) [    x:collectionLazy4] o.a.s.u.RandomMergePolicy RandomMergePolicy wrapping class org.apache.lucene.index.LogByteSizeMergePolicy: [LogByteSizeMergePolicy: minMergeSize=1677721, mergeFactor=14, maxMergeSize=2147483648, maxMergeSizeForForcedMerge=9223372036854775807, calibrateSizeByDeletes=false, maxMergeDocs=2147483647, maxCFSSegmentSizeMB=8.796093022207999E12, noCFSRatio=0.0]
   [junit4]   2> 2047068 INFO  (TEST-TestLazyCores.testCachingLimit-seed#[28A2B9423857B45]) [    x:collectionLazy4] o.a.s.c.SolrCore SolrDeletionPolicy.onInit: commits: num=1
   [junit4]   2> 	commit{dir=MockDirectoryWrapper(RAMDirectory@11f458 lockFactory=org.apache.lucene.store.SingleInstanceLockFactory@c0e158),segFN=segments_1,generation=1}
   [junit4]   2> 2047068 INFO  (TEST-TestLazyCores.testCachingLimit-seed#[28A2B9423857B45]) [    x:collectionLazy4] o.a.s.c.SolrCore newest commit generation = 1
   [junit4]   2> 2047068 INFO  (TEST-TestLazyCores.testCachingLimit-seed#[28A2B9423857B45]) [    x:collectionLazy4] o.a.s.s.SolrIndexSearcher Opening Searcher@f48452[collectionLazy4] main
   [junit4]   2> 2047068 INFO  (TEST-TestLazyCores.testCachingLimit-seed#[28A2B9423857B45]) [    x:collectionLazy4] o.a.s.r.ManagedResourceStorage File-based storage initialized to use dir: C:\Users\JenkinsSlave\workspace\Lucene-Solr-5.x-Windows\solr\build\solr-core\test\J0\temp\solr.core.TestLazyCores_28A2B9423857B45-001\tempDir-001\collection4\conf
   [junit4]   2> 2047069 INFO  (TEST-TestLazyCores.testCachingLimit-seed#[28A2B9423857B45]) [    x:collectionLazy4] o.a.s.r.RestManager Initializing RestManager with initArgs: {storageDir=C:\Users\JenkinsSlave\workspace\Lucene-Solr-5.x-Windows\solr\build\solr-core\test\J0\temp\solr.core.TestLazyCores_28A2B9423857B45-001\tempDir-001\collection4\conf}
   [junit4]   2> 2047069 INFO  (TEST-TestLazyCores.testCachingLimit-seed#[28A2B9423857B45]) [    x:collectionLazy4] o.a.s.r.ManagedResourceStorage Reading _rest_managed.json using file:dir=C:\Users\JenkinsSlave\workspace\Lucene-Solr-5.x-Windows\solr\build\solr-core\test\J0\temp\solr.core.TestLazyCores_28A2B9423857B45-001\tempDir-001\collection4\conf
   [junit4]   2> 2047070 INFO  (TEST-TestLazyCores.testCachingLimit-seed#[28A2B9423857B45]) [    x:collectionLazy4] o.a.s.r.RestManager Initializing 0 registered ManagedResources
   [junit4]   2> 2047070 INFO  (TEST-TestLazyCores.testCachingLimit-seed#[28A2B9423857B45]) [    x:collectionLazy4] o.a.s.h.ReplicationHandler Commits will be reserved for  10000
   [junit4]   2> 2047070 INFO  (TEST-TestLazyCores.testCachingLimit-seed#[28A2B9423857B45]) [    x:collectionLazy4] o.a.s.c.CoreContainer registering core: collectionLazy4
   [junit4]   2> 2047071 INFO  (TEST-TestLazyCores.testCachingLimit-seed#[28A2B9423857B45]) [    x:collectionLazy4] o.a.s.c.SolrResourceLoader new SolrResourceLoader for directory: 'C:\Users\JenkinsSlave\workspace\Lucene-Solr-5.x-Windows\solr\build\solr-core\test\J0\temp\solr.core.TestLazyCores_28A2B9423857B45-001\tempDir-001\collection6\'
   [junit4]   2> 2047086 INFO  (searcherExecutor-4633-thread-1-processing-x:collectionLazy4) [    x:collectionLazy4] o.a.s.c.SolrCore [collectionLazy4] Registered new searcher Searcher@f48452[collectionLazy4] main{ExitableDirectoryReader(UninvertingDirectoryReader())}
   [junit4]   2> 2047091 INFO  (TEST-TestLazyCores.testCachingLimit-seed#[28A2B9423857B45]) [    x:collectionLazy4] o.a.s.c.SolrConfig current version of requestparams : -1
   [junit4]   2> 2047106 INFO  (TEST-TestLazyCores.testCachingLimit-seed#[28A2B9423857B45]) [    x:collectionLazy4] o.a.s.c.SolrConfig Using Lucene MatchVersion: 5.3.0
   [junit4]   2> 2047133 INFO  (TEST-TestLazyCores.testCachingLimit-seed#[28A2B9423857B45]) [    x:collectionLazy4] o.a.s.c.Config Loaded SolrConfig: solrconfig.xml
   [junit4]   2> 2047134 INFO  (TEST-TestLazyCores.testCachingLimit-seed#[28A2B9423857B45]) [    x:collectionLazy4] o.a.s.s.IndexSchema Reading Solr Schema from C:\Users\JenkinsSlave\workspace\Lucene-Solr-5.x-Windows\solr\build\solr-core\test\J0\temp\solr.core.TestLazyCores_28A2B9423857B45-001\tempDir-001\collection6\conf\schema.xml
   [junit4]   2> 2047139 INFO  (TEST-TestLazyCores.testCachingLimit-seed#[28A2B9423857B45]) [    x:collectionLazy4] o.a.s.s.IndexSchema [collectionLazy6] Schema name=tiny
   [junit4]   2> 2047148 INFO  (TEST-TestLazyCores.testCachingLimit-seed#[28A2B9423857B45]) [    x:collectionLazy4] o.a.s.s.IndexSchema unique key field: id
   [junit4]   2> 2047149 INFO  (TEST-TestLazyCores.testCachingLimit-seed#[28A2B9423857B45]) [    x:collectionLazy4] o.a.s.c.CoreContainer Creating SolrCore 'collectionLazy6' using configuration from instancedir C:\Users\JenkinsSlave\workspace\Lucene-Solr-5.x-Windows\solr\build\solr-core\test\J0\temp\solr.core.TestLazyCores_28A2B9423857B45-001\tempDir-001\collection6\
   [junit4]   2> 2047149 INFO  (TEST-TestLazyCores.testCachingLimit-seed#[28A2B9423857B45]) [    x:collectionLazy6] o.a.s.c.SolrCore org.apache.solr.core.MockDirectoryFactory
   [junit4]   2> 2047150 INFO  (TEST-TestLazyCores.testCachingLimit-seed#[28A2B9423857B45]) [    x:collectionLazy6] o.a.s.c.SolrCore [[collectionLazy6] ] Opening new SolrCore at [C:\Users\JenkinsSlave\workspace\Lucene-Solr-5.x-Windows\solr\build\solr-core\test\J0\temp\solr.core.TestLazyCores_28A2B9423857B45-001\tempDir-001\collection6\], dataDir=[null]
   [junit4]   2> 2047150 INFO  (TEST-TestLazyCores.testCachingLimit-seed#[28A2B9423857B45]) [    x:collectionLazy6] o.a.s.c.SolrCore JMX monitoring not detected for core: collectionLazy6
   [junit4]   2> 2047150 INFO  (TEST-TestLazyCores.testCachingLimit-seed#[28A2B9423857B45]) [    x:collectionLazy6] o.a.s.c.CachingDirectoryFactory return new directory for C:\Users\JenkinsSlave\workspace\Lucene-Solr-5.x-Windows\solr\build\solr-core\test\J0\temp\solr.core.TestLazyCores_28A2B9423857B45-001\tempDir-001\collection6\data\
   [junit4]   2> 2047152 INFO  (TEST-TestLazyCores.testCachingLimit-seed#[28A2B9423857B45]) [    x:collectionLazy6] o.a.s.c.SolrCore New index directory detected: old=null new=C:\Users\JenkinsSlave\workspace\Lucene-Solr-5.x-Windows\solr\build\solr-core\test\J0\temp\solr.core.TestLazyCores_28A2B9423857B45-001\tempDir-001\collection6\data\index/
   [junit4]   2> 2047152 WARN  (TEST-TestLazyCores.testCachingLimit-seed#[28A2B9423857B45]) [    x:collectionLazy6] o.a.s.c.SolrCore [collectionLazy6] Solr index directory 'C:\Users\JenkinsSlave\workspace\Lucene-Solr-5.x-Windows\solr\build\solr-core\test\J0\temp\solr.core.TestLazyCores_28A2B9423857B45-001\tempDir-001\collection6\data\index' doesn't exist. Creating new index...
   [junit4]   2> 2047153 INFO  (TEST-TestLazyCores.testCachingLimit-seed#[28A2B9423857B45]) [    x:collectionLazy6] o.a.s.c.CachingDirectoryFactory return new directory for C:\Users\JenkinsSlave\workspace\Lucene-Solr-5.x-Windows\solr\build\solr-core\test\J0\temp\solr.core.TestLazyCores_28A2B9423857B45-001\tempDir-001\collection6\data\index
   [junit4]   2> 2047153 INFO  (TEST-TestLazyCores.testCachingLimit-seed#[28A2B9423857B45]) [    x:collectionLazy6] o.a.s.u.RandomMergePolicy RandomMergePolicy wrapping class org.apache.lucene.index.TieredMergePolicy: [TieredMergePolicy: maxMergeAtOnce=20, maxMergeAtOnceExplicit=36, maxMergedSegmentMB=62.1064453125, floorSegmentMB=1.720703125, forceMergeDeletesPctAllowed=15.350137271110336, segmentsPerTier=28.0, maxCFSSegmentSizeMB=8.796093022207999E12, noCFSRatio=0.73629265146099
   [junit4]   2> 2047154 INFO  (TEST-TestLazyCores.testCachingLimit-seed#[28A2B9423857B45]) [    x:collectionLazy6] o.a.s.c.SolrCore SolrDeletionPolicy.onCommit: commits: num=1
   [junit4]   2> 	commit{dir=MockDirectoryWrapper(RAMDirectory@196d376 lockFactory=org.apache.lucene.store.SingleInstanceLockFactory@114f620),segFN=segments_1,generation=1}
   [junit4]   2> 2047154 INFO  (TEST-TestLazyCores.testCachingLimit-seed#[28A2B9423857B45]) [    x:collectionLazy6] o.a.s.c.SolrCore newest commit generation = 1
   [junit4]   2> 2047156 INFO  (TEST-TestLazyCores.testCachingLimit-seed#[28A2B9423857B45]) [    x:collectionLazy6] o.a.s.c.SolrCore no updateRequestProcessorChain defined as default, creating implicit default
   [junit4]   2> 2047160 INFO  (OldIndexDirectoryCleanupThreadForCore-collectionLazy6) [    x:collectionLazy6] o.a.s.c.SolrCore Looking for old index directories to cleanup for core collectionLazy6 in C:\Users\JenkinsSlave\workspace\Lucene-Solr-5.x-Windows\solr\build\solr-core\test\J0\temp\solr.core.TestLazyCores_28A2B9423857B45-001\tempDir-001\collection6\data\
   [junit4]   2> 2047162 INFO  (TEST-TestLazyCores.testCachingLimit-seed#[28A2B9423857B45]) [    x:collectionLazy6] o.a.s.h.l.XMLLoader xsltCacheLifetimeSeconds=60
   [junit4]   2> 2047163 INFO  (TEST-TestLazyCores.testCachingLimit-seed#[28A2B9423857B45]) [    x:collectionLazy6] o.a.s.h.l.XMLLoader xsltCacheLifetimeSeconds=60
   [junit4]   2> 2047165 INFO  (TEST-TestLazyCores.testCachingLimit-seed#[28A2B9423857B45]) [    x:collectionLazy6] o.a.s.h.l.XMLLoader xsltCacheLifetimeSeconds=60
   [junit4]   2> 2047167 INFO  (TEST-TestLazyCores.testCachingLimit-seed#[28A2B9423857B45]) [    x:collectionLazy6] o.a.s.h.l.XMLLoader xsltCacheLifetimeSeconds=60
   [junit4]   2> 2047169 INFO  (TEST-TestLazyCores.testCachingLimit-seed#[28A2B9423857B45]) [    x:collectionLazy6] o.a.s.c.RequestHandlers Registered paths: /admin/ping,/replication,/admin/mbeans,/get,/update/csv,/update,/select,/update/json/docs,/admin/logging,/admin/threads,/admin/system,/config,/admin/properties,/admin/luke,/admin/file,/admin/segments,/admin/plugins,/schema,/update/json
   [junit4]   2> 2047170 INFO  (TEST-TestLazyCores.testCachingLimit-seed#[28A2B9423857B45]) [    x:collectionLazy6] o.a.s.c.SolrCore Using default statsCache cache: org.apache.solr.search.stats.LocalStatsCache
   [junit4]   2> 2047171 WARN  (OldIndexDirectoryCleanupThreadForCore-collectionLazy6) [    x:collectionLazy6] o.a.s.c.DirectoryFactory C:\Users\JenkinsSlave\workspace\Lucene-Solr-5.x-Windows\solr\build\solr-core\test\J0\temp\solr.core.TestLazyCores_28A2B9423857B45-001\tempDir-001\collection6\data\ does not point to a valid data directory; skipping clean-up of old index directories.
   [junit4]   2> 2047171 INFO  (TEST-TestLazyCores.testCachingLimit-seed#[28A2B9423857B45]) [    x:collectionLazy6] o.a.s.c.SolrCore Hard AutoCommit: disabled
   [junit4]   2> 2047171 INFO  (TEST-TestLazyCores.testCachingLimit-seed#[28A2B9423857B45]) [    x:collectionLazy6] o.a.s.c.SolrCore Soft AutoCommit: disabled
   [junit4]   2> 2047171 INFO  (TEST-TestLazyCores.testCachingLimit-seed#[28A2B9423857B45]) [    x:collectionLazy6] o.a.s.u.RandomMergePolicy RandomMergePolicy wrapping class org.apache.lucene.index.TieredMergePolicy: [TieredMergePolicy: maxMergeAtOnce=28, maxMergeAtOnceExplicit=33, maxMergedSegmentMB=61.84765625, floorSegmentMB=1.734375, forceMergeDeletesPctAllowed=0.145249207561301, segmentsPerTier=28.0, maxCFSSegmentSizeMB=8.796093022207999E12, noCFSRatio=0.3812312373468214
   [junit4]   2> 2047172 INFO  (TEST-TestLazyCores.testCachingLimit-seed#[28A2B9423857B45]) [    x:collectionLazy6] o.a.s.c.SolrCore SolrDeletionPolicy.onInit: commits: num=1
   [junit4]   2> 	commit{dir=MockDirectoryWrapper(RAMDirectory@196d376 lockFactory=org.apache.lucene.store.SingleInstanceLockFactory@114f620),segFN=segments_1,generation=1}
   [junit4]   2> 2047172 INFO  (TEST-TestLazyCores.testCachingLimit-seed#[28A2B9423857B45]) [    x:collectionLazy6] o.a.s.c.SolrCore newest commit generation = 1
   [junit4]   2> 2047172 INFO  (TEST-TestLazyCores.testCachingLimit-seed#[28A2B9423857B45]) [    x:collectionLazy6] o.a.s.s.SolrIndexSearcher Opening Searcher@1d4a826[collectionLazy6] main
   [junit4]   2> 2047173 INFO  (TEST-TestLazyCores.testCachingLimit-seed#[28A2B9423857B45]) [    x:collectionLazy6] o.a.s.r.ManagedResourceStorage File-based storage initialized to use dir: C:\Users\JenkinsSlave\workspace\Lucene-Solr-5.x-Windows\solr\build\solr-core\test\J0\temp\solr.core.TestLazyCores_28A2B9423857B45-001\tempDir-001\collection6\conf
   [junit4]   2> 2047173 INFO  (TEST-TestLazyCores.testCachingLimit-seed#[28A2B9423857B45]) [    x:collectionLazy6] o.a.s.r.RestManager Initializing RestManager with initArgs: {storageDir=C:\Users\JenkinsSlave\workspace\Lucene-Solr-5.x-Windows\solr\build\solr-core\test\J0\temp\solr.core.TestLazyCores_28A2B9423857B45-001\tempDir-001\collection6\conf}
   [junit4]   2> 2047173 INFO  (TEST-TestLazyCores.testCachingLimit-seed#[28A2B9423857B45]) [    x:collectionLazy6] o.a.s.r.ManagedResourceStorage Reading _rest_managed.json using file:dir=C:\Users\JenkinsSlave\workspace\Lucene-Solr-5.x-Windows\solr\build\solr-core\test\J0\temp\solr.core.TestLazyCores_28A2B9423857B45-001\tempDir-001\collection6\conf
   [junit4]   2> 2047173 INFO  (TEST-TestLazyCores.testCachingLimit-seed#[28A2B9423857B45]) [    x:collectionLazy6] o.a.s.r.RestManager Initializing 0 registered ManagedResources
   [junit4]   2> 2047173 INFO  (TEST-TestLazyCores.testCachingLimit-seed#[28A2B9423857B45]) [    x:collectionLazy6] o.a.s.h.ReplicationHandler Commits will be reserved for  10000
   [junit4]   2> 2047173 INFO  (TEST-TestLazyCores.testCachingLimit-seed#[28A2B9423857B45]) [    x:collectionLazy6] o.a.s.c.CoreContainer Opening transient core collectionLazy6
   [junit4]   2> 2047173 INFO  (TEST-TestLazyCores.testCachingLimit-seed#[28A2B9423857B45]) [    x:collectionLazy6] o.a.s.c.CoreContainer registering core: collectionLazy6
   [junit4]   2> 2047174 INFO  (TEST-TestLazyCores.testCachingLimit-seed#[28A2B9423857B45]) [    x:collectionLazy6] o.a.s.c.SolrResourceLoader new SolrResourceLoader for directory: 'C:\Users\JenkinsSlave\workspace\Lucene-Solr-5.x-Windows\solr\build\solr-core\test\J0\temp\solr.core.TestLazyCores_28A2B9423857B45-001\tempDir-001\collection7\'
   [junit4]   2> 2047177 INFO  (searcherExecutor-4637-thread-1-processing-x:collectionLazy6) [    x:collectionLazy6] o.a.s.c.SolrCore [collectionLazy6] Registered new searcher Searcher@1d4a826[collectionLazy6] main{ExitableDirectoryReader(UninvertingDirectoryReader())}
   [junit4]   2> 2047209 INFO  (TEST-TestLazyCores.testCachingLimit-seed#[28A2B9423857B45]) [    x:collectionLazy6] o.a.s.c.SolrConfig current version of requestparams : -1
   [junit4]   2> 2047223 INFO  (TEST-TestLazyCores.testCachingLimit-seed#[28A2B9423857B45]) [    x:collectionLazy6] o.a.s.c.SolrConfig Using Lucene MatchVersion: 5.3.0
   [junit4]   2> 2047250 INFO  (TEST-TestLazyCores.testCachingLimit-seed#[28A2B9423857B45]) [    x:collectionLazy6] o.a.s.c.Config Loaded SolrConfig: solrconfig.xml
   [junit4]   2> 2047251 INFO  (TEST-TestLazyCores.testCachingLimit-seed#[28A2B9423857B45]) [    x:collectionLazy6] o.a.s.s.IndexSchema Reading Solr Schema from C:\Users\JenkinsSlave\workspace\Lucene-Solr-5.x-Windows\solr\build\solr-core\test\J0\temp\solr.core.TestLazyCores_28A2B9423857B45-001\tempDir-001\collection7\conf\schema.xml
   [junit4]   2> 2047260 INFO  (TEST-TestLazyCores.testCachingLimit-seed#[28A2B9423857B45]) [    x:collectionLazy6] o.a.s.s.IndexSchema [collectionLazy7] Schema name=tiny
   [junit4]   2> 2047270 INFO  (TEST-TestLazyCores.testCachingLimit-seed#[28A2B9423857B45]) [    x:collectionLazy6] o.a.s.s.IndexSchema unique key field: id
   [junit4]   2> 2047271 INFO  (TEST-TestLazyCores.testCachingLimit-seed#[28A2B9423857B45]) [    x:collectionLazy6] o.a.s.c.CoreContainer Creating SolrCore 'collectionLazy7' using configuration from instancedir C:\Users\JenkinsSlave\workspace\Lucene-Solr-5.x-Windows\solr\build\solr-core\test\J0\temp\solr.core.TestLazyCores_28A2B9423857B45-001\tempDir-001\collection7\
   [junit4]   2> 2047271 INFO  (TEST-TestLazyCores.testCachingLimit-seed#[28A2B9423857B45]) [    x:collectionLazy7] o.a.s.c.SolrCore org.apache.solr.core.MockDirectoryFactory
   [junit4]   2> 2047271 INFO  (TEST-TestLazyCores.testCachingLimit-seed#[28A2B9423857B45]) [    x:collectionLazy7] o.a.s.c.SolrCore [[collectionLazy7] ] Opening new SolrCore at [C:\Users\JenkinsSlave\workspace\Lucene-Solr-5.x-Windows\solr\build\solr-core\test\J0\temp\solr.core.TestLazyCores_28A2B9423857B45-001\tempDir-001\collection7\], dataDir=[null]
   [junit4]   2> 2047271 INFO  (TEST-TestLazyCores.testCachingLimit-seed#[28A2B9423857B45]) [    x:collectionLazy7] o.a.s.c.SolrCore JMX monitoring not detected for core: collectionLazy7
   [junit4]   2> 2047272 INFO  (TEST-TestLazyCores.testCachingLimit-seed#[28A2B9423857B45]) [    x:collectionLazy7] o.a.s.c.CachingDirectoryFactory return new directory for C:\Users\JenkinsSlave\workspace\Lucene-Solr-5.x-Windows\solr\build\solr-core\test\J0\temp\solr.core.TestLazyCores_28A2B9423857B45-001\tempDir-001\collection7\data\
   [junit4]   2> 2047272 INFO  (TEST-TestLazyCores.testCachingLimit-seed#[28A2B9423857B45]) [    x:collectionLazy7] o.a.s.c.SolrCore New index directory detected: old=null new=C:\Users\JenkinsSlave\workspace\Lucene-Solr-5.x-Windows\solr\build\solr-core\test\J0\temp\solr.core.TestLazyCores_28A2B9423857B45-001\tempDir-001\collection7\data\index/
   [junit4]   2> 2047272 WARN  (TEST-TestLazyCores.testCachingLimit-seed#[28A2B9423857B45]) [    x:collectionLazy7] o.a.s.c.SolrCore [collectionLazy7] Solr index directory 'C:\Users\JenkinsSlave\workspace\Lucene-Solr-5.x-Windows\solr\build\solr-core\test\J0\temp\solr.core.TestLazyCores_28A2B9423857B45-001\tempDir-001\collection7\data\index' doesn't exist. Creating new index...
   [junit4]   2> 2047272 INFO  (TEST-TestLazyCores.testCachingLimit-seed#[28A2B9423857B45]) [    x:collectionLazy7] o.a.s.c.CachingDirectoryFactory return new directory for C:\Users\JenkinsSlave\workspace\Lucene-Solr-5.x-Windows\solr\build\solr-core\test\J0\temp\solr.core.TestLazyCores_28A2B9423857B45-001\tempDir-001\collection7\data\index
   [junit4]   2> 2047273 INFO  (TEST-TestLazyCores.testCachingLimit-seed#[28A2B9423857B45]) [    x:collectionLazy7] o.a.s.u.RandomMergePolicy RandomMergePolicy wrapping class org.apache.lucene.index.AlcoholicMergePolicy: [AlcoholicMergePolicy: minMergeSize=0, mergeFactor=10, maxMergeSize=1531284717, maxMergeSizeForForcedMerge=9223372036854775807, calibrateSizeByDeletes=true, maxMergeDocs=2147483647, maxCFSSegmentSizeMB=8.796093022207999E12, noCFSRatio=0.1]
   [junit4]   2> 2047273 INFO  (TEST-TestLazyCores.testCachingLimit-seed#[28A2B9423857B45]) [    x:collectionLazy7] o.a.s.c.SolrCore SolrDeletionPolicy.onCommit: commits: num=1
   [junit4]   2> 	commit{dir=MockDirectoryWrapper(RAMDirectory@1e797ae lockFactory=org.apache.lucene.store.SingleInstanceLockFactory@19758e0),segFN=segments_1,generation=1}
   [junit4]   2> 2047273 INFO  (TEST-TestLazyCores.testCachingLimit-seed#[28A2B9423857B45]) [    x:collectionLazy7] o.a.s.c.SolrCore newest commit generation = 1
   [junit4]   2> 2047276 INFO  (TEST-TestLazyCores.testCachingLimit-seed#[28A2B9423857B45]) [    x:collectionLazy7] o.a.s.c.SolrCore no updateRequestProcessorChain defined as default, creating implicit default
   [junit4]   2> 2047278 INFO  (TEST-TestLazyCores.testCachingLimit-seed#[28A2B9423857B45]) [    x:collectionLazy7] o.a.s.h.l.XMLLoader xsltCacheLifetimeSeconds=60
   [junit4]   2> 2047279 INFO  (TEST-TestLazyCores.testCachingLimit-seed#[28A2B9423857B45]) [    x:collectionLazy7] o.a.s.h.l.XMLLoader xsltCacheLifetimeSeconds=60
   [junit4]   2> 2047281 INFO  (TEST-TestLazyCores.testCachingLimit-seed#[28A2B9423857B45]) [    x:collectionLazy7] o.a.s.h.l.XMLLoader xsltCacheLifetimeSeconds=60
   [junit4]   2> 2047282 INFO  (TEST-TestLazyCores.testCachingLimit-seed#[28A2B9423857B45]) [    x:collectionLazy7] o.a.s.h.l.XMLLoader xsltCacheLifetimeSeconds=60
   [junit4]   2> 2047282 INFO  (OldIndexDirectoryCleanupThreadForCore-collectionLazy7) [    x:collectionLazy7] o.a.s.c.SolrCore Looking for old index directories to cleanup for core collectionLazy7 in C:\Users\JenkinsSlave\workspace\Lucene-Solr-5.x-Windows\solr\build\solr-core\test\J0\temp\solr.core.TestLazyCores_28A2B9423857B45-001\tempDir-001\collection7\data\
   [junit4]   2> 2047283 INFO  (TEST-TestLazyCores.testCachingLimit-seed#[28A2B9423857B45]) [    x:collectionLazy7] o.a.s.c.RequestHandlers Registered paths: /admin/ping,/replication,/admin/mbeans,/get,/update/csv,/update,/select,/update/json/docs,/admin/logging,/admin/threads,/admin/system,/config,/admin/properties,/admin/luke,/admin/file,/admin/segments,/admin/plugins,/schema,/update/json
   [junit4]   2> 2047285 INFO  (TEST-TestLazyCores.testCachingLimit-seed#[28A2B9423857B45]) [    x:collectionLazy7] o.a.s.c.SolrCore Using default statsCache cache: org.apache.solr.search.stats.LocalStatsCache
   [junit4]   2> 2047286 INFO  (TEST-TestLazyCores.testCachingLimit-seed#[28A2B9423857B45]) [    x:collectionLazy7] o.a.s.c.SolrCore Hard AutoCommit: disabled
   [junit4]   2> 2047286 INFO  (TEST-TestLazyCores.testCachingLimit-seed#[28A2B9423857B45]) [    x:collectionLazy7] o.a.s.c.SolrCore Soft AutoCommit: disabled
   [junit4]   2> 2047286 INFO  (TEST-TestLazyCores.testCachingLimit-seed#[28A2B9423857B45]) [    x:collectionLazy7] o.a.s.u.RandomMergePolicy RandomMergePolicy wrapping class org.apache.lucene.index.LogDocMergePolicy: [LogDocMergePolicy: minMergeSize=1000, mergeFactor=47, maxMergeSize=9223372036854775807, maxMergeSizeForForcedMerge=9223372036854775807, calibrateSizeByDeletes=true, maxMergeDocs=2147483647, maxCFSSegmentSizeMB=8.796093022207999E12, noCFSRatio=0.8016008330907407]
   [junit4]   2> 2047286 WARN  (OldIndexDirectoryCleanupThreadForCore-collectionLazy7) [    x:collectionLazy7] o.a.s.c.DirectoryFactory C:\Users\JenkinsSlave\workspace\Lucene-Solr-5.x-Windows\solr\build\solr-core\test\J0\temp\solr.core.TestLazyCores_28A2B9423857B45-001\tempDir-001\collection7\data\ does not point to a valid data directory; skipping clean-up of old index directories.
   [junit4]   2> 2047287 INFO  (TEST-TestLazyCores.testCachingLimit-seed#[28A2B9423857B45]) [    x:collectionLazy7] o.a.s.c.SolrCore SolrDeletionPolicy.onInit: commits: num=1
   [junit4]   2> 	commit{dir=MockDirectoryWrapper(RAMDirectory@1e797ae lockFactory=org.apache.lucene.store.SingleInstanceLockFactory@19758e0),segFN=segments_1,generation=1}
   [junit4]   2> 2047287 INFO  (TEST-TestLazyCores.testCachingLimit-seed#[28A2B9423857B45]) [    x:collectionLazy7] o.a.s.c.SolrCore newest commit generation = 1
   [junit4]   2> 2047287 INFO  (TEST-TestLazyCores.testCachingLimit-seed#[28A2B9423857B45]) [    x:collectionLazy7] o.a.s.s.SolrIndexSearcher Opening Searcher@c8540c[collectionLazy7] main
   [junit4]   2> 2047288 INFO  (TEST-TestLazyCores.testCachingLimit-seed#[28A2B9423857B45]) [    x:collectionLazy7] o.a.s.r.ManagedResourceStorage File-based storage initialized to use dir: C:\Users\JenkinsSlave\workspace\Lucene-Solr-5.x-Windows\solr\build\solr-core\test\J0\temp\solr.core.TestLazyCores_28A2B9423857B45-001\tempDir-001\collection7\conf
   [junit4]   2> 2047288 INFO  (TEST-TestLazyCores.testCachingLimit-seed#[28A2B9423857B45]) [    x:collectionLazy7] o.a.s.r.RestManager Initializing RestManager with initArgs: {storageDir=C:\Users\JenkinsSlave\workspace\Lucene-Solr-5.x-Windows\solr\build\solr-core\test\J0\temp\solr.core.TestLazyCores_28A2B9423857B45-001\tempDir-001\collection7\conf}
   [junit4]   2> 2047288 INFO  (TEST-TestLazyCores.testCachingLimit-seed#[28A2B9423857B45]) [    x:collectionLazy7] o.a.s.r.ManagedResourceStorage Reading _rest_managed.json using file:dir=C:\Users\JenkinsSlave\workspace\Lucene-Solr-5.x-Windows\solr\build\solr-core\test\J0\temp\solr.core.TestLazyCores_28A2B9423857B45-001\tempDir-001\collection7\conf
   [junit4]   2> 2047288 INFO  (TEST-TestLazyCores.testCachingLimit-seed#[28A2B9423857B45]) [    x:collectionLazy7] o.a.s.r.RestManager Initializing 0 registered ManagedResources
   [junit4]   2> 2047288 INFO  (TEST-TestLazyCores.testCachingLimit-seed#[28A2B9423857B45]) [    x:collectionLazy7] o.a.s.h.ReplicationHandler Commits will be reserved for  10000
   [junit4]   2> 2047288 INFO  (TEST-TestLazyCores.testCachingLimit-seed#[28A2B9423857B45]) [    x:collectionLazy7] o.a.s.c.CoreContainer Opening transient core collectionLazy7
   [junit4]   2> 2047288 INFO  (TEST-TestLazyCores.testCachingLimit-seed#[28A2B9423857B45]) [    x:collectionLazy7] o.a.s.c.CoreContainer registering core: collectionLazy7
   [junit4]   2> 2047289 INFO  (TEST-TestLazyCores.testCachingLimit-seed#[28A2B9423857B45]) [    x:collectionLazy7] o.a.s.c.SolrResourceLoader new SolrResourceLoader for directory: 'C:\Users\JenkinsSlave\workspace\Lucene-Solr-5.x-Windows\solr\build\solr-core\test\J0\temp\solr.core.TestLazyCores_28A2B9423857B45-001\tempDir-001\collection8\'
   [junit4]   2> 2047290 INFO  (searcherExecutor-4641-thread-1-processing-x:collectionLazy7) [    x:collectionLazy7] o.a.s.c.SolrCore [collectionLazy7] Registered new searcher Searcher@c8540c[collectionLazy7] main{ExitableDirectoryReader(UninvertingDirectoryReader())}
   [junit4]   2> 2047322 INFO  (TEST-TestLazyCores.testCachingLimit-seed#[28A2B9423857B45]) [    x:collectionLazy7] o.a.s.c.SolrConfig current version of requestparams : -1
   [junit4]   2> 2047358 INFO  (TEST-TestLazyCores.testCachingLimit-seed#[28A2B9423857B45]) [    x:collectionLazy7] o.a.s.c.SolrConfig Using Lucene MatchVersion: 5.3.0
   [junit4]   2> 2047387 INFO  (TEST-TestLazyCores.testCachingLimit-seed#[28A2B9423857B45]) [    x:collectionLazy7] o.a.s.c.Config Loaded SolrConfig: solrconfig.xml
   [junit4]   2> 2047387 INFO  (TEST-TestLazyCores.testCachingLimit-seed#[28A2B9423857B45]) [    x:collectionLazy7] o.a.s.s.IndexSchema Reading Solr Schema from C:\Users\JenkinsSlave\workspace\Lucene-Solr-5.x-Windows\solr\build\solr-core\test\J0\temp\solr.core.TestLazyCores_28A2B9423857B45-001\tempDir-001\collection8\conf\schema.xml
   [junit4]   2> 2047393 INFO  (TEST-TestLazyCores.testCachingLimit-seed#[28A2B9423857B45]) [    x:collectionLazy7] o.a.s.s.IndexSchema [collectionLazy8] Schema name=tiny
   [junit4]   2> 2047405 INFO  (TEST-TestLazyCores.testCachingLimit-seed#[28A2B9423857B45]) [    x:collectionLazy7] o.a.s.s.IndexSchema unique key field: id
   [junit4]   2> 2047406 INFO  (TEST-TestLazyCores.testCachingLimit-seed#[28A2B9423857B45]) [    x:collectionLazy7] o.a.s.c.CoreContainer Creating SolrCore 'collectionLazy8' using configuration from instancedir C:\Users\JenkinsSlave\workspace\Lucene-Solr-5.x-Windows\solr\build\solr-core\test\J0\temp\solr.core.TestLazyCores_28A2B9423857B45-001\tempDir-001\collection8\
   [junit4]   2> 2047406 INFO  (TEST-TestLazyCores.testCachingLimit-seed#[28A2B9423857B45]) [    x:collectionLazy8] o.a.s.c.SolrCore org.apache.solr.core.MockDirectoryFactory
   [junit4]   2> 2047407 INFO  (TEST-TestLazyCores.testCachingLimit-seed#[28A2B9423857B45]) [    x:collectionLazy8] o.a.s.c.SolrCore [[collectionLazy8] ] Opening new SolrCore at [C:\Users\JenkinsSlave\workspace\Lucene-Solr-5.x-Windows\solr\build\solr-core\test\J0\temp\solr.core.TestLazyCores_28A2B9423857B45-001\tempDir-001\collection8\], dataDir=[null]
   [junit4]   2> 2047407 INFO  (TEST-TestLazyCores.testCachingLimit-seed#[28A2B9423857B45]) [    x:collectionLazy8] o.a.s.c.SolrCore JMX monitoring not detected for core: collectionLazy8
   [junit4]   2> 2047407 INFO  (TEST-TestLazyCores.testCachingLimit-seed#[28A2B9423857B45]) [    x:collectionLazy8] o.a.s.c.CachingDirectoryFactory return new directory for C:\Users\JenkinsSlave\workspace\Lucene-Solr-5.x-Windows\solr\build\solr-core\test\J0\temp\solr.core.TestLazyCores_28A2B9423857B45-001\tempDir-001\collection8\data\
   [junit4]   2> 2047407 INFO  (TEST-TestLazyCores.testCachingLimit-seed#[28A2B9423857B45]) [    x:collectionLazy8] o.a.s.c.SolrCore New index directory detected: old=null new=C:\Users\JenkinsSlave\workspace\Lucene-Solr-5.x-Windows\solr\build\solr-core\test\J0\temp\solr.core.TestLazyCores_28A2B9423857B45-001\tempDir-001\collection8\data\index/
   [junit4]   2> 2047407 WARN  (TEST-TestLazyCores.testCachingLimit-seed#[28A2B9423857B45]) [    x:collectionLazy8] o.a.s.c.SolrCore [collectionLazy8] Solr index directory 'C:\Users\JenkinsSlave\workspace\Lucene-Solr-5.x-Windows\solr\build\solr-core\test\J0\temp\solr.core.TestLazyCores_28A2B9423857B45-001\tempDir-001\collection8\data\index' doesn't exist. Creating new index...
   [junit4]   2> 2047407 INFO  (TEST-TestLazyCores.testCachingLimit-seed#[28A2B9423857B45]) [    x:collectionLazy8] o.a.s.c.CachingDirectoryFactory return new directory for C:\Users\JenkinsSlave\workspace\Lucene-Solr-5.x-Windows\solr\build\solr-core\test\J0\temp\solr.core.TestLazyCores_28A2B9423857B45-001\tempDir-001\collection8\data\index
   [junit4]   2> 2047407 INFO  (TEST-TestLazyCores.testCachingLimit-seed#[28A2B9423857B45]) [    x:collectionLazy8] o.a.s.u.RandomMergePolicy RandomMergePolicy wrapping class org.apache.lucene.index.LogDocMergePolicy: [LogDocMergePolicy: minMergeSize=1000, mergeFactor=11, maxMergeSize=9223372036854775807, maxMergeSizeForForcedMerge=9223372036854775807, calibrateSizeByDeletes=true, maxMergeDocs=2147483647, maxCFSSegmentSizeMB=8.796093022207999E12, noCFSRatio=0.6907760426745774]
   [junit4]   2> 2047408 INFO  (TEST-TestLazyCores.testCachingLimit-seed#[28A2B9423857B45]) [    x:collectionLazy8] o.a.s.c.SolrCore SolrDeletionPolicy.onCommit: commits: num=1
   [junit4]   2> 	commit{dir=MockDirectoryWrapper(RAMDirectory@fbaea2 lockFactory=org.apache.lucene.store.SingleInstanceLockFactory@1864dc8),segFN=segments_1,generation=1}
   [junit4]   2> 2047408 INFO  (TEST-TestLazyCores.testCachingLimit-seed#[28A2B9423857B45]) [    x:collectionLazy8] o.a.s.c.SolrCore newest commit generation = 1
   [junit4]   2> 2047408 INFO  (OldIndexDirectoryCleanupThreadF

[...truncated too long message...]

 at java.util.concurrent.locks.AbstractQueuedSynchronizer$ConditionObject.await(AbstractQueuedSynchronizer.java:2043)
   [junit4]   2>         at java.util.concurrent.LinkedBlockingQueue.take(LinkedBlockingQueue.java:442)
   [junit4]   2>         at java.util.concurrent.ThreadPoolExecutor.getTask(ThreadPoolExecutor.java:1068)
   [junit4]   2>         at java.util.concurrent.ThreadPoolExecutor.runWorker(ThreadPoolExecutor.java:1130)
   [junit4]   2>         at java.util.concurrent.ThreadPoolExecutor$Worker.run(ThreadPoolExecutor.java:615)
   [junit4]   2>         at java.lang.Thread.run(Thread.java:745)
   [junit4]   2> Jun 15, 2015 2:17:59 AM com.carrotsearch.randomizedtesting.ThreadLeakControl tryToInterruptAll
   [junit4]   2> INFO: Starting to interrupt leaked threads:
   [junit4]   2>    1) Thread[id=9716, name=searcherExecutor-4618-thread-1, state=WAITING, group=TGRP-TestLazyCores]
   [junit4]   2> Jun 15, 2015 2:18:02 AM com.carrotsearch.randomizedtesting.ThreadLeakControl tryToInterruptAll
   [junit4]   2> SEVERE: There are still zombie threads that couldn't be terminated:
   [junit4]   2>    1) Thread[id=9716, name=searcherExecutor-4618-thread-1, state=WAITING, group=TGRP-TestLazyCores]
   [junit4]   2>         at sun.misc.Unsafe.park(Native Method)
   [junit4]   2>         at java.util.concurrent.locks.LockSupport.park(LockSupport.java:186)
   [junit4]   2>         at java.util.concurrent.locks.AbstractQueuedSynchronizer$ConditionObject.await(AbstractQueuedSynchronizer.java:2043)
   [junit4]   2>         at java.util.concurrent.LinkedBlockingQueue.take(LinkedBlockingQueue.java:442)
   [junit4]   2>         at java.util.concurrent.ThreadPoolExecutor.getTask(ThreadPoolExecutor.java:1068)
   [junit4]   2>         at java.util.concurrent.ThreadPoolExecutor.runWorker(ThreadPoolExecutor.java:1130)
   [junit4]   2>         at java.util.concurrent.ThreadPoolExecutor$Worker.run(ThreadPoolExecutor.java:615)
   [junit4]   2>         at java.lang.Thread.run(Thread.java:745)
   [junit4]   2> NOTE: test params are: codec=CheapBastard, sim=RandomSimilarityProvider(queryNorm=true,coord=no): {}, locale=ko, timezone=GMT
   [junit4]   2> NOTE: Windows 7 6.1 x86/Oracle Corporation 1.7.0_80 (32-bit)/cpus=3,threads=2,free=281781736,total=525336576
   [junit4]   2> NOTE: All tests run in this JVM: [OverseerStatusTest, TestBulkSchemaAPI, UniqFieldsUpdateProcessorFactoryTest, DocValuesMissingTest, TestRawResponseWriter, TestCustomDocTransformer, TestAnalyzedSuggestions, TestBM25SimilarityFactory, TestRestManager, TestCoreContainer, FieldAnalysisRequestHandlerTest, RequestHandlersTest, ClusterStateUpdateTest, PingRequestHandlerTest, DistributedSuggestComponentTest, TestHashQParserPlugin, TestHdfsUpdateLog, TestComponentsName, RecoveryZkTest, TimeZoneUtilsTest, TestSolrConfigHandlerConcurrent, TestUniqueKeyFieldResource, TestCollationField, QueryElevationComponentTest, AnalyticsMergeStrategyTest, CleanupOldIndexTest, SolrPluginUtilsTest, PeerSyncTest, TestSchemaResource, TestInitParams, TestSolrDynamicMBean, TestSolrCloudWithKerberosAlt, DocValuesTest, TestSolrIndexConfig, RankQueryTest, ZkCLITest, TestAtomicUpdateErrorCases, TestWordDelimiterFilterFactory, ActionThrottleTest, SampleTest, CircularListTest, TestExceedMaxTermLength, CloudExitableDirectoryReaderTest, DistribCursorPagingTest, ClusterStateTest, TestPhraseSuggestions, TestShardHandlerFactory, SystemInfoHandlerTest, TestMiniSolrCloudClusterSSL, ConcurrentDeleteAndCreateCollectionTest, OutputWriterTest, BasicDistributedZkTest, TestUpdate, RequiredFieldsTest, TestMiniSolrCloudCluster, LukeRequestHandlerTest, TestSort, TestPostingsSolrHighlighter, TestOmitPositions, TestCSVLoader, DirectSolrConnectionTest, TestCustomSort, TestDocBasedVersionConstraints, TestComplexPhraseQParserPlugin, SolrTestCaseJ4Test, JavabinLoaderTest, SuggesterFSTTest, TestJettySolrRunner, SortByFunctionTest, TestCollationFieldDocValues, DistributedFacetPivotLongTailTest, MultiTermTest, HdfsCollectionsAPIDistributedZkTest, ScriptEngineTest, TestElisionMultitermQuery, TestJmxIntegration, TestLeaderElectionZkExpiry, SharedFSAutoReplicaFailoverTest, TestManagedSchemaDynamicFieldResource, TestJsonFacets, TestManagedStopFilterFactory, TestCursorMarkWithoutUniqueKey, TestQueryTypes, TestNoOpRegenerator, UUIDUpdateProcessorFallbackTest, RemoteQueryErrorTest, TestArbitraryIndexDir, TestConfigReload, ShardRoutingTest, TestSimpleTrackingShardHandler, PreAnalyzedFieldTest, URLClassifyProcessorTest, TestCSVResponseWriter, TestWriterPerf, CoreMergeIndexesAdminHandlerTest, HdfsDirectoryFactoryTest, RecoveryAfterSoftCommitTest, TestNRTOpen, IndexSchemaRuntimeFieldTest, InfoHandlerTest, SimpleFacetsTest, TestDistributedSearch, DistribJoinFromCollectionTest, TestConfigSets, TestPerFieldSimilarity, TestSweetSpotSimilarityFactory, TestSchemaNameResource, TestFieldTypeResource, AddBlockUpdateTest, SliceStateTest, TestIndexSearcher, ShardSplitTest, ChaosMonkeyNothingIsSafeTest, TestFreeTextSuggestions, FacetPivotSmallTest, NumericFieldsTest, TestAddFieldRealTimeGet, SSLMigrationTest, TestCollapseQParserPlugin, TestFunctionQuery, TestReRankQParserPlugin, SegmentsInfoRequestHandlerTest, BasicDistributedZk2Test, UnloadDistributedZkTest, SyncSliceTest, OverseerTest, LeaderElectionIntegrationTest, TestReplicationHandler, TestFaceting, DistributedSpellCheckComponentTest, TermVectorComponentDistributedTest, TestStressReorder, TestStressVersions, TestRangeQuery, TestSolr4Spatial, SolrCoreTest, SpellCheckComponentTest, TestGroupingSearch, BasicFunctionalityTest, TestLazyCores]
   [junit4]   2> NOTE: reproduce with: ant test  -Dtestcase=TestLazyCores -Dtests.seed=28A2B9423857B45 -Dtests.slow=true -Dtests.locale=ko -Dtests.timezone=GMT -Dtests.asserts=true -Dtests.file.encoding=UTF-8
   [junit4] ERROR   0.00s J0 | TestLazyCores (suite) <<<
   [junit4]    > Throwable #1: java.lang.AssertionError: ERROR: SolrIndexSearcher opens=51 closes=50
   [junit4]    > 	at __randomizedtesting.SeedInfo.seed([28A2B9423857B45]:0)
   [junit4]    > 	at org.apache.solr.SolrTestCaseJ4.endTrackingSearchers(SolrTestCaseJ4.java:472)
   [junit4]    > 	at org.apache.solr.SolrTestCaseJ4.afterClass(SolrTestCaseJ4.java:232)
   [junit4]    > 	at java.lang.Thread.run(Thread.java:745)Throwable #2: com.carrotsearch.randomizedtesting.ThreadLeakError: 1 thread leaked from SUITE scope at org.apache.solr.core.TestLazyCores: 
   [junit4]    >    1) Thread[id=9716, name=searcherExecutor-4618-thread-1, state=WAITING, group=TGRP-TestLazyCores]
   [junit4]    >         at sun.misc.Unsafe.park(Native Method)
   [junit4]    >         at java.util.concurrent.locks.LockSupport.park(LockSupport.java:186)
   [junit4]    >         at java.util.concurrent.locks.AbstractQueuedSynchronizer$ConditionObject.await(AbstractQueuedSynchronizer.java:2043)
   [junit4]    >         at java.util.concurrent.LinkedBlockingQueue.take(LinkedBlockingQueue.java:442)
   [junit4]    >         at java.util.concurrent.ThreadPoolExecutor.getTask(ThreadPoolExecutor.java:1068)
   [junit4]    >         at java.util.concurrent.ThreadPoolExecutor.runWorker(ThreadPoolExecutor.java:1130)
   [junit4]    >         at java.util.concurrent.ThreadPoolExecutor$Worker.run(ThreadPoolExecutor.java:615)
   [junit4]    >         at java.lang.Thread.run(Thread.java:745)
   [junit4]    > 	at __randomizedtesting.SeedInfo.seed([28A2B9423857B45]:0)Throwable #3: com.carrotsearch.randomizedtesting.ThreadLeakError: There are still zombie threads that couldn't be terminated:
   [junit4]    >    1) Thread[id=9716, name=searcherExecutor-4618-thread-1, state=WAITING, group=TGRP-TestLazyCores]
   [junit4]    >         at sun.misc.Unsafe.park(Native Method)
   [junit4]    >         at java.util.concurrent.locks.LockSupport.park(LockSupport.java:186)
   [junit4]    >         at java.util.concurrent.locks.AbstractQueuedSynchronizer$ConditionObject.await(AbstractQueuedSynchronizer.java:2043)
   [junit4]    >         at java.util.concurrent.LinkedBlockingQueue.take(LinkedBlockingQueue.java:442)
   [junit4]    >         at java.util.concurrent.ThreadPoolExecutor.getTask(ThreadPoolExecutor.java:1068)
   [junit4]    >         at java.util.concurrent.ThreadPoolExecutor.runWorker(ThreadPoolExecutor.java:1130)
   [junit4]    >         at java.util.concurrent.ThreadPoolExecutor$Worker.run(ThreadPoolExecutor.java:615)
   [junit4]    >         at java.lang.Thread.run(Thread.java:745)
   [junit4]    > 	at __randomizedtesting.SeedInfo.seed([28A2B9423857B45]:0)
   [junit4] Completed [345/502] on J0 in 152.41s, 7 tests, 1 failure, 2 errors <<< FAILURES!

[...truncated 486 lines...]
BUILD FAILED
C:\Users\JenkinsSlave\workspace\Lucene-Solr-5.x-Windows\build.xml:536: The following error occurred while executing this line:
C:\Users\JenkinsSlave\workspace\Lucene-Solr-5.x-Windows\build.xml:484: The following error occurred while executing this line:
C:\Users\JenkinsSlave\workspace\Lucene-Solr-5.x-Windows\build.xml:61: The following error occurred while executing this line:
C:\Users\JenkinsSlave\workspace\Lucene-Solr-5.x-Windows\extra-targets.xml:39: The following error occurred while executing this line:
C:\Users\JenkinsSlave\workspace\Lucene-Solr-5.x-Windows\solr\build.xml:230: The following error occurred while executing this line:
C:\Users\JenkinsSlave\workspace\Lucene-Solr-5.x-Windows\solr\common-build.xml:511: The following error occurred while executing this line:
C:\Users\JenkinsSlave\workspace\Lucene-Solr-5.x-Windows\lucene\common-build.xml:1444: The following error occurred while executing this line:
C:\Users\JenkinsSlave\workspace\Lucene-Solr-5.x-Windows\lucene\common-build.xml:999: There were test failures: 502 suites, 1994 tests, 3 suite-level errors, 420 ignored (33 assumptions)

Total time: 64 minutes 7 seconds
Build step 'Invoke Ant' marked build as failure
Archiving artifacts
Recording test results
Email was triggered for: Failure - Any
Sending email for trigger: Failure - Any



Mime
View raw message