lucene-dev mailing list archives

Site index · List index
Message view « Date » · « Thread »
Top « Date » · « Thread »
From Apache Jenkins Server <jenk...@builds.apache.org>
Subject [JENKINS] Lucene-Solr-Tests-5.x-Java7 - Build # 3258 - Still Failing
Date Thu, 25 Jun 2015 11:08:36 GMT
Build: https://builds.apache.org/job/Lucene-Solr-Tests-5.x-Java7/3258/

1 tests failed.
FAILED:  org.apache.solr.response.TestCustomDocTransformer.testCustomTransformer

Error Message:
Exception during query

Stack Trace:
java.lang.RuntimeException: Exception during query
	at __randomizedtesting.SeedInfo.seed([C062F72E9252DCA8:97008D07BB838D22]:0)
	at org.apache.solr.SolrTestCaseJ4.assertQ(SolrTestCaseJ4.java:770)
	at org.apache.solr.SolrTestCaseJ4.assertQ(SolrTestCaseJ4.java:737)
	at org.apache.solr.response.TestCustomDocTransformer.testCustomTransformer(TestCustomDocTransformer.java:67)
	at sun.reflect.NativeMethodAccessorImpl.invoke0(Native Method)
	at sun.reflect.NativeMethodAccessorImpl.invoke(NativeMethodAccessorImpl.java:57)
	at sun.reflect.DelegatingMethodAccessorImpl.invoke(DelegatingMethodAccessorImpl.java:43)
	at java.lang.reflect.Method.invoke(Method.java:606)
	at com.carrotsearch.randomizedtesting.RandomizedRunner.invoke(RandomizedRunner.java:1627)
	at com.carrotsearch.randomizedtesting.RandomizedRunner$6.evaluate(RandomizedRunner.java:836)
	at com.carrotsearch.randomizedtesting.RandomizedRunner$7.evaluate(RandomizedRunner.java:872)
	at com.carrotsearch.randomizedtesting.RandomizedRunner$8.evaluate(RandomizedRunner.java:886)
	at com.carrotsearch.randomizedtesting.rules.SystemPropertiesRestoreRule$1.evaluate(SystemPropertiesRestoreRule.java:57)
	at org.apache.lucene.util.TestRuleSetupTeardownChained$1.evaluate(TestRuleSetupTeardownChained.java:50)
	at org.apache.lucene.util.AbstractBeforeAfterRule$1.evaluate(AbstractBeforeAfterRule.java:46)
	at org.apache.lucene.util.TestRuleThreadAndTestName$1.evaluate(TestRuleThreadAndTestName.java:49)
	at org.apache.lucene.util.TestRuleIgnoreAfterMaxFailures$1.evaluate(TestRuleIgnoreAfterMaxFailures.java:65)
	at org.apache.lucene.util.TestRuleMarkFailure$1.evaluate(TestRuleMarkFailure.java:48)
	at com.carrotsearch.randomizedtesting.rules.StatementAdapter.evaluate(StatementAdapter.java:36)
	at com.carrotsearch.randomizedtesting.ThreadLeakControl$StatementRunner.run(ThreadLeakControl.java:365)
	at com.carrotsearch.randomizedtesting.ThreadLeakControl.forkTimeoutingTask(ThreadLeakControl.java:798)
	at com.carrotsearch.randomizedtesting.ThreadLeakControl$3.evaluate(ThreadLeakControl.java:458)
	at com.carrotsearch.randomizedtesting.RandomizedRunner.runSingleTest(RandomizedRunner.java:845)
	at com.carrotsearch.randomizedtesting.RandomizedRunner$3.evaluate(RandomizedRunner.java:747)
	at com.carrotsearch.randomizedtesting.RandomizedRunner$4.evaluate(RandomizedRunner.java:781)
	at com.carrotsearch.randomizedtesting.RandomizedRunner$5.evaluate(RandomizedRunner.java:792)
	at com.carrotsearch.randomizedtesting.rules.StatementAdapter.evaluate(StatementAdapter.java:36)
	at com.carrotsearch.randomizedtesting.rules.SystemPropertiesRestoreRule$1.evaluate(SystemPropertiesRestoreRule.java:57)
	at org.apache.lucene.util.AbstractBeforeAfterRule$1.evaluate(AbstractBeforeAfterRule.java:46)
	at com.carrotsearch.randomizedtesting.rules.StatementAdapter.evaluate(StatementAdapter.java:36)
	at org.apache.lucene.util.TestRuleStoreClassName$1.evaluate(TestRuleStoreClassName.java:42)
	at com.carrotsearch.randomizedtesting.rules.NoShadowingOrOverridesOnMethodsRule$1.evaluate(NoShadowingOrOverridesOnMethodsRule.java:39)
	at com.carrotsearch.randomizedtesting.rules.NoShadowingOrOverridesOnMethodsRule$1.evaluate(NoShadowingOrOverridesOnMethodsRule.java:39)
	at com.carrotsearch.randomizedtesting.rules.StatementAdapter.evaluate(StatementAdapter.java:36)
	at com.carrotsearch.randomizedtesting.rules.StatementAdapter.evaluate(StatementAdapter.java:36)
	at com.carrotsearch.randomizedtesting.rules.StatementAdapter.evaluate(StatementAdapter.java:36)
	at org.apache.lucene.util.TestRuleAssertionsRequired$1.evaluate(TestRuleAssertionsRequired.java:54)
	at org.apache.lucene.util.TestRuleMarkFailure$1.evaluate(TestRuleMarkFailure.java:48)
	at org.apache.lucene.util.TestRuleIgnoreAfterMaxFailures$1.evaluate(TestRuleIgnoreAfterMaxFailures.java:65)
	at org.apache.lucene.util.TestRuleIgnoreTestSuites$1.evaluate(TestRuleIgnoreTestSuites.java:55)
	at com.carrotsearch.randomizedtesting.rules.StatementAdapter.evaluate(StatementAdapter.java:36)
	at com.carrotsearch.randomizedtesting.ThreadLeakControl$StatementRunner.run(ThreadLeakControl.java:365)
	at java.lang.Thread.run(Thread.java:745)
Caused by: java.lang.RuntimeException: REQUEST FAILED: xpath=//str[.='xx#title_0#']
	xml response was: <?xml version="1.0" encoding="UTF-8"?>
<response>
<lst name="responseHeader"><int name="status">0</int><int name="QTime">0</int></lst><result name="response" numFound="10" start="0"><doc><int name="id">0</int><arr name="subject"><str>xx</str></arr><arr name="title"><str>title_0</str></arr><str name="out">title_0#xx#</str></doc><doc><int name="id">1</int><arr name="subject"><str>xx</str></arr><arr name="title"><str>title_1</str></arr><str name="out">title_1#xx#</str></doc><doc><int name="id">2</int><arr name="subject"><str>xx</str></arr><arr name="title"><str>title_2</str></arr><str name="out">title_2#xx#</str></doc><doc><int name="id">3</int><arr name="subject"><str>xx</str></arr><arr name="title"><str>title_3</str></arr><str name="out">title_3#xx#</str></doc><doc><int name="id">4</int><arr name="subject"><str>xx</str></arr><arr name="title"><str>title_4</str></arr><str name="out">title_4#xx#</str></doc><doc><int name="id">5</int><arr name="subject"><str>xx</str></arr><arr name="title"><str>title_5</str></arr><str name="out">title_5#xx#</str></doc><doc><int name="id">6</int><arr name="subject"><str>xx</str></arr><arr name="title"><str>title_6</str></arr><str name="out">title_6#xx#</str></doc><doc><int name="id">7</int><arr name="subject"><str>xx</str></arr><arr name="title"><str>title_7</str></arr><str name="out">title_7#xx#</str></doc><doc><int name="id">8</int><arr name="subject"><str>xx</str></arr><arr name="title"><str>title_8</str></arr><str name="out">title_8#xx#</str></doc><doc><int name="id">9</int><arr name="subject"><str>xx</str></arr><arr name="title"><str>title_9</str></arr><str name="out">title_9#xx#</str></doc></result>
</response>

	request was:wt=xml&q=*:*&fl=id,out:[custom+extra%3Dsubject,title]
	at org.apache.solr.SolrTestCaseJ4.assertQ(SolrTestCaseJ4.java:763)
	... 41 more




Build Log:
[...truncated 10719 lines...]
   [junit4] Suite: org.apache.solr.response.TestCustomDocTransformer
   [junit4]   2> Creating dataDir: /x1/jenkins/jenkins-slave/workspace/Lucene-Solr-Tests-5.x-Java7/solr/build/solr-core/test/J2/temp/solr.response.TestCustomDocTransformer_C062F72E9252DCA8-001/init-core-data-001
   [junit4]   2> 1828061 INFO  (SUITE-TestCustomDocTransformer-seed#[C062F72E9252DCA8]-worker) [    ] o.a.s.SolrTestCaseJ4 Randomized ssl (true) and clientAuth (false)
   [junit4]   2> 1828062 INFO  (SUITE-TestCustomDocTransformer-seed#[C062F72E9252DCA8]-worker) [    ] o.a.s.SolrTestCaseJ4 ####initCore
   [junit4]   2> 1828062 INFO  (SUITE-TestCustomDocTransformer-seed#[C062F72E9252DCA8]-worker) [    ] o.a.s.c.SolrResourceLoader new SolrResourceLoader for directory: '/x1/jenkins/jenkins-slave/workspace/Lucene-Solr-Tests-5.x-Java7/solr/core/src/test-files/solr/collection1/'
   [junit4]   2> 1828062 INFO  (SUITE-TestCustomDocTransformer-seed#[C062F72E9252DCA8]-worker) [    ] o.a.s.c.SolrResourceLoader Adding 'file:/x1/jenkins/jenkins-slave/workspace/Lucene-Solr-Tests-5.x-Java7/solr/core/src/test-files/solr/collection1/lib/.svn/' to classloader
   [junit4]   2> 1828063 INFO  (SUITE-TestCustomDocTransformer-seed#[C062F72E9252DCA8]-worker) [    ] o.a.s.c.SolrResourceLoader Adding 'file:/x1/jenkins/jenkins-slave/workspace/Lucene-Solr-Tests-5.x-Java7/solr/core/src/test-files/solr/collection1/lib/classes/' to classloader
   [junit4]   2> 1828063 INFO  (SUITE-TestCustomDocTransformer-seed#[C062F72E9252DCA8]-worker) [    ] o.a.s.c.SolrResourceLoader Adding 'file:/x1/jenkins/jenkins-slave/workspace/Lucene-Solr-Tests-5.x-Java7/solr/core/src/test-files/solr/collection1/lib/README' to classloader
   [junit4]   2> 1828090 INFO  (SUITE-TestCustomDocTransformer-seed#[C062F72E9252DCA8]-worker) [    ] o.a.s.c.SolrConfig current version of requestparams : -1
   [junit4]   2> 1828102 INFO  (SUITE-TestCustomDocTransformer-seed#[C062F72E9252DCA8]-worker) [    ] o.a.s.c.SolrConfig Using Lucene MatchVersion: 5.3.0
   [junit4]   2> 1828128 INFO  (SUITE-TestCustomDocTransformer-seed#[C062F72E9252DCA8]-worker) [    ] o.a.s.c.Config Loaded SolrConfig: solrconfig-doctransformers.xml
   [junit4]   2> 1828129 INFO  (SUITE-TestCustomDocTransformer-seed#[C062F72E9252DCA8]-worker) [    ] o.a.s.s.IndexSchema Reading Solr Schema from /x1/jenkins/jenkins-slave/workspace/Lucene-Solr-Tests-5.x-Java7/solr/core/src/test-files/solr/collection1/conf/schema.xml
   [junit4]   2> 1828136 INFO  (SUITE-TestCustomDocTransformer-seed#[C062F72E9252DCA8]-worker) [    ] o.a.s.s.IndexSchema [null] Schema name=test
   [junit4]   2> 1828417 INFO  (SUITE-TestCustomDocTransformer-seed#[C062F72E9252DCA8]-worker) [    ] o.a.s.s.OpenExchangeRatesOrgProvider Initialized with rates=open-exchange-rates.json, refreshInterval=1440.
   [junit4]   2> 1828426 INFO  (SUITE-TestCustomDocTransformer-seed#[C062F72E9252DCA8]-worker) [    ] o.a.s.s.IndexSchema default search field in schema is text
   [junit4]   2> 1828428 INFO  (SUITE-TestCustomDocTransformer-seed#[C062F72E9252DCA8]-worker) [    ] o.a.s.s.IndexSchema unique key field: id
   [junit4]   2> 1828433 INFO  (SUITE-TestCustomDocTransformer-seed#[C062F72E9252DCA8]-worker) [    ] o.a.s.s.FileExchangeRateProvider Reloading exchange rates from file currency.xml
   [junit4]   2> 1828436 INFO  (SUITE-TestCustomDocTransformer-seed#[C062F72E9252DCA8]-worker) [    ] o.a.s.s.FileExchangeRateProvider Reloading exchange rates from file currency.xml
   [junit4]   2> 1828439 INFO  (SUITE-TestCustomDocTransformer-seed#[C062F72E9252DCA8]-worker) [    ] o.a.s.s.OpenExchangeRatesOrgProvider Reloading exchange rates from open-exchange-rates.json
   [junit4]   2> 1828439 WARN  (SUITE-TestCustomDocTransformer-seed#[C062F72E9252DCA8]-worker) [    ] o.a.s.s.OpenExchangeRatesOrgProvider Unknown key IMPORTANT NOTE
   [junit4]   2> 1828439 WARN  (SUITE-TestCustomDocTransformer-seed#[C062F72E9252DCA8]-worker) [    ] o.a.s.s.OpenExchangeRatesOrgProvider Expected key, got STRING
   [junit4]   2> 1828440 INFO  (SUITE-TestCustomDocTransformer-seed#[C062F72E9252DCA8]-worker) [    ] o.a.s.s.OpenExchangeRatesOrgProvider Reloading exchange rates from open-exchange-rates.json
   [junit4]   2> 1828440 WARN  (SUITE-TestCustomDocTransformer-seed#[C062F72E9252DCA8]-worker) [    ] o.a.s.s.OpenExchangeRatesOrgProvider Unknown key IMPORTANT NOTE
   [junit4]   2> 1828440 WARN  (SUITE-TestCustomDocTransformer-seed#[C062F72E9252DCA8]-worker) [    ] o.a.s.s.OpenExchangeRatesOrgProvider Expected key, got STRING
   [junit4]   2> 1828440 INFO  (SUITE-TestCustomDocTransformer-seed#[C062F72E9252DCA8]-worker) [    ] o.a.s.c.SolrResourceLoader JNDI not configured for solr (NoInitialContextEx)
   [junit4]   2> 1828440 INFO  (SUITE-TestCustomDocTransformer-seed#[C062F72E9252DCA8]-worker) [    ] o.a.s.c.SolrResourceLoader using system property solr.solr.home: /x1/jenkins/jenkins-slave/workspace/Lucene-Solr-Tests-5.x-Java7/solr/core/src/test-files/solr
   [junit4]   2> 1828441 INFO  (SUITE-TestCustomDocTransformer-seed#[C062F72E9252DCA8]-worker) [    ] o.a.s.c.SolrResourceLoader new SolrResourceLoader for directory: '/x1/jenkins/jenkins-slave/workspace/Lucene-Solr-Tests-5.x-Java7/solr/core/src/test-files/solr/'
   [junit4]   2> 1828455 INFO  (SUITE-TestCustomDocTransformer-seed#[C062F72E9252DCA8]-worker) [    ] o.a.s.c.CoreContainer New CoreContainer 557297534
   [junit4]   2> 1828456 INFO  (SUITE-TestCustomDocTransformer-seed#[C062F72E9252DCA8]-worker) [    ] o.a.s.c.CoreContainer Loading cores into CoreContainer [instanceDir=/x1/jenkins/jenkins-slave/workspace/Lucene-Solr-Tests-5.x-Java7/solr/core/src/test-files/solr/]
   [junit4]   2> 1828456 INFO  (SUITE-TestCustomDocTransformer-seed#[C062F72E9252DCA8]-worker) [    ] o.a.s.c.CoreContainer loading shared library: /x1/jenkins/jenkins-slave/workspace/Lucene-Solr-Tests-5.x-Java7/solr/core/src/test-files/solr/lib
   [junit4]   2> 1828456 WARN  (SUITE-TestCustomDocTransformer-seed#[C062F72E9252DCA8]-worker) [    ] o.a.s.c.SolrResourceLoader Can't find (or read) directory to add to classloader: lib (resolved as: /x1/jenkins/jenkins-slave/workspace/Lucene-Solr-Tests-5.x-Java7/solr/core/src/test-files/solr/lib).
   [junit4]   2> 1828464 INFO  (SUITE-TestCustomDocTransformer-seed#[C062F72E9252DCA8]-worker) [    ] o.a.s.h.c.HttpShardHandlerFactory created with socketTimeout : 600000,connTimeout : 60000,maxConnectionsPerHost : 20,maxConnections : 10000,corePoolSize : 0,maximumPoolSize : 2147483647,maxThreadIdleTime : 5,sizeOfQueue : -1,fairnessPolicy : false,useRetries : false,
   [junit4]   2> 1828466 INFO  (SUITE-TestCustomDocTransformer-seed#[C062F72E9252DCA8]-worker) [    ] o.a.s.u.UpdateShardHandler Creating UpdateShardHandler HTTP client with params: socketTimeout=30000&connTimeout=30000&retry=true
   [junit4]   2> 1828468 INFO  (SUITE-TestCustomDocTransformer-seed#[C062F72E9252DCA8]-worker) [    ] o.a.s.l.LogWatcher SLF4J impl is org.slf4j.impl.Log4jLoggerFactory
   [junit4]   2> 1828468 INFO  (SUITE-TestCustomDocTransformer-seed#[C062F72E9252DCA8]-worker) [    ] o.a.s.l.LogWatcher Registering Log Listener [Log4j (org.slf4j.impl.Log4jLoggerFactory)]
   [junit4]   2> 1828468 INFO  (SUITE-TestCustomDocTransformer-seed#[C062F72E9252DCA8]-worker) [    ] o.a.s.c.CoreContainer No authentication plugin used.
   [junit4]   2> 1828469 INFO  (SUITE-TestCustomDocTransformer-seed#[C062F72E9252DCA8]-worker) [    ] o.a.s.c.SolrCore Created CoreDescriptor: {config=solrconfig-doctransformers.xml, schema=schema.xml, name=collection1, instanceDir=collection1, absoluteInstDir=/x1/jenkins/jenkins-slave/workspace/Lucene-Solr-Tests-5.x-Java7/solr/core/src/test-files/solr/collection1/, loadOnStartup=true, dataDir=/x1/jenkins/jenkins-slave/workspace/Lucene-Solr-Tests-5.x-Java7/solr/build/solr-core/test/J2/temp/solr.response.TestCustomDocTransformer_C062F72E9252DCA8-001/init-core-data-001, transient=false, collection=collection1, shard=shard1}
   [junit4]   2> 1828470 INFO  (coreLoadExecutor-5277-thread-1) [    ] o.a.s.c.SolrResourceLoader new SolrResourceLoader for directory: '/x1/jenkins/jenkins-slave/workspace/Lucene-Solr-Tests-5.x-Java7/solr/core/src/test-files/solr/collection1/'
   [junit4]   2> 1828470 INFO  (coreLoadExecutor-5277-thread-1) [    ] o.a.s.c.SolrResourceLoader Adding 'file:/x1/jenkins/jenkins-slave/workspace/Lucene-Solr-Tests-5.x-Java7/solr/core/src/test-files/solr/collection1/lib/.svn/' to classloader
   [junit4]   2> 1828471 INFO  (coreLoadExecutor-5277-thread-1) [    ] o.a.s.c.SolrResourceLoader Adding 'file:/x1/jenkins/jenkins-slave/workspace/Lucene-Solr-Tests-5.x-Java7/solr/core/src/test-files/solr/collection1/lib/classes/' to classloader
   [junit4]   2> 1828471 INFO  (coreLoadExecutor-5277-thread-1) [    ] o.a.s.c.SolrResourceLoader Adding 'file:/x1/jenkins/jenkins-slave/workspace/Lucene-Solr-Tests-5.x-Java7/solr/core/src/test-files/solr/collection1/lib/README' to classloader
   [junit4]   2> 1828496 INFO  (coreLoadExecutor-5277-thread-1) [    ] o.a.s.c.SolrConfig current version of requestparams : -1
   [junit4]   2> 1828509 INFO  (coreLoadExecutor-5277-thread-1) [    ] o.a.s.c.SolrConfig Using Lucene MatchVersion: 5.3.0
   [junit4]   2> 1828534 INFO  (coreLoadExecutor-5277-thread-1) [    ] o.a.s.c.Config Loaded SolrConfig: solrconfig-doctransformers.xml
   [junit4]   2> 1828535 INFO  (coreLoadExecutor-5277-thread-1) [    ] o.a.s.s.IndexSchema Reading Solr Schema from /x1/jenkins/jenkins-slave/workspace/Lucene-Solr-Tests-5.x-Java7/solr/core/src/test-files/solr/collection1/conf/schema.xml
   [junit4]   2> 1828542 INFO  (coreLoadExecutor-5277-thread-1) [    ] o.a.s.s.IndexSchema [collection1] Schema name=test
   [junit4]   2> 1828827 INFO  (coreLoadExecutor-5277-thread-1) [    ] o.a.s.s.OpenExchangeRatesOrgProvider Initialized with rates=open-exchange-rates.json, refreshInterval=1440.
   [junit4]   2> 1828836 INFO  (coreLoadExecutor-5277-thread-1) [    ] o.a.s.s.IndexSchema default search field in schema is text
   [junit4]   2> 1828838 INFO  (coreLoadExecutor-5277-thread-1) [    ] o.a.s.s.IndexSchema unique key field: id
   [junit4]   2> 1828843 INFO  (coreLoadExecutor-5277-thread-1) [    ] o.a.s.s.FileExchangeRateProvider Reloading exchange rates from file currency.xml
   [junit4]   2> 1828846 INFO  (coreLoadExecutor-5277-thread-1) [    ] o.a.s.s.FileExchangeRateProvider Reloading exchange rates from file currency.xml
   [junit4]   2> 1828848 INFO  (coreLoadExecutor-5277-thread-1) [    ] o.a.s.s.OpenExchangeRatesOrgProvider Reloading exchange rates from open-exchange-rates.json
   [junit4]   2> 1828849 WARN  (coreLoadExecutor-5277-thread-1) [    ] o.a.s.s.OpenExchangeRatesOrgProvider Unknown key IMPORTANT NOTE
   [junit4]   2> 1828849 WARN  (coreLoadExecutor-5277-thread-1) [    ] o.a.s.s.OpenExchangeRatesOrgProvider Expected key, got STRING
   [junit4]   2> 1828849 INFO  (coreLoadExecutor-5277-thread-1) [    ] o.a.s.s.OpenExchangeRatesOrgProvider Reloading exchange rates from open-exchange-rates.json
   [junit4]   2> 1828849 WARN  (coreLoadExecutor-5277-thread-1) [    ] o.a.s.s.OpenExchangeRatesOrgProvider Unknown key IMPORTANT NOTE
   [junit4]   2> 1828849 WARN  (coreLoadExecutor-5277-thread-1) [    ] o.a.s.s.OpenExchangeRatesOrgProvider Expected key, got STRING
   [junit4]   2> 1828850 INFO  (coreLoadExecutor-5277-thread-1) [    ] o.a.s.c.CoreContainer Creating SolrCore 'collection1' using configuration from instancedir /x1/jenkins/jenkins-slave/workspace/Lucene-Solr-Tests-5.x-Java7/solr/core/src/test-files/solr/collection1/
   [junit4]   2> 1828850 INFO  (coreLoadExecutor-5277-thread-1) [    x:collection1] o.a.s.c.SolrCore org.apache.solr.core.MockDirectoryFactory
   [junit4]   2> 1828850 INFO  (coreLoadExecutor-5277-thread-1) [    x:collection1] o.a.s.c.SolrCore [[collection1] ] Opening new SolrCore at [/x1/jenkins/jenkins-slave/workspace/Lucene-Solr-Tests-5.x-Java7/solr/core/src/test-files/solr/collection1/], dataDir=[null]
   [junit4]   2> 1828850 INFO  (coreLoadExecutor-5277-thread-1) [    x:collection1] o.a.s.c.SolrCore JMX monitoring not detected for core: collection1
   [junit4]   2> 1828851 INFO  (coreLoadExecutor-5277-thread-1) [    x:collection1] o.a.s.c.CachingDirectoryFactory return new directory for /x1/jenkins/jenkins-slave/workspace/Lucene-Solr-Tests-5.x-Java7/solr/build/solr-core/test/J2/temp/solr.response.TestCustomDocTransformer_C062F72E9252DCA8-001/init-core-data-001
   [junit4]   2> 1828851 INFO  (coreLoadExecutor-5277-thread-1) [    x:collection1] o.a.s.c.SolrCore New index directory detected: old=null new=/x1/jenkins/jenkins-slave/workspace/Lucene-Solr-Tests-5.x-Java7/solr/build/solr-core/test/J2/temp/solr.response.TestCustomDocTransformer_C062F72E9252DCA8-001/init-core-data-001/index/
   [junit4]   2> 1828851 WARN  (coreLoadExecutor-5277-thread-1) [    x:collection1] o.a.s.c.SolrCore [collection1] Solr index directory '/x1/jenkins/jenkins-slave/workspace/Lucene-Solr-Tests-5.x-Java7/solr/build/solr-core/test/J2/temp/solr.response.TestCustomDocTransformer_C062F72E9252DCA8-001/init-core-data-001/index' doesn't exist. Creating new index...
   [junit4]   2> 1828851 INFO  (coreLoadExecutor-5277-thread-1) [    x:collection1] o.a.s.c.CachingDirectoryFactory return new directory for /x1/jenkins/jenkins-slave/workspace/Lucene-Solr-Tests-5.x-Java7/solr/build/solr-core/test/J2/temp/solr.response.TestCustomDocTransformer_C062F72E9252DCA8-001/init-core-data-001/index
   [junit4]   2> 1828852 INFO  (coreLoadExecutor-5277-thread-1) [    x:collection1] o.a.s.c.SolrCore SolrDeletionPolicy.onCommit: commits: num=1
   [junit4]   2> 	commit{dir=MockDirectoryWrapper(RAMDirectory@2f1bed9c lockFactory=org.apache.lucene.store.SingleInstanceLockFactory@528cb4ed),segFN=segments_1,generation=1}
   [junit4]   2> 1828852 INFO  (coreLoadExecutor-5277-thread-1) [    x:collection1] o.a.s.c.SolrCore newest commit generation = 1
   [junit4]   2> 1828853 INFO  (OldIndexDirectoryCleanupThreadForCore-collection1) [    x:collection1] o.a.s.c.SolrCore Looking for old index directories to cleanup for core collection1 in /x1/jenkins/jenkins-slave/workspace/Lucene-Solr-Tests-5.x-Java7/solr/build/solr-core/test/J2/temp/solr.response.TestCustomDocTransformer_C062F72E9252DCA8-001/init-core-data-001/
   [junit4]   2> 1828858 INFO  (coreLoadExecutor-5277-thread-1) [    x:collection1] o.a.s.c.SolrCore no updateRequestProcessorChain defined as default, creating implicit default
   [junit4]   2> 1828861 INFO  (coreLoadExecutor-5277-thread-1) [    x:collection1] o.a.s.h.l.XMLLoader xsltCacheLifetimeSeconds=60
   [junit4]   2> 1828862 INFO  (coreLoadExecutor-5277-thread-1) [    x:collection1] o.a.s.h.l.XMLLoader xsltCacheLifetimeSeconds=60
   [junit4]   2> 1828863 INFO  (coreLoadExecutor-5277-thread-1) [    x:collection1] o.a.s.h.l.XMLLoader xsltCacheLifetimeSeconds=60
   [junit4]   2> 1828864 INFO  (coreLoadExecutor-5277-thread-1) [    x:collection1] o.a.s.h.l.XMLLoader xsltCacheLifetimeSeconds=60
   [junit4]   2> 1828866 INFO  (coreLoadExecutor-5277-thread-1) [    x:collection1] o.a.s.c.RequestHandlers Registered paths: /admin/ping,/schema,/update,/update/json,/admin/properties,/replication,/admin/plugins,/update/json/docs,/admin/mbeans,/admin/logging,/admin/system,/admin/threads,/update/csv,/get,/admin/segments,/admin/luke,/select,/admin/file,/config
   [junit4]   2> 1828868 INFO  (coreLoadExecutor-5277-thread-1) [    x:collection1] o.a.s.c.SolrCore Using default statsCache cache: org.apache.solr.search.stats.LocalStatsCache
   [junit4]   2> 1828868 INFO  (coreLoadExecutor-5277-thread-1) [    x:collection1] o.a.s.u.UpdateHandler Using UpdateLog implementation: org.apache.solr.update.UpdateLog
   [junit4]   2> 1828868 INFO  (coreLoadExecutor-5277-thread-1) [    x:collection1] o.a.s.u.UpdateLog Initializing UpdateLog: dataDir= defaultSyncLevel=FLUSH numRecordsToKeep=100 maxNumLogsToKeep=10 numVersionBuckets=65536
   [junit4]   2> 1828869 INFO  (coreLoadExecutor-5277-thread-1) [    x:collection1] o.a.s.c.SolrCore Hard AutoCommit: disabled
   [junit4]   2> 1828869 INFO  (coreLoadExecutor-5277-thread-1) [    x:collection1] o.a.s.c.SolrCore Soft AutoCommit: disabled
   [junit4]   2> 1828870 INFO  (coreLoadExecutor-5277-thread-1) [    x:collection1] o.a.s.c.SolrCore SolrDeletionPolicy.onInit: commits: num=1
   [junit4]   2> 	commit{dir=MockDirectoryWrapper(RAMDirectory@2f1bed9c lockFactory=org.apache.lucene.store.SingleInstanceLockFactory@528cb4ed),segFN=segments_1,generation=1}
   [junit4]   2> 1828870 INFO  (coreLoadExecutor-5277-thread-1) [    x:collection1] o.a.s.c.SolrCore newest commit generation = 1
   [junit4]   2> 1828870 INFO  (coreLoadExecutor-5277-thread-1) [    x:collection1] o.a.s.s.SolrIndexSearcher Opening Searcher@72b1476f[collection1] main
   [junit4]   2> 1828870 WARN  (coreLoadExecutor-5277-thread-1) [    x:collection1] o.a.s.r.ManagedResourceStorage Cannot write to config directory /x1/jenkins/jenkins-slave/workspace/Lucene-Solr-Tests-5.x-Java7/solr/core/src/test-files/solr/collection1/conf; switching to use InMemory storage instead.
   [junit4]   2> 1828871 INFO  (coreLoadExecutor-5277-thread-1) [    x:collection1] o.a.s.r.RestManager Initializing RestManager with initArgs: {}
   [junit4]   2> 1828871 INFO  (coreLoadExecutor-5277-thread-1) [    x:collection1] o.a.s.r.ManagedResourceStorage Reading _rest_managed.json using InMemoryStorage
   [junit4]   2> 1828871 INFO  (coreLoadExecutor-5277-thread-1) [    x:collection1] o.a.s.r.RestManager Initializing 0 registered ManagedResources
   [junit4]   2> 1828871 INFO  (coreLoadExecutor-5277-thread-1) [    x:collection1] o.a.s.h.ReplicationHandler Commits will be reserved for  10000
   [junit4]   2> 1828871 INFO  (searcherExecutor-5278-thread-1-processing-x:collection1) [    x:collection1] o.a.s.c.SolrCore [collection1] Registered new searcher Searcher@72b1476f[collection1] main{ExitableDirectoryReader(UninvertingDirectoryReader())}
   [junit4]   2> 1828871 INFO  (coreLoadExecutor-5277-thread-1) [    x:collection1] o.a.s.u.UpdateLog Looking up max value of version field to seed version buckets
   [junit4]   2> 1828872 INFO  (coreLoadExecutor-5277-thread-1) [    x:collection1] o.a.s.u.VersionInfo Refreshing highest value of _version_ for 65536 version buckets from index
   [junit4]   2> 1828872 INFO  (coreLoadExecutor-5277-thread-1) [    x:collection1] o.a.s.u.VersionInfo No terms found for _version_, cannot seed version bucket highest value from index
   [junit4]   2> 1828872 INFO  (coreLoadExecutor-5277-thread-1) [    x:collection1] o.a.s.u.UpdateLog Could not find max version in index or recent updates, using new clock 1504948126247550976
   [junit4]   2> 1828874 INFO  (coreLoadExecutor-5277-thread-1) [    x:collection1] o.a.s.u.UpdateLog Took 2 ms to seed version buckets with highest version 1504948126247550976
   [junit4]   2> 1828874 INFO  (coreLoadExecutor-5277-thread-1) [    x:collection1] o.a.s.c.CoreContainer registering core: collection1
   [junit4]   2> 1828876 INFO  (SUITE-TestCustomDocTransformer-seed#[C062F72E9252DCA8]-worker) [    ] o.a.s.SolrTestCaseJ4 ####initCore end
   [junit4]   2> 1828880 INFO  (TEST-TestCustomDocTransformer.testCustomTransformer-seed#[C062F72E9252DCA8]) [    ] o.a.s.SolrTestCaseJ4 ###Starting testCustomTransformer
   [junit4]   2> 1828882 INFO  (TEST-TestCustomDocTransformer.testCustomTransformer-seed#[C062F72E9252DCA8]) [    ] o.a.s.u.p.LogUpdateProcessor [collection1] webapp=null path=null params={wt=json&indent=true} {add=[0 (1504948126255939584)]} 0 1
   [junit4]   2> 1828882 INFO  (TEST-TestCustomDocTransformer.testCustomTransformer-seed#[C062F72E9252DCA8]) [    ] o.a.s.u.p.LogUpdateProcessor [collection1] webapp=null path=null params={wt=json&indent=true} {add=[1 (1504948126258036736)]} 0 0
   [junit4]   2> 1828883 INFO  (TEST-TestCustomDocTransformer.testCustomTransformer-seed#[C062F72E9252DCA8]) [    ] o.a.s.u.p.LogUpdateProcessor [collection1] webapp=null path=null params={wt=json&indent=true} {add=[2 (1504948126259085312)]} 0 0
   [junit4]   2> 1828884 INFO  (TEST-TestCustomDocTransformer.testCustomTransformer-seed#[C062F72E9252DCA8]) [    ] o.a.s.u.p.LogUpdateProcessor [collection1] webapp=null path=null params={wt=json&indent=true} {add=[3 (1504948126259085313)]} 0 0
   [junit4]   2> 1828884 INFO  (TEST-TestCustomDocTransformer.testCustomTransformer-seed#[C062F72E9252DCA8]) [    ] o.a.s.u.p.LogUpdateProcessor [collection1] webapp=null path=null params={wt=json&indent=true} {add=[4 (1504948126260133888)]} 0 0
   [junit4]   2> 1828885 INFO  (TEST-TestCustomDocTransformer.testCustomTransformer-seed#[C062F72E9252DCA8]) [    ] o.a.s.u.p.LogUpdateProcessor [collection1] webapp=null path=null params={wt=json&indent=true} {add=[5 (1504948126260133889)]} 0 0
   [junit4]   2> 1828885 INFO  (TEST-TestCustomDocTransformer.testCustomTransformer-seed#[C062F72E9252DCA8]) [    ] o.a.s.u.p.LogUpdateProcessor [collection1] webapp=null path=null params={wt=json&indent=true} {add=[6 (1504948126261182464)]} 0 0
   [junit4]   2> 1828886 INFO  (TEST-TestCustomDocTransformer.testCustomTransformer-seed#[C062F72E9252DCA8]) [    ] o.a.s.u.p.LogUpdateProcessor [collection1] webapp=null path=null params={wt=json&indent=true} {add=[7 (1504948126261182465)]} 0 0
   [junit4]   2> 1828886 INFO  (TEST-TestCustomDocTransformer.testCustomTransformer-seed#[C062F72E9252DCA8]) [    ] o.a.s.u.p.LogUpdateProcessor [collection1] webapp=null path=null params={wt=json&indent=true} {add=[8 (1504948126262231040)]} 0 0
   [junit4]   2> 1828887 INFO  (TEST-TestCustomDocTransformer.testCustomTransformer-seed#[C062F72E9252DCA8]) [    ] o.a.s.u.p.LogUpdateProcessor [collection1] webapp=null path=null params={wt=json&indent=true} {add=[9 (1504948126263279616)]} 0 0
   [junit4]   2> 1828887 INFO  (TEST-TestCustomDocTransformer.testCustomTransformer-seed#[C062F72E9252DCA8]) [    ] o.a.s.u.UpdateHandler start commit{,optimize=false,openSearcher=true,waitSearcher=true,expungeDeletes=false,softCommit=false,prepareCommit=false}
   [junit4]   2> 1828891 INFO  (TEST-TestCustomDocTransformer.testCustomTransformer-seed#[C062F72E9252DCA8]) [    ] o.a.s.c.SolrCore SolrDeletionPolicy.onCommit: commits: num=2
   [junit4]   2> 	commit{dir=MockDirectoryWrapper(RAMDirectory@2f1bed9c lockFactory=org.apache.lucene.store.SingleInstanceLockFactory@528cb4ed),segFN=segments_1,generation=1}
   [junit4]   2> 	commit{dir=MockDirectoryWrapper(RAMDirectory@2f1bed9c lockFactory=org.apache.lucene.store.SingleInstanceLockFactory@528cb4ed),segFN=segments_2,generation=2}
   [junit4]   2> 1828892 INFO  (TEST-TestCustomDocTransformer.testCustomTransformer-seed#[C062F72E9252DCA8]) [    ] o.a.s.c.SolrCore newest commit generation = 2
   [junit4]   2> 1828894 INFO  (TEST-TestCustomDocTransformer.testCustomTransformer-seed#[C062F72E9252DCA8]) [    ] o.a.s.s.SolrIndexSearcher Opening Searcher@4128218d[collection1] main
   [junit4]   2> 1828894 INFO  (searcherExecutor-5278-thread-1) [    ] o.a.s.c.SolrCore [collection1] Registered new searcher Searcher@4128218d[collection1] main{ExitableDirectoryReader(UninvertingDirectoryReader(Uninverting(_0(5.3.0):c10)))}
   [junit4]   2> 1828894 INFO  (TEST-TestCustomDocTransformer.testCustomTransformer-seed#[C062F72E9252DCA8]) [    ] o.a.s.u.UpdateHandler end_commit_flush
   [junit4]   2> 1828894 INFO  (TEST-TestCustomDocTransformer.testCustomTransformer-seed#[C062F72E9252DCA8]) [    ] o.a.s.u.p.LogUpdateProcessor [collection1] webapp=null path=null params={} {commit=} 0 7
   [junit4]   2> 1828897 INFO  (TEST-TestCustomDocTransformer.testCustomTransformer-seed#[C062F72E9252DCA8]) [    ] o.a.s.c.S.Request [collection1] webapp=null path=null params={wt=xml&q=*:*} hits=10 status=0 QTime=0 
   [junit4]   2> 1828900 INFO  (TEST-TestCustomDocTransformer.testCustomTransformer-seed#[C062F72E9252DCA8]) [    ] o.a.s.c.S.Request [collection1] webapp=null path=null params={wt=xml&q=*:*&fl=id,out:[custom+extra%3Dsubject,title]} hits=10 status=0 QTime=0 
   [junit4]   1> HELLO: title_0#xx#
   [junit4]   1> HELLO: title_1#xx#
   [junit4]   1> HELLO: title_2#xx#
   [junit4]   1> HELLO: title_3#xx#
   [junit4]   1> HELLO: title_4#xx#
   [junit4]   1> HELLO: title_5#xx#
   [junit4]   1> HELLO: title_6#xx#
   [junit4]   1> HELLO: title_7#xx#
   [junit4]   1> HELLO: title_8#xx#
   [junit4]   1> HELLO: title_9#xx#
   [junit4]   2> 1828903 ERROR (TEST-TestCustomDocTransformer.testCustomTransformer-seed#[C062F72E9252DCA8]) [    ] o.a.s.SolrTestCaseJ4 REQUEST FAILED: xpath=//str[.='xx#title_0#']
   [junit4]   2> 	xml response was: <?xml version="1.0" encoding="UTF-8"?>
   [junit4]   2> <response>
   [junit4]   2> <lst name="responseHeader"><int name="status">0</int><int name="QTime">0</int></lst><result name="response" numFound="10" start="0"><doc><int name="id">0</int><arr name="subject"><str>xx</str></arr><arr name="title"><str>title_0</str></arr><str name="out">title_0#xx#</str></doc><doc><int name="id">1</int><arr name="subject"><str>xx</str></arr><arr name="title"><str>title_1</str></arr><str name="out">title_1#xx#</str></doc><doc><int name="id">2</int><arr name="subject"><str>xx</str></arr><arr name="title"><str>title_2</str></arr><str name="out">title_2#xx#</str></doc><doc><int name="id">3</int><arr name="subject"><str>xx</str></arr><arr name="title"><str>title_3</str></arr><str name="out">title_3#xx#</str></doc><doc><int name="id">4</int><arr name="subject"><str>xx</str></arr><arr name="title"><str>title_4</str></arr><str name="out">title_4#xx#</str></doc><doc><int name="id">5</int><arr name="subject"><str>xx</str></arr><arr name="title"><str>title_5</str></arr><str name="out">title_5#xx#</str></doc><doc><int name="id">6</int><arr name="subject"><str>xx</str></arr><arr name="title"><str>title_6</str></arr><str name="out">title_6#xx#</str></doc><doc><int name="id">7</int><arr name="subject"><str>xx</str></arr><arr name="title"><str>title_7</str></arr><str name="out">title_7#xx#</str></doc><doc><int name="id">8</int><arr name="subject"><str>xx</str></arr><arr name="title"><str>title_8</str></arr><str name="out">title_8#xx#</str></doc><doc><int name="id">9</int><arr name="subject"><str>xx</str></arr><arr name="title"><str>title_9</str></arr><str name="out">title_9#xx#</str></doc></result>
   [junit4]   2> </response>
   [junit4]   2> 
   [junit4]   2> 	request was:wt=xml&q=*:*&fl=id,out:[custom+extra%3Dsubject,title]
   [junit4]   2> 1828904 ERROR (TEST-TestCustomDocTransformer.testCustomTransformer-seed#[C062F72E9252DCA8]) [    ] o.a.s.SolrTestCaseJ4 REQUEST FAILED: wt=xml&q=*:*&fl=id,out:[custom+extra%3Dsubject,title]:java.lang.RuntimeException: REQUEST FAILED: xpath=//str[.='xx#title_0#']
   [junit4]   2> 	xml response was: <?xml version="1.0" encoding="UTF-8"?>
   [junit4]   2> <response>
   [junit4]   2> <lst name="responseHeader"><int name="status">0</int><int name="QTime">0</int></lst><result name="response" numFound="10" start="0"><doc><int name="id">0</int><arr name="subject"><str>xx</str></arr><arr name="title"><str>title_0</str></arr><str name="out">title_0#xx#</str></doc><doc><int name="id">1</int><arr name="subject"><str>xx</str></arr><arr name="title"><str>title_1</str></arr><str name="out">title_1#xx#</str></doc><doc><int name="id">2</int><arr name="subject"><str>xx</str></arr><arr name="title"><str>title_2</str></arr><str name="out">title_2#xx#</str></doc><doc><int name="id">3</int><arr name="subject"><str>xx</str></arr><arr name="title"><str>title_3</str></arr><str name="out">title_3#xx#</str></doc><doc><int name="id">4</int><arr name="subject"><str>xx</str></arr><arr name="title"><str>title_4</str></arr><str name="out">title_4#xx#</str></doc><doc><int name="id">5</int><arr name="subject"><str>xx</str></arr><arr name="title"><str>title_5</str></arr><str name="out">title_5#xx#</str></doc><doc><int name="id">6</int><arr name="subject"><str>xx</str></arr><arr name="title"><str>title_6</str></arr><str name="out">title_6#xx#</str></doc><doc><int name="id">7</int><arr name="subject"><str>xx</str></arr><arr name="title"><str>title_7</str></arr><str name="out">title_7#xx#</str></doc><doc><int name="id">8</int><arr name="subject"><str>xx</str></arr><arr name="title"><str>title_8</str></arr><str name="out">title_8#xx#</str></doc><doc><int name="id">9</int><arr name="subject"><str>xx</str></arr><arr name="title"><str>title_9</str></arr><str name="out">title_9#xx#</str></doc></result>
   [junit4]   2> </response>
   [junit4]   2> 
   [junit4]   2> 	request was:wt=xml&q=*:*&fl=id,out:[custom+extra%3Dsubject,title]
   [junit4]   2> 	at org.apache.solr.SolrTestCaseJ4.assertQ(SolrTestCaseJ4.java:763)
   [junit4]   2> 	at org.apache.solr.SolrTestCaseJ4.assertQ(SolrTestCaseJ4.java:737)
   [junit4]   2> 	at org.apache.solr.response.TestCustomDocTransformer.testCustomTransformer(TestCustomDocTransformer.java:67)
   [junit4]   2> 	at sun.reflect.NativeMethodAccessorImpl.invoke0(Native Method)
   [junit4]   2> 	at sun.reflect.NativeMethodAccessorImpl.invoke(NativeMethodAccessorImpl.java:57)
   [junit4]   2> 	at sun.reflect.DelegatingMethodAccessorImpl.invoke(DelegatingMethodAccessorImpl.java:43)
   [junit4]   2> 	at java.lang.reflect.Method.invoke(Method.java:606)
   [junit4]   2> 	at com.carrotsearch.randomizedtesting.RandomizedRunner.invoke(RandomizedRunner.java:1627)
   [junit4]   2> 	at com.carrotsearch.randomizedtesting.RandomizedRunner$6.evaluate(RandomizedRunner.java:836)
   [junit4]   2> 	at com.carrotsearch.randomizedtesting.RandomizedRunner$7.evaluate(RandomizedRunner.java:872)
   [junit4]   2> 	at com.carrotsearch.randomizedtesting.RandomizedRunner$8.evaluate(RandomizedRunner.java:886)
   [junit4]   2> 	at com.carrotsearch.randomizedtesting.rules.SystemPropertiesRestoreRule$1.evaluate(SystemPropertiesRestoreRule.java:57)
   [junit4]   2> 	at org.apache.lucene.util.TestRuleSetupTeardownChained$1.evaluate(TestRuleSetupTeardownChained.java:50)
   [junit4]   2> 	at org.apache.lucene.util.AbstractBeforeAfterRule$1.evaluate(AbstractBeforeAfterRule.java:46)
   [junit4]   2> 	at org.apache.lucene.util.TestRuleThreadAndTestName$1.evaluate(TestRuleThreadAndTestName.java:49)
   [junit4]   2> 	at org.apache.lucene.util.TestRuleIgnoreAfterMaxFailures$1.evaluate(TestRuleIgnoreAfterMaxFailures.java:65)
   [junit4]   2> 	at org.apache.lucene.util.TestRuleMarkFailure$1.evaluate(TestRuleMarkFailure.java:48)
   [junit4]   2> 	at com.carrotsearch.randomizedtesting.rules.StatementAdapter.evaluate(StatementAdapter.java:36)
   [junit4]   2> 	at com.carrotsearch.randomizedtesting.ThreadLeakControl$StatementRunner.run(ThreadLeakControl.java:365)
   [junit4]   2> 	at com.carrotsearch.randomizedtesting.ThreadLeakControl.forkTimeoutingTask(ThreadLeakControl.java:798)
   [junit4]   2> 	at com.carrotsearch.randomizedtesting.ThreadLeakControl$3.evaluate(ThreadLeakControl.java:458)
   [junit4]   2> 	at com.carrotsearch.randomizedtesting.RandomizedRunner.runSingleTest(RandomizedRunner.java:845)
   [junit4]   2> 	at com.carrotsearch.randomizedtesting.RandomizedRunner$3.evaluate(RandomizedRunner.java:747)
   [junit4]   2> 	at com.carrotsearch.randomizedtesting.RandomizedRunner$4.evaluate(RandomizedRunner.java:781)
   [junit4]   2> 	at com.carrotsearch.randomizedtesting.RandomizedRunner$5.evaluate(RandomizedRunner.java:792)
   [junit4]   2> 	at com.carrotsearch.randomizedtesting.rules.StatementAdapter.evaluate(StatementAdapter.java:36)
   [junit4]   2> 	at com.carrotsearch.randomizedtesting.rules.SystemPropertiesRestoreRule$1.evaluate(SystemPropertiesRestoreRule.java:57)
   [junit4]   2> 	at org.apache.lucene.util.AbstractBeforeAfterRule$1.evaluate(AbstractBeforeAfterRule.java:46)
   [junit4]   2> 	at com.carrotsearch.randomizedtesting.rules.StatementAdapter.evaluate(StatementAdapter.java:36)
   [junit4]   2> 	at org.apache.lucene.util.TestRuleStoreClassName$1.evaluate(TestRuleStoreClassName.java:42)
   [junit4]   2> 	at com.carrotsearch.randomizedtesting.rules.NoShadowingOrOverridesOnMethodsRule$1.evaluate(NoShadowingOrOverridesOnMethodsRule.java:39)
   [junit4]   2> 	at com.carrotsearch.randomizedtesting.rules.NoShadowingOrOverridesOnMethodsRule$1.evaluate(NoShadowingOrOverridesOnMethodsRule.java:39)
   [junit4]   2> 	at com.carrotsearch.randomizedtesting.rules.StatementAdapter.evaluate(StatementAdapter.java:36)
   [junit4]   2> 	at com.carrotsearch.randomizedtesting.rules.StatementAdapter.evaluate(StatementAdapter.java:36)
   [junit4]   2> 	at com.carrotsearch.randomizedtesting.rules.StatementAdapter.evaluate(StatementAdapter.java:36)
   [junit4]   2> 	at org.apache.lucene.util.TestRuleAssertionsRequired$1.evaluate(TestRuleAssertionsRequired.java:54)
   [junit4]   2> 	at org.apache.lucene.util.TestRuleMarkFailure$1.evaluate(TestRuleMarkFailure.java:48)
   [junit4]   2> 	at org.apache.lucene.util.TestRuleIgnoreAfterMaxFailures$1.evaluate(TestRuleIgnoreAfterMaxFailures.java:65)
   [junit4]   2> 	at org.apache.lucene.util.TestRuleIgnoreTestSuites$1.evaluate(TestRuleIgnoreTestSuites.java:55)
   [junit4]   2> 	at com.carrotsearch.randomizedtesting.rules.StatementAdapter.evaluate(StatementAdapter.java:36)
   [junit4]   2> 	at com.carrotsearch.randomizedtesting.ThreadLeakControl$StatementRunner.run(ThreadLeakControl.java:365)
   [junit4]   2> 	at java.lang.Thread.run(Thread.java:745)
   [junit4]   2> 
   [junit4]   2> 1828907 INFO  (TEST-TestCustomDocTransformer.testCustomTransformer-seed#[C062F72E9252DCA8]) [    ] o.a.s.s.SolrIndexSearcher Opening Searcher@54d4bf15[collection1] realtime
   [junit4]   2> 1828907 INFO  (TEST-TestCustomDocTransformer.testCustomTransformer-seed#[C062F72E9252DCA8]) [    ] o.a.s.u.p.LogUpdateProcessor [collection1] webapp=null path=null params={} {deleteByQuery=*:* (-1504948126282153984)} 0 1
   [junit4]   2> 1828908 INFO  (TEST-TestCustomDocTransformer.testCustomTransformer-seed#[C062F72E9252DCA8]) [    ] o.a.s.u.UpdateHandler start commit{,optimize=false,openSearcher=true,waitSearcher=true,expungeDeletes=false,softCommit=false,prepareCommit=false}
   [junit4]   2> 1828909 INFO  (TEST-TestCustomDocTransformer.testCustomTransformer-seed#[C062F72E9252DCA8]) [    ] o.a.s.c.SolrCore SolrDeletionPolicy.onCommit: commits: num=2
   [junit4]   2> 	commit{dir=MockDirectoryWrapper(RAMDirectory@2f1bed9c lockFactory=org.apache.lucene.store.SingleInstanceLockFactory@528cb4ed),segFN=segments_2,generation=2}
   [junit4]   2> 	commit{dir=MockDirectoryWrapper(RAMDirectory@2f1bed9c lockFactory=org.apache.lucene.store.SingleInstanceLockFactory@528cb4ed),segFN=segments_3,generation=3}
   [junit4]   2> 1828909 INFO  (TEST-TestCustomDocTransformer.testCustomTransformer-seed#[C062F72E9252DCA8]) [    ] o.a.s.c.SolrCore newest commit generation = 3
   [junit4]   2> 1828909 INFO  (TEST-TestCustomDocTransformer.testCustomTransformer-seed#[C062F72E9252DCA8]) [    ] o.a.s.s.SolrIndexSearcher Opening Searcher@10d45ed4[collection1] main
   [junit4]   2> 1828910 INFO  (searcherExecutor-5278-thread-1) [    ] o.a.s.c.SolrCore [collection1] Registered new searcher Searcher@10d45ed4[collection1] main{ExitableDirectoryReader(UninvertingDirectoryReader())}
   [junit4]   2> 1828910 INFO  (TEST-TestCustomDocTransformer.testCustomTransformer-seed#[C062F72E9252DCA8]) [    ] o.a.s.u.UpdateHandler end_commit_flush
   [junit4]   2> 1828910 INFO  (TEST-TestCustomDocTransformer.testCustomTransformer-seed#[C062F72E9252DCA8]) [    ] o.a.s.u.p.LogUpdateProcessor [collection1] webapp=null path=null params={} {commit=} 0 1
   [junit4]   2> 1828911 INFO  (TEST-TestCustomDocTransformer.testCustomTransformer-seed#[C062F72E9252DCA8]) [    ] o.a.s.SolrTestCaseJ4 ###Ending testCustomTransformer
   [junit4]   2> NOTE: reproduce with: ant test  -Dtestcase=TestCustomDocTransformer -Dtests.method=testCustomTransformer -Dtests.seed=C062F72E9252DCA8 -Dtests.multiplier=2 -Dtests.slow=true -Dtests.locale=hr -Dtests.timezone=America/Montserrat -Dtests.asserts=true -Dtests.file.encoding=ISO-8859-1
   [junit4] ERROR   0.04s J2 | TestCustomDocTransformer.testCustomTransformer <<<
   [junit4]    > Throwable #1: java.lang.RuntimeException: Exception during query
   [junit4]    > 	at __randomizedtesting.SeedInfo.seed([C062F72E9252DCA8:97008D07BB838D22]:0)
   [junit4]    > 	at org.apache.solr.SolrTestCaseJ4.assertQ(SolrTestCaseJ4.java:770)
   [junit4]    > 	at org.apache.solr.SolrTestCaseJ4.assertQ(SolrTestCaseJ4.java:737)
   [junit4]    > 	at org.apache.solr.response.TestCustomDocTransformer.testCustomTransformer(TestCustomDocTransformer.java:67)
   [junit4]    > 	at java.lang.Thread.run(Thread.java:745)
   [junit4]    > Caused by: java.lang.RuntimeException: REQUEST FAILED: xpath=//str[.='xx#title_0#']
   [junit4]    > 	xml response was: <?xml version="1.0" encoding="UTF-8"?>
   [junit4]    > <response>
   [junit4]    > <lst name="responseHeader"><int name="status">0</int><int name="QTime">0</int></lst><result name="response" numFound="10" start="0"><doc><int name="id">0</int><arr name="subject"><str>xx</str></arr><arr name="title"><str>title_0</str></arr><str name="out">title_0#xx#</str></doc><doc><int name="id">1</int><arr name="subject"><str>xx</str></arr><arr name="title"><str>title_1</str></arr><str name="out">title_1#xx#</str></doc><doc><int name="id">2</int><arr name="subject"><str>xx</str></arr><arr name="title"><str>title_2</str></arr><str name="out">title_2#xx#</str></doc><doc><int name="id">3</int><arr name="subject"><str>xx</str></arr><arr name="title"><str>title_3</str></arr><str name="out">title_3#xx#</str></doc><doc><int name="id">4</int><arr name="subject"><str>xx</str></arr><arr name="title"><str>title_4</str></arr><str name="out">title_4#xx#</str></doc><doc><int name="id">5</int><arr name="subject"><str>xx</str></arr><arr name="title"><str>title_5</str></arr><str name="out">title_5#xx#</str></doc><doc><int name="id">6</int><arr name="subject"><str>xx</str></arr><arr name="title"><str>title_6</str></arr><str name="out">title_6#xx#</str></doc><doc><int name="id">7</int><arr name="subject"><str>xx</str></arr><arr name="title"><str>title_7</str></arr><str name="out">title_7#xx#</str></doc><doc><int name="id">8</int><arr name="subject"><str>xx</str></arr><arr name="title"><str>title_8</str></arr><str name="out">title_8#xx#</str></doc><doc><int name="id">9</int><arr name="subject"><str>xx</str></arr><arr name="title"><str>title_9</str></arr><str name="out">title_9#xx#</str></doc></result>
   [junit4]    > </response>
   [junit4]    > 	request was:wt=xml&q=*:*&fl=id,out:[custom+extra%3Dsubject,title]
   [junit4]    > 	at org.apache.solr.SolrTestCaseJ4.assertQ(SolrTestCaseJ4.java:763)
   [junit4]    > 	... 41 more
   [junit4]   2> 1828920 INFO  (SUITE-TestCustomDocTransformer-seed#[C062F72E9252DCA8]-worker) [    ] o.a.s.SolrTestCaseJ4 ###deleteCore
   [junit4]   2> 1828920 INFO  (SUITE-TestCustomDocTransformer-seed#[C062F72E9252DCA8]-worker) [    ] o.a.s.c.CoreContainer Shutting down CoreContainer instance=557297534
   [junit4]   2> 1828920 INFO  (SUITE-TestCustomDocTransformer-seed#[C062F72E9252DCA8]-worker) [    x:collection1] o.a.s.c.SolrCore [collection1]  CLOSING SolrCore org.apache.solr.core.SolrCore@2c9d1092
   [junit4]   2> 1828920 INFO  (SUITE-TestCustomDocTransformer-seed#[C062F72E9252DCA8]-worker) [    x:collection1] o.a.s.u.UpdateHandler closing DirectUpdateHandler2{commits=2,autocommits=0,soft autocommits=0,optimizes=0,rollbacks=0,expungeDeletes=0,docsPending=0,adds=0,deletesById=0,deletesByQuery=0,errors=0,cumulative_adds=10,cumulative_deletesById=0,cumulative_deletesByQuery=1,cumulative_errors=0,transaction_logs_total_size=612,transaction_logs_total_number=2}
   [junit4]   2> 1828921 INFO  (SUITE-TestCustomDocTransformer-seed#[C062F72E9252DCA8]-worker) [    x:collection1] o.a.s.u.SolrCoreState Closing SolrCoreState
   [junit4]   2> 1828921 INFO  (SUITE-TestCustomDocTransformer-seed#[C062F72E9252DCA8]-worker) [    x:collection1] o.a.s.u.DefaultSolrCoreState SolrCoreState ref count has reached 0 - closing IndexWriter
   [junit4]   2> 1828921 INFO  (SUITE-TestCustomDocTransformer-seed#[C062F72E9252DCA8]-worker) [    x:collection1] o.a.s.u.DefaultSolrCoreState closing IndexWriter with IndexWriterCloser
   [junit4]   2> 1828921 INFO  (SUITE-TestCustomDocTransformer-seed#[C062F72E9252DCA8]-worker) [    x:collection1] o.a.s.c.SolrCore [collection1] Closing main searcher on request.
   [junit4]   2> 1828921 INFO  (SUITE-TestCustomDocTransformer-seed#[C062F72E9252DCA8]-worker) [    x:collection1] o.a.s.c.CachingDirectoryFactory Closing MockDirectoryFactory - 2 directories currently being tracked
   [junit4]   2> 1828922 INFO  (SUITE-TestCustomDocTransformer-seed#[C062F72E9252DCA8]-worker) [    x:collection1] o.a.s.c.CachingDirectoryFactory looking to close /x1/jenkins/jenkins-slave/workspace/Lucene-Solr-Tests-5.x-Java7/solr/build/solr-core/test/J2/temp/solr.response.TestCustomDocTransformer_C062F72E9252DCA8-001/init-core-data-001/index [CachedDir<<refCount=0;path=/x1/jenkins/jenkins-slave/workspace/Lucene-Solr-Tests-5.x-Java7/solr/build/solr-core/test/J2/temp/solr.response.TestCustomDocTransformer_C062F72E9252DCA8-001/init-core-data-001/index;done=false>>]
   [junit4]   2> 1828922 INFO  (SUITE-TestCustomDocTransformer-seed#[C062F72E9252DCA8]-worker) [    x:collection1] o.a.s.c.CachingDirectoryFactory Closing directory: /x1/jenkins/jenkins-slave/workspace/Lucene-Solr-Tests-5.x-Java7/solr/build/solr-core/test/J2/temp/solr.response.TestCustomDocTransformer_C062F72E9252DCA8-001/init-core-data-001/index
   [junit4]   2> 1828922 INFO  (SUITE-TestCustomDocTransformer-seed#[C062F72E9252DCA8]-worker) [    x:collection1] o.a.s.c.CachingDirectoryFactory looking to close /x1/jenkins/jenkins-slave/workspace/Lucene-Solr-Tests-5.x-Java7/solr/build/solr-core/test/J2/temp/solr.response.TestCustomDocTransformer_C062F72E9252DCA8-001/init-core-data-001 [CachedDir<<refCount=0;path=/x1/jenkins/jenkins-slave/workspace/Lucene-Solr-Tests-5.x-Java7/solr/build/solr-core/test/J2/temp/solr.response.TestCustomDocTransformer_C062F72E9252DCA8-001/init-core-data-001;done=false>>]
   [junit4]   2> 1828922 INFO  (SUITE-TestCustomDocTransformer-seed#[C062F72E9252DCA8]-worker) [    x:collection1] o.a.s.c.CachingDirectoryFactory Closing directory: /x1/jenkins/jenkins-slave/workspace/Lucene-Solr-Tests-5.x-Java7/solr/build/solr-core/test/J2/temp/solr.response.TestCustomDocTransformer_C062F72E9252DCA8-001/init-core-data-001
   [junit4]   2> NOTE: leaving temporary files on disk at: /x1/jenkins/jenkins-slave/workspace/Lucene-Solr-Tests-5.x-Java7/solr/build/solr-core/test/J2/temp/solr.response.TestCustomDocTransformer_C062F72E9252DCA8-001
   [junit4]   2> NOTE: test params are: codec=Asserting(Lucene53): {title=PostingsFormat(name=LuceneFixedGap), multiDefault=PostingsFormat(name=LuceneVarGapFixedInterval), title_stringNoNorms=PostingsFormat(name=LuceneVarGapFixedInterval), id=PostingsFormat(name=Asserting), title_lettertok=PostingsFormat(name=Asserting), title_stemmed=PostingsFormat(name=LuceneFixedGap), range_facet_l=PostingsFormat(name=LuceneVarGapFixedInterval), range_facet_l_dv=PostingsFormat(name=Asserting), timestamp=PostingsFormat(name=LuceneVarGapFixedInterval), _version_=PostingsFormat(name=LuceneFixedGap), intDefault=PostingsFormat(name=LuceneFixedGap), text=BlockTreeOrds(blocksize=128), range_facet_i_dv=PostingsFormat(name=LuceneVarGapFixedInterval), subject=PostingsFormat(name=LuceneVarGapFixedInterval)}, docValues:{timestamp=DocValuesFormat(name=Direct), range_facet_l_dv=DocValuesFormat(name=Memory), range_facet_i_dv=DocValuesFormat(name=Direct)}, sim=RandomSimilarityProvider(queryNorm=false,coord=yes): {}, locale=hr, timezone=America/Montserrat
   [junit4]   2> NOTE: Linux 3.13.0-52-generic amd64/Oracle Corporation 1.7.0_72 (64-bit)/cpus=4,threads=1,free=148633728,total=499122176
   [junit4]   2> NOTE: All tests run in this JVM: [DistributedQueueTest, ReplicationFactorTest, HdfsRecoverLeaseTest, TestDistributedStatsComponentCardinality, TestDynamicFieldResource, DateMathParserTest, TimeZoneUtilsTest, CollectionReloadTest, DistributedSpellCheckComponentTest, TestDistributedSearch, StressHdfsTest, CoreAdminCreateDiscoverTest, DocValuesMissingTest, SimpleMLTQParserTest, ChaosMonkeyNothingIsSafeTest, SyncSliceTest, TestLazyCores, HdfsDirectoryFactoryTest, CollectionsAPIAsyncDistributedZkTest, MultiThreadedOCPTest, FullSolrCloudDistribCmdsTest, ResponseHeaderTest, SolrCoreTest, TestJettySolrRunner, TestCharFilters, DistributedIntervalFacetingTest, JavabinLoaderTest, TestConfigReload, TestIndexSearcher, DistributedVersionInfoTest, RequestLoggingTest, FieldMutatingUpdateProcessorTest, TestHashQParserPlugin, InfoHandlerTest, TestStressVersions, PreAnalyzedFieldTest, TestExactSharedStatsCache, TestFaceting, QueryEqualityTest, SolrCoreCheckLockOnStartupTest, HdfsChaosMonkeySafeLeaderTest, TestNamedUpdateProcessors, TestRemoteStreaming, TestManagedSynonymFilterFactory, RollingRestartTest, AddBlockUpdateTest, DistributedQueryComponentCustomSortTest, TestSolrCoreProperties, TestBinaryResponseWriter, StatelessScriptUpdateProcessorFactoryTest, AnalyticsMergeStrategyTest, TestFastLRUCache, IndexSchemaRuntimeFieldTest, SearchHandlerTest, CSVRequestHandlerTest, TestLRUStatsCache, TestSimpleTrackingShardHandler, TestHighlightDedupGrouping, TestRecovery, TestSchemaSimilarityResource, TestCodecSupport, DocValuesMultiTest, CurrencyFieldOpenExchangeTest, BlockDirectoryTest, IndexBasedSpellCheckerTest, TestCSVLoader, TestMaxScoreQueryParser, DirectSolrConnectionTest, SampleTest, TestFieldCollectionResource, XmlUpdateRequestHandlerTest, CollectionStateFormat2Test, DirectSolrSpellCheckerTest, DistributedFacetPivotWhiteBoxTest, HdfsBasicDistributedZk2Test, DataDrivenBlockJoinTest, SpellCheckCollatorTest, TermVectorComponentDistributedTest, SaslZkACLProviderTest, DistributedTermsComponentTest, BufferStoreTest, TestCustomSort, NotRequiredUniqueKeyTest, UnloadDistributedZkTest, DistribDocExpirationUpdateProcessorTest, LeaderInitiatedRecoveryOnCommitTest, TestCloudPivotFacet, TestCryptoKeys, SpatialHeatmapFacetsTest, TestCollectionAPI, TestBlobHandler, CleanupOldIndexTest, TestSolrConfigHandlerConcurrent, ZkSolrClientTest, TestRandomDVFaceting, TestTrackingShardHandlerFactory, TestRealTimeGet, AutoCommitTest, TestSolrConfigHandler, SoftAutoCommitTest, TestReplicationHandlerBackup, SolrCmdDistributorTest, HardAutoCommitTest, DistributedMLTComponentTest, TestRangeQuery, TestStressUserVersions, ZkControllerTest, ZkStateWriterTest, TestStressLucene, TestJsonRequest, BadIndexSchemaTest, DistributedDebugComponentTest, ShowFileRequestHandlerTest, AtomicUpdatesTest, AddSchemaFieldsUpdateProcessorFactoryTest, CurrencyFieldXmlFileTest, SuggesterTSTTest, SmileWriterTest, WordBreakSolrSpellCheckerTest, TestWordDelimiterFilterFactory, SpatialFilterTest, UUIDUpdateProcessorFallbackTest, PathHierarchyTokenizerFactoryTest, FieldAnalysisRequestHandlerTest, TestChildDocTransformer, TestQueryUtils, MBeansHandlerTest, LoggingHandlerTest, TestAnalyzedSuggestions, SOLR749Test, TestCSVResponseWriter, RankQueryTest, AnalyticsQueryTest, TestCustomDocTransformer]
   [junit4] Completed [412/507] on J2 in 0.88s, 1 test, 1 error <<< FAILURES!

[...truncated 295 lines...]
BUILD FAILED
/x1/jenkins/jenkins-slave/workspace/Lucene-Solr-Tests-5.x-Java7/build.xml:536: The following error occurred while executing this line:
/x1/jenkins/jenkins-slave/workspace/Lucene-Solr-Tests-5.x-Java7/build.xml:484: The following error occurred while executing this line:
/x1/jenkins/jenkins-slave/workspace/Lucene-Solr-Tests-5.x-Java7/build.xml:61: The following error occurred while executing this line:
/x1/jenkins/jenkins-slave/workspace/Lucene-Solr-Tests-5.x-Java7/extra-targets.xml:39: The following error occurred while executing this line:
/x1/jenkins/jenkins-slave/workspace/Lucene-Solr-Tests-5.x-Java7/solr/build.xml:230: The following error occurred while executing this line:
/x1/jenkins/jenkins-slave/workspace/Lucene-Solr-Tests-5.x-Java7/solr/common-build.xml:512: The following error occurred while executing this line:
/x1/jenkins/jenkins-slave/workspace/Lucene-Solr-Tests-5.x-Java7/lucene/common-build.xml:1444: The following error occurred while executing this line:
/x1/jenkins/jenkins-slave/workspace/Lucene-Solr-Tests-5.x-Java7/lucene/common-build.xml:999: There were test failures: 507 suites, 2007 tests, 1 error, 59 ignored (25 assumptions)

Total time: 52 minutes 45 seconds
Build step 'Invoke Ant' marked build as failure
Archiving artifacts
Sending artifact delta relative to Lucene-Solr-Tests-5.x-Java7 #3254
Archived 4 artifacts
Archive block size is 32768
Received 0 blocks and 288033271 bytes
Compression is 0.0%
Took 46 sec
Recording test results
Email was triggered for: Failure
Sending email for trigger: Failure



Mime
View raw message