lucene-dev mailing list archives

Site index · List index
Message view « Date » · « Thread »
Top « Date » · « Thread »
From Policeman Jenkins Server <jenk...@thetaphi.de>
Subject [JENKINS] Lucene-Solr-trunk-Linux (64bit/jdk1.9.0-ea-b60) - Build # 13119 - Still Failing!
Date Fri, 19 Jun 2015 08:57:42 GMT
Build: http://jenkins.thetaphi.de/job/Lucene-Solr-trunk-Linux/13119/
Java: 64bit/jdk1.9.0-ea-b60 -XX:-UseCompressedOops -XX:+UseG1GC

1 tests failed.
FAILED:  junit.framework.TestSuite.org.apache.solr.cloud.HttpPartitionTest

Error Message:
ObjectTracker found 1 object(s) that were not released!!! [TransactionLog]

Stack Trace:
java.lang.AssertionError: ObjectTracker found 1 object(s) that were not released!!! [TransactionLog]
	at __randomizedtesting.SeedInfo.seed([F234AB4A49AAE75C]:0)
	at org.junit.Assert.fail(Assert.java:93)
	at org.junit.Assert.assertTrue(Assert.java:43)
	at org.junit.Assert.assertNull(Assert.java:551)
	at org.apache.solr.SolrTestCaseJ4.afterClass(SolrTestCaseJ4.java:235)
	at sun.reflect.GeneratedMethodAccessor37.invoke(Unknown Source)
	at sun.reflect.DelegatingMethodAccessorImpl.invoke(DelegatingMethodAccessorImpl.java:43)
	at java.lang.reflect.Method.invoke(Method.java:502)
	at com.carrotsearch.randomizedtesting.RandomizedRunner.invoke(RandomizedRunner.java:1627)
	at com.carrotsearch.randomizedtesting.RandomizedRunner$5.evaluate(RandomizedRunner.java:799)
	at com.carrotsearch.randomizedtesting.rules.StatementAdapter.evaluate(StatementAdapter.java:36)
	at com.carrotsearch.randomizedtesting.rules.SystemPropertiesRestoreRule$1.evaluate(SystemPropertiesRestoreRule.java:57)
	at org.apache.lucene.util.AbstractBeforeAfterRule$1.evaluate(AbstractBeforeAfterRule.java:46)
	at com.carrotsearch.randomizedtesting.rules.StatementAdapter.evaluate(StatementAdapter.java:36)
	at org.apache.lucene.util.TestRuleStoreClassName$1.evaluate(TestRuleStoreClassName.java:42)
	at com.carrotsearch.randomizedtesting.rules.NoShadowingOrOverridesOnMethodsRule$1.evaluate(NoShadowingOrOverridesOnMethodsRule.java:39)
	at com.carrotsearch.randomizedtesting.rules.NoShadowingOrOverridesOnMethodsRule$1.evaluate(NoShadowingOrOverridesOnMethodsRule.java:39)
	at com.carrotsearch.randomizedtesting.rules.StatementAdapter.evaluate(StatementAdapter.java:36)
	at com.carrotsearch.randomizedtesting.rules.StatementAdapter.evaluate(StatementAdapter.java:36)
	at com.carrotsearch.randomizedtesting.rules.StatementAdapter.evaluate(StatementAdapter.java:36)
	at org.apache.lucene.util.TestRuleAssertionsRequired$1.evaluate(TestRuleAssertionsRequired.java:54)
	at org.apache.lucene.util.TestRuleMarkFailure$1.evaluate(TestRuleMarkFailure.java:48)
	at org.apache.lucene.util.TestRuleIgnoreAfterMaxFailures$1.evaluate(TestRuleIgnoreAfterMaxFailures.java:65)
	at org.apache.lucene.util.TestRuleIgnoreTestSuites$1.evaluate(TestRuleIgnoreTestSuites.java:55)
	at com.carrotsearch.randomizedtesting.rules.StatementAdapter.evaluate(StatementAdapter.java:36)
	at com.carrotsearch.randomizedtesting.ThreadLeakControl$StatementRunner.run(ThreadLeakControl.java:365)
	at java.lang.Thread.run(Thread.java:745)




Build Log:
[...truncated 10589 lines...]
   [junit4] Suite: org.apache.solr.cloud.HttpPartitionTest
   [junit4]   2> Creating dataDir: /home/jenkins/workspace/Lucene-Solr-trunk-Linux/solr/build/solr-core/test/J1/temp/solr.cloud.HttpPartitionTest_F234AB4A49AAE75C-001/init-core-data-001
   [junit4]   2> 1027739 INFO  (SUITE-HttpPartitionTest-seed#[F234AB4A49AAE75C]-worker) [    ] o.a.s.BaseDistributedSearchTestCase Setting hostContext system property: /
   [junit4]   2> 1027741 INFO  (TEST-HttpPartitionTest.test-seed#[F234AB4A49AAE75C]) [    ] o.a.s.c.ZkTestServer STARTING ZK TEST SERVER
   [junit4]   2> 1027741 INFO  (Thread-3554) [    ] o.a.s.c.ZkTestServer client port:0.0.0.0/0.0.0.0:0
   [junit4]   2> 1027742 INFO  (Thread-3554) [    ] o.a.s.c.ZkTestServer Starting server
   [junit4]   2> 1027841 INFO  (TEST-HttpPartitionTest.test-seed#[F234AB4A49AAE75C]) [    ] o.a.s.c.ZkTestServer start zk server on port:34848
   [junit4]   2> 1027848 INFO  (TEST-HttpPartitionTest.test-seed#[F234AB4A49AAE75C]) [    ] o.a.s.c.AbstractZkTestCase put /home/jenkins/workspace/Lucene-Solr-trunk-Linux/solr/core/src/test-files/solr/collection1/conf/solrconfig-tlog.xml to /configs/conf1/solrconfig.xml
   [junit4]   2> 1027849 INFO  (TEST-HttpPartitionTest.test-seed#[F234AB4A49AAE75C]) [    ] o.a.s.c.AbstractZkTestCase put /home/jenkins/workspace/Lucene-Solr-trunk-Linux/solr/core/src/test-files/solr/collection1/conf/schema.xml to /configs/conf1/schema.xml
   [junit4]   2> 1027849 INFO  (TEST-HttpPartitionTest.test-seed#[F234AB4A49AAE75C]) [    ] o.a.s.c.AbstractZkTestCase put /home/jenkins/workspace/Lucene-Solr-trunk-Linux/solr/core/src/test-files/solr/collection1/conf/solrconfig.snippet.randomindexconfig.xml to /configs/conf1/solrconfig.snippet.randomindexconfig.xml
   [junit4]   2> 1027850 INFO  (TEST-HttpPartitionTest.test-seed#[F234AB4A49AAE75C]) [    ] o.a.s.c.AbstractZkTestCase put /home/jenkins/workspace/Lucene-Solr-trunk-Linux/solr/core/src/test-files/solr/collection1/conf/stopwords.txt to /configs/conf1/stopwords.txt
   [junit4]   2> 1027850 INFO  (TEST-HttpPartitionTest.test-seed#[F234AB4A49AAE75C]) [    ] o.a.s.c.AbstractZkTestCase put /home/jenkins/workspace/Lucene-Solr-trunk-Linux/solr/core/src/test-files/solr/collection1/conf/protwords.txt to /configs/conf1/protwords.txt
   [junit4]   2> 1027851 INFO  (TEST-HttpPartitionTest.test-seed#[F234AB4A49AAE75C]) [    ] o.a.s.c.AbstractZkTestCase put /home/jenkins/workspace/Lucene-Solr-trunk-Linux/solr/core/src/test-files/solr/collection1/conf/currency.xml to /configs/conf1/currency.xml
   [junit4]   2> 1027851 INFO  (TEST-HttpPartitionTest.test-seed#[F234AB4A49AAE75C]) [    ] o.a.s.c.AbstractZkTestCase put /home/jenkins/workspace/Lucene-Solr-trunk-Linux/solr/core/src/test-files/solr/collection1/conf/enumsConfig.xml to /configs/conf1/enumsConfig.xml
   [junit4]   2> 1027852 INFO  (TEST-HttpPartitionTest.test-seed#[F234AB4A49AAE75C]) [    ] o.a.s.c.AbstractZkTestCase put /home/jenkins/workspace/Lucene-Solr-trunk-Linux/solr/core/src/test-files/solr/collection1/conf/open-exchange-rates.json to /configs/conf1/open-exchange-rates.json
   [junit4]   2> 1027852 INFO  (TEST-HttpPartitionTest.test-seed#[F234AB4A49AAE75C]) [    ] o.a.s.c.AbstractZkTestCase put /home/jenkins/workspace/Lucene-Solr-trunk-Linux/solr/core/src/test-files/solr/collection1/conf/mapping-ISOLatin1Accent.txt to /configs/conf1/mapping-ISOLatin1Accent.txt
   [junit4]   2> 1027853 INFO  (TEST-HttpPartitionTest.test-seed#[F234AB4A49AAE75C]) [    ] o.a.s.c.AbstractZkTestCase put /home/jenkins/workspace/Lucene-Solr-trunk-Linux/solr/core/src/test-files/solr/collection1/conf/old_synonyms.txt to /configs/conf1/old_synonyms.txt
   [junit4]   2> 1027853 INFO  (TEST-HttpPartitionTest.test-seed#[F234AB4A49AAE75C]) [    ] o.a.s.c.AbstractZkTestCase put /home/jenkins/workspace/Lucene-Solr-trunk-Linux/solr/core/src/test-files/solr/collection1/conf/synonyms.txt to /configs/conf1/synonyms.txt
   [junit4]   2> 1027899 INFO  (TEST-HttpPartitionTest.test-seed#[F234AB4A49AAE75C]) [    ] o.a.s.SolrTestCaseJ4 Writing core.properties file to /home/jenkins/workspace/Lucene-Solr-trunk-Linux/solr/build/solr-core/test/J1/temp/solr.cloud.HttpPartitionTest_F234AB4A49AAE75C-001/control-001/cores/collection1
   [junit4]   2> 1027901 INFO  (TEST-HttpPartitionTest.test-seed#[F234AB4A49AAE75C]) [    ] o.e.j.s.Server jetty-9.2.11.v20150529
   [junit4]   2> 1027902 INFO  (TEST-HttpPartitionTest.test-seed#[F234AB4A49AAE75C]) [    ] o.e.j.s.h.ContextHandler Started o.e.j.s.ServletContextHandler@5a0b68b7{/,null,AVAILABLE}
   [junit4]   2> 1027902 INFO  (TEST-HttpPartitionTest.test-seed#[F234AB4A49AAE75C]) [    ] o.e.j.s.ServerConnector Started ServerConnector@596105bf{HTTP/1.1}{127.0.0.1:34651}
   [junit4]   2> 1027902 INFO  (TEST-HttpPartitionTest.test-seed#[F234AB4A49AAE75C]) [    ] o.e.j.s.Server Started @1029379ms
   [junit4]   2> 1027902 INFO  (TEST-HttpPartitionTest.test-seed#[F234AB4A49AAE75C]) [    ] o.a.s.c.s.e.JettySolrRunner Jetty properties: {solr.data.dir=/home/jenkins/workspace/Lucene-Solr-trunk-Linux/solr/build/solr-core/test/J1/temp/solr.cloud.HttpPartitionTest_F234AB4A49AAE75C-001/tempDir-001/control/data, hostContext=/, hostPort=52384, coreRootDirectory=/home/jenkins/workspace/Lucene-Solr-trunk-Linux/solr/build/solr-core/test/J1/temp/solr.cloud.HttpPartitionTest_F234AB4A49AAE75C-001/control-001/cores}
   [junit4]   2> 1027903 INFO  (TEST-HttpPartitionTest.test-seed#[F234AB4A49AAE75C]) [    ] o.a.s.s.SolrDispatchFilter SolrDispatchFilter.init(): sun.misc.Launcher$AppClassLoader@759ebb3d
   [junit4]   2> 1027903 INFO  (TEST-HttpPartitionTest.test-seed#[F234AB4A49AAE75C]) [    ] o.a.s.c.SolrResourceLoader new SolrResourceLoader for directory: '/home/jenkins/workspace/Lucene-Solr-trunk-Linux/solr/build/solr-core/test/J1/temp/solr.cloud.HttpPartitionTest_F234AB4A49AAE75C-001/control-001/'
   [junit4]   2> 1027911 INFO  (TEST-HttpPartitionTest.test-seed#[F234AB4A49AAE75C]) [    ] o.a.s.c.SolrXmlConfig Loading container configuration from /home/jenkins/workspace/Lucene-Solr-trunk-Linux/solr/build/solr-core/test/J1/temp/solr.cloud.HttpPartitionTest_F234AB4A49AAE75C-001/control-001/solr.xml
   [junit4]   2> 1027915 INFO  (TEST-HttpPartitionTest.test-seed#[F234AB4A49AAE75C]) [    ] o.a.s.c.CoresLocator Config-defined core root directory: /home/jenkins/workspace/Lucene-Solr-trunk-Linux/solr/build/solr-core/test/J1/temp/solr.cloud.HttpPartitionTest_F234AB4A49AAE75C-001/control-001/cores
   [junit4]   2> 1027915 INFO  (TEST-HttpPartitionTest.test-seed#[F234AB4A49AAE75C]) [    ] o.a.s.c.CoreContainer New CoreContainer 160514726
   [junit4]   2> 1027915 INFO  (TEST-HttpPartitionTest.test-seed#[F234AB4A49AAE75C]) [    ] o.a.s.c.CoreContainer Loading cores into CoreContainer [instanceDir=/home/jenkins/workspace/Lucene-Solr-trunk-Linux/solr/build/solr-core/test/J1/temp/solr.cloud.HttpPartitionTest_F234AB4A49AAE75C-001/control-001/]
   [junit4]   2> 1027915 INFO  (TEST-HttpPartitionTest.test-seed#[F234AB4A49AAE75C]) [    ] o.a.s.c.CoreContainer loading shared library: /home/jenkins/workspace/Lucene-Solr-trunk-Linux/solr/build/solr-core/test/J1/temp/solr.cloud.HttpPartitionTest_F234AB4A49AAE75C-001/control-001/lib
   [junit4]   2> 1027915 WARN  (TEST-HttpPartitionTest.test-seed#[F234AB4A49AAE75C]) [    ] o.a.s.c.SolrResourceLoader Can't find (or read) directory to add to classloader: lib (resolved as: /home/jenkins/workspace/Lucene-Solr-trunk-Linux/solr/build/solr-core/test/J1/temp/solr.cloud.HttpPartitionTest_F234AB4A49AAE75C-001/control-001/lib).
   [junit4]   2> 1027919 INFO  (TEST-HttpPartitionTest.test-seed#[F234AB4A49AAE75C]) [    ] o.a.s.h.c.HttpShardHandlerFactory created with socketTimeout : 90000,urlScheme : ,connTimeout : 15000,maxConnectionsPerHost : 20,maxConnections : 10000,corePoolSize : 0,maximumPoolSize : 2147483647,maxThreadIdleTime : 5,sizeOfQueue : -1,fairnessPolicy : false,useRetries : false,
   [junit4]   2> 1027920 INFO  (TEST-HttpPartitionTest.test-seed#[F234AB4A49AAE75C]) [    ] o.a.s.u.UpdateShardHandler Creating UpdateShardHandler HTTP client with params: socketTimeout=340000&connTimeout=45000&retry=true
   [junit4]   2> 1027921 INFO  (TEST-HttpPartitionTest.test-seed#[F234AB4A49AAE75C]) [    ] o.a.s.l.LogWatcher SLF4J impl is org.slf4j.impl.Log4jLoggerFactory
   [junit4]   2> 1027921 INFO  (TEST-HttpPartitionTest.test-seed#[F234AB4A49AAE75C]) [    ] o.a.s.l.LogWatcher Registering Log Listener [Log4j (org.slf4j.impl.Log4jLoggerFactory)]
   [junit4]   2> 1027921 INFO  (TEST-HttpPartitionTest.test-seed#[F234AB4A49AAE75C]) [    ] o.a.s.c.ZkContainer Zookeeper client=127.0.0.1:34848/solr
   [junit4]   2> 1027921 INFO  (TEST-HttpPartitionTest.test-seed#[F234AB4A49AAE75C]) [    ] o.a.s.c.ZkController zkHost includes chroot
   [junit4]   2> 1027927 INFO  (TEST-HttpPartitionTest.test-seed#[F234AB4A49AAE75C]) [n:127.0.0.1:52384_    ] o.a.s.c.ZkController Register node as live in ZooKeeper:/live_nodes/127.0.0.1:52384_
   [junit4]   2> 1027928 INFO  (TEST-HttpPartitionTest.test-seed#[F234AB4A49AAE75C]) [n:127.0.0.1:52384_    ] o.a.s.c.Overseer Overseer (id=null) closing
   [junit4]   2> 1027929 INFO  (TEST-HttpPartitionTest.test-seed#[F234AB4A49AAE75C]) [n:127.0.0.1:52384_    ] o.a.s.c.LeaderElector Joined leadership election with path: /overseer_elect/election/94024746679336963-127.0.0.1:52384_-n_0000000000
   [junit4]   2> 1027929 INFO  (TEST-HttpPartitionTest.test-seed#[F234AB4A49AAE75C]) [n:127.0.0.1:52384_    ] o.a.s.c.OverseerElectionContext I am going to be the leader 127.0.0.1:52384_
   [junit4]   2> 1027929 INFO  (TEST-HttpPartitionTest.test-seed#[F234AB4A49AAE75C]) [n:127.0.0.1:52384_    ] o.a.s.c.Overseer Overseer (id=94024746679336963-127.0.0.1:52384_-n_0000000000) starting
   [junit4]   2> 1027931 INFO  (TEST-HttpPartitionTest.test-seed#[F234AB4A49AAE75C]) [n:127.0.0.1:52384_    ] o.a.s.c.OverseerAutoReplicaFailoverThread Starting OverseerAutoReplicaFailoverThread autoReplicaFailoverWorkLoopDelay=10000 autoReplicaFailoverWaitAfterExpiration=30000 autoReplicaFailoverBadNodeExpiration=60000
   [junit4]   2> 1027931 INFO  (OverseerCollectionProcessor-94024746679336963-127.0.0.1:52384_-n_0000000000) [n:127.0.0.1:52384_    ] o.a.s.c.OverseerCollectionProcessor Process current queue of collection creations
   [junit4]   2> 1027932 INFO  (OverseerStateUpdate-94024746679336963-127.0.0.1:52384_-n_0000000000) [n:127.0.0.1:52384_    ] o.a.s.c.Overseer Starting to work on the main queue
   [junit4]   2> 1027933 INFO  (TEST-HttpPartitionTest.test-seed#[F234AB4A49AAE75C]) [n:127.0.0.1:52384_    ] o.a.s.c.CoreContainer No authentication plugin used.
   [junit4]   2> 1027933 INFO  (TEST-HttpPartitionTest.test-seed#[F234AB4A49AAE75C]) [n:127.0.0.1:52384_    ] o.a.s.c.CoreContainer Security conf doesn't exist. Skipping setup for authorization module.
   [junit4]   2> 1027934 INFO  (TEST-HttpPartitionTest.test-seed#[F234AB4A49AAE75C]) [n:127.0.0.1:52384_    ] o.a.s.c.CoresLocator Looking for core definitions underneath /home/jenkins/workspace/Lucene-Solr-trunk-Linux/solr/build/solr-core/test/J1/temp/solr.cloud.HttpPartitionTest_F234AB4A49AAE75C-001/control-001/cores
   [junit4]   2> 1027934 INFO  (TEST-HttpPartitionTest.test-seed#[F234AB4A49AAE75C]) [n:127.0.0.1:52384_    ] o.a.s.c.SolrCore Created CoreDescriptor: {name=collection1, config=solrconfig.xml, transient=false, schema=schema.xml, loadOnStartup=true, instanceDir=/home/jenkins/workspace/Lucene-Solr-trunk-Linux/solr/build/solr-core/test/J1/temp/solr.cloud.HttpPartitionTest_F234AB4A49AAE75C-001/control-001/cores/collection1, collection=control_collection, absoluteInstDir=/home/jenkins/workspace/Lucene-Solr-trunk-Linux/solr/build/solr-core/test/J1/temp/solr.cloud.HttpPartitionTest_F234AB4A49AAE75C-001/control-001/cores/collection1/, coreNodeName=, dataDir=data/, shard=}
   [junit4]   2> 1027934 INFO  (TEST-HttpPartitionTest.test-seed#[F234AB4A49AAE75C]) [n:127.0.0.1:52384_    ] o.a.s.c.CoresLocator Found core collection1 in /home/jenkins/workspace/Lucene-Solr-trunk-Linux/solr/build/solr-core/test/J1/temp/solr.cloud.HttpPartitionTest_F234AB4A49AAE75C-001/control-001/cores/collection1/
   [junit4]   2> 1027934 INFO  (TEST-HttpPartitionTest.test-seed#[F234AB4A49AAE75C]) [n:127.0.0.1:52384_    ] o.a.s.c.CoresLocator Found 1 core definitions
   [junit4]   2> 1027935 INFO  (coreLoadExecutor-3706-thread-1-processing-n:127.0.0.1:52384_) [n:127.0.0.1:52384_ c:control_collection   x:collection1] o.a.s.c.ZkController publishing state=down
   [junit4]   2> 1027935 INFO  (coreLoadExecutor-3706-thread-1-processing-n:127.0.0.1:52384_) [n:127.0.0.1:52384_ c:control_collection   x:collection1] o.a.s.c.ZkController numShards not found on descriptor - reading it from system property
   [junit4]   2> 1027935 INFO  (TEST-HttpPartitionTest.test-seed#[F234AB4A49AAE75C]) [n:127.0.0.1:52384_    ] o.a.s.s.SolrDispatchFilter user.dir=/home/jenkins/workspace/Lucene-Solr-trunk-Linux/solr/build/solr-core/test/J1
   [junit4]   2> 1027935 INFO  (TEST-HttpPartitionTest.test-seed#[F234AB4A49AAE75C]) [n:127.0.0.1:52384_    ] o.a.s.s.SolrDispatchFilter SolrDispatchFilter.init() done
   [junit4]   2> 1027935 INFO  (coreLoadExecutor-3706-thread-1-processing-n:127.0.0.1:52384_) [n:127.0.0.1:52384_ c:control_collection   x:collection1] o.a.s.c.ZkController look for our core node name
   [junit4]   2> 1027935 INFO  (zkCallback-768-thread-1-processing-n:127.0.0.1:52384_) [n:127.0.0.1:52384_    ] o.a.s.c.DistributedQueue NodeChildrenChanged fired on path /overseer/queue state SyncConnected
   [junit4]   2> 1027936 INFO  (OverseerStateUpdate-94024746679336963-127.0.0.1:52384_-n_0000000000) [n:127.0.0.1:52384_    ] o.a.s.c.Overseer processMessage: queueSize: 1, message = {
   [junit4]   2>   "core":"collection1",
   [junit4]   2>   "roles":null,
   [junit4]   2>   "base_url":"http://127.0.0.1:52384",
   [junit4]   2>   "node_name":"127.0.0.1:52384_",
   [junit4]   2>   "numShards":"1",
   [junit4]   2>   "state":"down",
   [junit4]   2>   "shard":null,
   [junit4]   2>   "collection":"control_collection",
   [junit4]   2>   "operation":"state"} current state version: 0
   [junit4]   2> 1027936 INFO  (OverseerStateUpdate-94024746679336963-127.0.0.1:52384_-n_0000000000) [n:127.0.0.1:52384_    ] o.a.s.c.o.ReplicaMutator Update state numShards=1 message={
   [junit4]   2>   "core":"collection1",
   [junit4]   2>   "roles":null,
   [junit4]   2>   "base_url":"http://127.0.0.1:52384",
   [junit4]   2>   "node_name":"127.0.0.1:52384_",
   [junit4]   2>   "numShards":"1",
   [junit4]   2>   "state":"down",
   [junit4]   2>   "shard":null,
   [junit4]   2>   "collection":"control_collection",
   [junit4]   2>   "operation":"state"}
   [junit4]   2> 1027936 INFO  (OverseerStateUpdate-94024746679336963-127.0.0.1:52384_-n_0000000000) [n:127.0.0.1:52384_    ] o.a.s.c.o.ClusterStateMutator building a new cName: control_collection
   [junit4]   2> 1027936 INFO  (OverseerStateUpdate-94024746679336963-127.0.0.1:52384_-n_0000000000) [n:127.0.0.1:52384_    ] o.a.s.c.o.ReplicaMutator Assigning new node to shard shard=shard1
   [junit4]   2> 1028935 INFO  (coreLoadExecutor-3706-thread-1-processing-n:127.0.0.1:52384_) [n:127.0.0.1:52384_ c:control_collection   x:collection1] o.a.s.c.ZkController waiting to find shard id in clusterstate for collection1
   [junit4]   2> 1028936 INFO  (coreLoadExecutor-3706-thread-1-processing-n:127.0.0.1:52384_) [n:127.0.0.1:52384_ c:control_collection   x:collection1] o.a.s.c.ZkController Check for collection zkNode:control_collection
   [junit4]   2> 1028936 INFO  (coreLoadExecutor-3706-thread-1-processing-n:127.0.0.1:52384_) [n:127.0.0.1:52384_ c:control_collection   x:collection1] o.a.s.c.ZkController Collection zkNode exists
   [junit4]   2> 1028936 INFO  (coreLoadExecutor-3706-thread-1-processing-n:127.0.0.1:52384_) [n:127.0.0.1:52384_ c:control_collection   x:collection1] o.a.s.c.SolrResourceLoader new SolrResourceLoader for directory: '/home/jenkins/workspace/Lucene-Solr-trunk-Linux/solr/build/solr-core/test/J1/temp/solr.cloud.HttpPartitionTest_F234AB4A49AAE75C-001/control-001/cores/collection1/'
   [junit4]   2> 1028944 INFO  (coreLoadExecutor-3706-thread-1-processing-n:127.0.0.1:52384_) [n:127.0.0.1:52384_ c:control_collection   x:collection1] o.a.s.c.Config loaded config solrconfig.xml with version 0 
   [junit4]   2> 1028946 INFO  (coreLoadExecutor-3706-thread-1-processing-n:127.0.0.1:52384_) [n:127.0.0.1:52384_ c:control_collection   x:collection1] o.a.s.c.SolrConfig current version of requestparams : -1
   [junit4]   2> 1028949 INFO  (coreLoadExecutor-3706-thread-1-processing-n:127.0.0.1:52384_) [n:127.0.0.1:52384_ c:control_collection   x:collection1] o.a.s.c.SolrConfig Using Lucene MatchVersion: 6.0.0
   [junit4]   2> 1028956 INFO  (coreLoadExecutor-3706-thread-1-processing-n:127.0.0.1:52384_) [n:127.0.0.1:52384_ c:control_collection   x:collection1] o.a.s.c.Config Loaded SolrConfig: solrconfig.xml
   [junit4]   2> 1028956 INFO  (coreLoadExecutor-3706-thread-1-processing-n:127.0.0.1:52384_) [n:127.0.0.1:52384_ c:control_collection   x:collection1] o.a.s.s.IndexSchema Reading Solr Schema from /configs/conf1/schema.xml
   [junit4]   2> 1028959 INFO  (coreLoadExecutor-3706-thread-1-processing-n:127.0.0.1:52384_) [n:127.0.0.1:52384_ c:control_collection   x:collection1] o.a.s.s.IndexSchema [collection1] Schema name=test
   [junit4]   2> 1029029 INFO  (coreLoadExecutor-3706-thread-1-processing-n:127.0.0.1:52384_) [n:127.0.0.1:52384_ c:control_collection   x:collection1] o.a.s.s.OpenExchangeRatesOrgProvider Initialized with rates=open-exchange-rates.json, refreshInterval=1440.
   [junit4]   2> 1029033 INFO  (coreLoadExecutor-3706-thread-1-processing-n:127.0.0.1:52384_) [n:127.0.0.1:52384_ c:control_collection   x:collection1] o.a.s.s.IndexSchema default search field in schema is text
   [junit4]   2> 1029033 INFO  (coreLoadExecutor-3706-thread-1-processing-n:127.0.0.1:52384_) [n:127.0.0.1:52384_ c:control_collection   x:collection1] o.a.s.s.IndexSchema unique key field: id
   [junit4]   2> 1029037 INFO  (coreLoadExecutor-3706-thread-1-processing-n:127.0.0.1:52384_) [n:127.0.0.1:52384_ c:control_collection   x:collection1] o.a.s.s.FileExchangeRateProvider Reloading exchange rates from file currency.xml
   [junit4]   2> 1029038 INFO  (coreLoadExecutor-3706-thread-1-processing-n:127.0.0.1:52384_) [n:127.0.0.1:52384_ c:control_collection   x:collection1] o.a.s.s.FileExchangeRateProvider Reloading exchange rates from file currency.xml
   [junit4]   2> 1029039 INFO  (coreLoadExecutor-3706-thread-1-processing-n:127.0.0.1:52384_) [n:127.0.0.1:52384_ c:control_collection   x:collection1] o.a.s.s.OpenExchangeRatesOrgProvider Reloading exchange rates from open-exchange-rates.json
   [junit4]   2> 1029039 WARN  (coreLoadExecutor-3706-thread-1-processing-n:127.0.0.1:52384_) [n:127.0.0.1:52384_ c:control_collection   x:collection1] o.a.s.s.OpenExchangeRatesOrgProvider Unknown key IMPORTANT NOTE
   [junit4]   2> 1029039 WARN  (coreLoadExecutor-3706-thread-1-processing-n:127.0.0.1:52384_) [n:127.0.0.1:52384_ c:control_collection   x:collection1] o.a.s.s.OpenExchangeRatesOrgProvider Expected key, got STRING
   [junit4]   2> 1029040 INFO  (coreLoadExecutor-3706-thread-1-processing-n:127.0.0.1:52384_) [n:127.0.0.1:52384_ c:control_collection   x:collection1] o.a.s.s.OpenExchangeRatesOrgProvider Reloading exchange rates from open-exchange-rates.json
   [junit4]   2> 1029040 WARN  (coreLoadExecutor-3706-thread-1-processing-n:127.0.0.1:52384_) [n:127.0.0.1:52384_ c:control_collection   x:collection1] o.a.s.s.OpenExchangeRatesOrgProvider Unknown key IMPORTANT NOTE
   [junit4]   2> 1029040 WARN  (coreLoadExecutor-3706-thread-1-processing-n:127.0.0.1:52384_) [n:127.0.0.1:52384_ c:control_collection   x:collection1] o.a.s.s.OpenExchangeRatesOrgProvider Expected key, got STRING
   [junit4]   2> 1029040 INFO  (coreLoadExecutor-3706-thread-1-processing-n:127.0.0.1:52384_) [n:127.0.0.1:52384_ c:control_collection   x:collection1] o.a.s.c.CoreContainer Creating SolrCore 'collection1' using configuration from collection control_collection
   [junit4]   2> 1029040 INFO  (coreLoadExecutor-3706-thread-1-processing-n:127.0.0.1:52384_) [n:127.0.0.1:52384_ c:control_collection s:shard1 r:core_node1 x:collection1] o.a.s.c.SolrCore org.apache.solr.core.MockDirectoryFactory
   [junit4]   2> 1029041 INFO  (coreLoadExecutor-3706-thread-1-processing-n:127.0.0.1:52384_) [n:127.0.0.1:52384_ c:control_collection s:shard1 r:core_node1 x:collection1] o.a.s.c.SolrCore [[collection1] ] Opening new SolrCore at [/home/jenkins/workspace/Lucene-Solr-trunk-Linux/solr/build/solr-core/test/J1/temp/solr.cloud.HttpPartitionTest_F234AB4A49AAE75C-001/control-001/cores/collection1/], dataDir=[null]
   [junit4]   2> 1029041 INFO  (coreLoadExecutor-3706-thread-1-processing-n:127.0.0.1:52384_) [n:127.0.0.1:52384_ c:control_collection s:shard1 r:core_node1 x:collection1] o.a.s.c.JmxMonitoredMap JMX monitoring is enabled. Adding Solr mbeans to JMX Server: com.sun.jmx.mbeanserver.JmxMBeanServer@6c35f5a9
   [junit4]   2> 1029041 INFO  (coreLoadExecutor-3706-thread-1-processing-n:127.0.0.1:52384_) [n:127.0.0.1:52384_ c:control_collection s:shard1 r:core_node1 x:collection1] o.a.s.c.CachingDirectoryFactory return new directory for /home/jenkins/workspace/Lucene-Solr-trunk-Linux/solr/build/solr-core/test/J1/temp/solr.cloud.HttpPartitionTest_F234AB4A49AAE75C-001/control-001/cores/collection1/data
   [junit4]   2> 1029041 INFO  (coreLoadExecutor-3706-thread-1-processing-n:127.0.0.1:52384_) [n:127.0.0.1:52384_ c:control_collection s:shard1 r:core_node1 x:collection1] o.a.s.c.SolrCore New index directory detected: old=null new=/home/jenkins/workspace/Lucene-Solr-trunk-Linux/solr/build/solr-core/test/J1/temp/solr.cloud.HttpPartitionTest_F234AB4A49AAE75C-001/control-001/cores/collection1/data/index/
   [junit4]   2> 1029041 WARN  (coreLoadExecutor-3706-thread-1-processing-n:127.0.0.1:52384_) [n:127.0.0.1:52384_ c:control_collection s:shard1 r:core_node1 x:collection1] o.a.s.c.SolrCore [collection1] Solr index directory '/home/jenkins/workspace/Lucene-Solr-trunk-Linux/solr/build/solr-core/test/J1/temp/solr.cloud.HttpPartitionTest_F234AB4A49AAE75C-001/control-001/cores/collection1/data/index' doesn't exist. Creating new index...
   [junit4]   2> 1029041 INFO  (coreLoadExecutor-3706-thread-1-processing-n:127.0.0.1:52384_) [n:127.0.0.1:52384_ c:control_collection s:shard1 r:core_node1 x:collection1] o.a.s.c.CachingDirectoryFactory return new directory for /home/jenkins/workspace/Lucene-Solr-trunk-Linux/solr/build/solr-core/test/J1/temp/solr.cloud.HttpPartitionTest_F234AB4A49AAE75C-001/control-001/cores/collection1/data/index
   [junit4]   2> 1029042 INFO  (coreLoadExecutor-3706-thread-1-processing-n:127.0.0.1:52384_) [n:127.0.0.1:52384_ c:control_collection s:shard1 r:core_node1 x:collection1] o.a.s.u.RandomMergePolicy RandomMergePolicy wrapping class org.apache.lucene.index.LogDocMergePolicy: [LogDocMergePolicy: minMergeSize=1000, mergeFactor=21, maxMergeSize=9223372036854775807, maxMergeSizeForForcedMerge=9223372036854775807, calibrateSizeByDeletes=true, maxMergeDocs=2147483647, maxCFSSegmentSizeMB=8.796093022207999E12, noCFSRatio=0.5451409602304521]
   [junit4]   2> 1029042 INFO  (coreLoadExecutor-3706-thread-1-processing-n:127.0.0.1:52384_) [n:127.0.0.1:52384_ c:control_collection s:shard1 r:core_node1 x:collection1] o.a.s.c.SolrCore SolrDeletionPolicy.onCommit: commits: num=1
   [junit4]   2> 	commit{dir=MockDirectoryWrapper(RAMDirectory@6873552d lockFactory=org.apache.lucene.store.SingleInstanceLockFactory@4dec3835),segFN=segments_1,generation=1}
   [junit4]   2> 1029042 INFO  (coreLoadExecutor-3706-thread-1-processing-n:127.0.0.1:52384_) [n:127.0.0.1:52384_ c:control_collection s:shard1 r:core_node1 x:collection1] o.a.s.c.SolrCore newest commit generation = 1
   [junit4]   2> 1029042 INFO  (OldIndexDirectoryCleanupThreadForCore-collection1) [n:127.0.0.1:52384_ c:control_collection s:shard1 r:core_node1 x:collection1] o.a.s.c.SolrCore Looking for old index directories to cleanup for core collection1 in /home/jenkins/workspace/Lucene-Solr-trunk-Linux/solr/build/solr-core/test/J1/temp/solr.cloud.HttpPartitionTest_F234AB4A49AAE75C-001/control-001/cores/collection1/data/
   [junit4]   2> 1029043 WARN  (OldIndexDirectoryCleanupThreadForCore-collection1) [n:127.0.0.1:52384_ c:control_collection s:shard1 r:core_node1 x:collection1] o.a.s.c.DirectoryFactory /home/jenkins/workspace/Lucene-Solr-trunk-Linux/solr/build/solr-core/test/J1/temp/solr.cloud.HttpPartitionTest_F234AB4A49AAE75C-001/control-001/cores/collection1/data/ does not point to a valid data directory; skipping clean-up of old index directories.
   [junit4]   2> 1029045 INFO  (coreLoadExecutor-3706-thread-1-processing-n:127.0.0.1:52384_) [n:127.0.0.1:52384_ c:control_collection s:shard1 r:core_node1 x:collection1] o.a.s.u.p.UpdateRequestProcessorChain creating updateRequestProcessorChain "nodistrib"
   [junit4]   2> 1029045 INFO  (coreLoadExecutor-3706-thread-1-processing-n:127.0.0.1:52384_) [n:127.0.0.1:52384_ c:control_collection s:shard1 r:core_node1 x:collection1] o.a.s.u.p.UpdateRequestProcessorChain creating updateRequestProcessorChain "dedupe"
   [junit4]   2> 1029045 INFO  (coreLoadExecutor-3706-thread-1-processing-n:127.0.0.1:52384_) [n:127.0.0.1:52384_ c:control_collection s:shard1 r:core_node1 x:collection1] o.a.s.u.p.UpdateRequestProcessorChain inserting DistributedUpdateProcessorFactory into updateRequestProcessorChain "dedupe"
   [junit4]   2> 1029045 INFO  (coreLoadExecutor-3706-thread-1-processing-n:127.0.0.1:52384_) [n:127.0.0.1:52384_ c:control_collection s:shard1 r:core_node1 x:collection1] o.a.s.u.p.UpdateRequestProcessorChain creating updateRequestProcessorChain "stored_sig"
   [junit4]   2> 1029045 INFO  (coreLoadExecutor-3706-thread-1-processing-n:127.0.0.1:52384_) [n:127.0.0.1:52384_ c:control_collection s:shard1 r:core_node1 x:collection1] o.a.s.u.p.UpdateRequestProcessorChain inserting DistributedUpdateProcessorFactory into updateRequestProcessorChain "stored_sig"
   [junit4]   2> 1029045 INFO  (coreLoadExecutor-3706-thread-1-processing-n:127.0.0.1:52384_) [n:127.0.0.1:52384_ c:control_collection s:shard1 r:core_node1 x:collection1] o.a.s.u.p.UpdateRequestProcessorChain creating updateRequestProcessorChain "distrib-dup-test-chain-explicit"
   [junit4]   2> 1029045 INFO  (coreLoadExecutor-3706-thread-1-processing-n:127.0.0.1:52384_) [n:127.0.0.1:52384_ c:control_collection s:shard1 r:core_node1 x:collection1] o.a.s.u.p.UpdateRequestProcessorChain creating updateRequestProcessorChain "distrib-dup-test-chain-implicit"
   [junit4]   2> 1029046 INFO  (coreLoadExecutor-3706-thread-1-processing-n:127.0.0.1:52384_) [n:127.0.0.1:52384_ c:control_collection s:shard1 r:core_node1 x:collection1] o.a.s.u.p.UpdateRequestProcessorChain inserting DistributedUpdateProcessorFactory into updateRequestProcessorChain "distrib-dup-test-chain-implicit"
   [junit4]   2> 1029046 INFO  (coreLoadExecutor-3706-thread-1-processing-n:127.0.0.1:52384_) [n:127.0.0.1:52384_ c:control_collection s:shard1 r:core_node1 x:collection1] o.a.s.c.SolrCore no updateRequestProcessorChain defined as default, creating implicit default
   [junit4]   2> 1029047 INFO  (coreLoadExecutor-3706-thread-1-processing-n:127.0.0.1:52384_) [n:127.0.0.1:52384_ c:control_collection s:shard1 r:core_node1 x:collection1] o.a.s.h.l.XMLLoader xsltCacheLifetimeSeconds=60
   [junit4]   2> 1029047 INFO  (coreLoadExecutor-3706-thread-1-processing-n:127.0.0.1:52384_) [n:127.0.0.1:52384_ c:control_collection s:shard1 r:core_node1 x:collection1] o.a.s.h.l.XMLLoader xsltCacheLifetimeSeconds=60
   [junit4]   2> 1029048 INFO  (coreLoadExecutor-3706-thread-1-processing-n:127.0.0.1:52384_) [n:127.0.0.1:52384_ c:control_collection s:shard1 r:core_node1 x:collection1] o.a.s.h.l.XMLLoader xsltCacheLifetimeSeconds=60
   [junit4]   2> 1029048 INFO  (coreLoadExecutor-3706-thread-1-processing-n:127.0.0.1:52384_) [n:127.0.0.1:52384_ c:control_collection s:shard1 r:core_node1 x:collection1] o.a.s.h.l.XMLLoader xsltCacheLifetimeSeconds=60
   [junit4]   2> 1029050 INFO  (coreLoadExecutor-3706-thread-1-processing-n:127.0.0.1:52384_) [n:127.0.0.1:52384_ c:control_collection s:shard1 r:core_node1 x:collection1] o.a.s.c.RequestHandlers Registered paths: /admin/mbeans,standard,/update/csv,/update/json/docs,/admin/luke,/admin/segments,/get,/admin/system,/replication,/admin/properties,/config,/schema,/admin/plugins,/admin/logging,/update/json,/admin/threads,/admin/ping,/update,/admin/file
   [junit4]   2> 1029050 INFO  (coreLoadExecutor-3706-thread-1-processing-n:127.0.0.1:52384_) [n:127.0.0.1:52384_ c:control_collection s:shard1 r:core_node1 x:collection1] o.a.s.c.SolrCore Using default statsCache cache: org.apache.solr.search.stats.LocalStatsCache
   [junit4]   2> 1029050 INFO  (coreLoadExecutor-3706-thread-1-processing-n:127.0.0.1:52384_) [n:127.0.0.1:52384_ c:control_collection s:shard1 r:core_node1 x:collection1] o.a.s.u.UpdateHandler Using UpdateLog implementation: org.apache.solr.update.UpdateLog
   [junit4]   2> 1029050 INFO  (coreLoadExecutor-3706-thread-1-processing-n:127.0.0.1:52384_) [n:127.0.0.1:52384_ c:control_collection s:shard1 r:core_node1 x:collection1] o.a.s.u.UpdateLog Initializing UpdateLog: dataDir= defaultSyncLevel=FLUSH numRecordsToKeep=100 maxNumLogsToKeep=10 numVersionBuckets=65536
   [junit4]   2> 1029051 INFO  (coreLoadExecutor-3706-thread-1-processing-n:127.0.0.1:52384_) [n:127.0.0.1:52384_ c:control_collection s:shard1 r:core_node1 x:collection1] o.a.s.c.SolrCore Hard AutoCommit: disabled
   [junit4]   2> 1029051 INFO  (coreLoadExecutor-3706-thread-1-processing-n:127.0.0.1:52384_) [n:127.0.0.1:52384_ c:control_collection s:shard1 r:core_node1 x:collection1] o.a.s.c.SolrCore Soft AutoCommit: disabled
   [junit4]   2> 1029052 INFO  (coreLoadExecutor-3706-thread-1-processing-n:127.0.0.1:52384_) [n:127.0.0.1:52384_ c:control_collection s:shard1 r:core_node1 x:collection1] o.a.s.u.RandomMergePolicy RandomMergePolicy wrapping class org.apache.lucene.index.TieredMergePolicy: [TieredMergePolicy: maxMergeAtOnce=21, maxMergeAtOnceExplicit=30, maxMergedSegmentMB=38.4931640625, floorSegmentMB=0.9599609375, forceMergeDeletesPctAllowed=19.28028538148536, segmentsPerTier=47.0, maxCFSSegmentSizeMB=8.796093022207999E12, noCFSRatio=0.0
   [junit4]   2> 1029052 INFO  (coreLoadExecutor-3706-thread-1-processing-n:127.0.0.1:52384_) [n:127.0.0.1:52384_ c:control_collection s:shard1 r:core_node1 x:collection1] o.a.s.c.SolrCore SolrDeletionPolicy.onInit: commits: num=1
   [junit4]   2> 	commit{dir=MockDirectoryWrapper(RAMDirectory@6873552d lockFactory=org.apache.lucene.store.SingleInstanceLockFactory@4dec3835),segFN=segments_1,generation=1}
   [junit4]   2> 1029052 INFO  (coreLoadExecutor-3706-thread-1-processing-n:127.0.0.1:52384_) [n:127.0.0.1:52384_ c:control_collection s:shard1 r:core_node1 x:collection1] o.a.s.c.SolrCore newest commit generation = 1
   [junit4]   2> 1029052 INFO  (coreLoadExecutor-3706-thread-1-processing-n:127.0.0.1:52384_) [n:127.0.0.1:52384_ c:control_collection s:shard1 r:core_node1 x:collection1] o.a.s.s.SolrIndexSearcher Opening Searcher@63043d52[collection1] main
   [junit4]   2> 1029053 INFO  (coreLoadExecutor-3706-thread-1-processing-n:127.0.0.1:52384_) [n:127.0.0.1:52384_ c:control_collection s:shard1 r:core_node1 x:collection1] o.a.s.r.ManagedResourceStorage Setting up ZooKeeper-based storage for the RestManager with znodeBase: /configs/conf1
   [junit4]   2> 1029053 INFO  (coreLoadExecutor-3706-thread-1-processing-n:127.0.0.1:52384_) [n:127.0.0.1:52384_ c:control_collection s:shard1 r:core_node1 x:collection1] o.a.s.r.ManagedResourceStorage Configured ZooKeeperStorageIO with znodeBase: /configs/conf1
   [junit4]   2> 1029053 INFO  (coreLoadExecutor-3706-thread-1-processing-n:127.0.0.1:52384_) [n:127.0.0.1:52384_ c:control_collection s:shard1 r:core_node1 x:collection1] o.a.s.r.RestManager Initializing RestManager with initArgs: {}
   [junit4]   2> 1029053 INFO  (coreLoadExecutor-3706-thread-1-processing-n:127.0.0.1:52384_) [n:127.0.0.1:52384_ c:control_collection s:shard1 r:core_node1 x:collection1] o.a.s.r.ManagedResourceStorage Reading _rest_managed.json using ZooKeeperStorageIO:path=/configs/conf1
   [junit4]   2> 1029053 INFO  (coreLoadExecutor-3706-thread-1-processing-n:127.0.0.1:52384_) [n:127.0.0.1:52384_ c:control_collection s:shard1 r:core_node1 x:collection1] o.a.s.r.ManagedResourceStorage No data found for znode /configs/conf1/_rest_managed.json
   [junit4]   2> 1029053 INFO  (coreLoadExecutor-3706-thread-1-processing-n:127.0.0.1:52384_) [n:127.0.0.1:52384_ c:control_collection s:shard1 r:core_node1 x:collection1] o.a.s.r.ManagedResourceStorage Loaded null at path _rest_managed.json using ZooKeeperStorageIO:path=/configs/conf1
   [junit4]   2> 1029053 INFO  (coreLoadExecutor-3706-thread-1-processing-n:127.0.0.1:52384_) [n:127.0.0.1:52384_ c:control_collection s:shard1 r:core_node1 x:collection1] o.a.s.r.RestManager Initializing 0 registered ManagedResources
   [junit4]   2> 1029053 INFO  (coreLoadExecutor-3706-thread-1-processing-n:127.0.0.1:52384_) [n:127.0.0.1:52384_ c:control_collection s:shard1 r:core_node1 x:collection1] o.a.s.h.ReplicationHandler Commits will be reserved for  10000
   [junit4]   2> 1029054 INFO  (searcherExecutor-3707-thread-1-processing-n:127.0.0.1:52384_ x:collection1 s:shard1 c:control_collection r:core_node1) [n:127.0.0.1:52384_ c:control_collection s:shard1 r:core_node1 x:collection1] o.a.s.c.SolrCore [collection1] Registered new searcher Searcher@63043d52[collection1] main{ExitableDirectoryReader(UninvertingDirectoryReader())}
   [junit4]   2> 1029054 INFO  (coreLoadExecutor-3706-thread-1-processing-n:127.0.0.1:52384_) [n:127.0.0.1:52384_ c:control_collection s:shard1 r:core_node1 x:collection1] o.a.s.u.UpdateLog Looking up max value of version field to seed version buckets
   [junit4]   2> 1029054 INFO  (coreLoadExecutor-3706-thread-1-processing-n:127.0.0.1:52384_) [n:127.0.0.1:52384_ c:control_collection s:shard1 r:core_node1 x:collection1] o.a.s.u.VersionInfo Refreshing highest value of _version_ for 65536 version buckets from index
   [junit4]   2> 1029054 INFO  (coreLoadExecutor-3706-thread-1-processing-n:127.0.0.1:52384_) [n:127.0.0.1:52384_ c:control_collection s:shard1 r:core_node1 x:collection1] o.a.s.u.VersionInfo No terms found for _version_, cannot seed version bucket highest value from index
   [junit4]   2> 1029054 INFO  (coreLoadExecutor-3706-thread-1-processing-n:127.0.0.1:52384_) [n:127.0.0.1:52384_ c:control_collection s:shard1 r:core_node1 x:collection1] o.a.s.u.UpdateLog Could not find max version in index or recent updates, using new clock 1504395948244074496
   [junit4]   2> 1029056 INFO  (coreLoadExecutor-3706-thread-1-processing-n:127.0.0.1:52384_) [n:127.0.0.1:52384_ c:control_collection s:shard1 r:core_node1 x:collection1] o.a.s.u.UpdateLog Took 2 ms to seed version buckets with highest version 1504395948244074496
   [junit4]   2> 1029056 INFO  (coreLoadExecutor-3706-thread-1-processing-n:127.0.0.1:52384_) [n:127.0.0.1:52384_ c:control_collection s:shard1 r:core_node1 x:collection1] o.a.s.c.ZkController watch zkdir /configs/conf1
   [junit4]   2> 1029056 INFO  (coreLoadExecutor-3706-thread-1-processing-n:127.0.0.1:52384_) [n:127.0.0.1:52384_ c:control_collection s:shard1 r:core_node1 x:collection1] o.a.s.c.CoreContainer registering core: collection1
   [junit4]   2> 1029056 INFO  (coreZkRegister-3700-thread-1-processing-n:127.0.0.1:52384_ x:collection1 s:shard1 c:control_collection r:core_node1) [n:127.0.0.1:52384_ c:control_collection s:shard1 r:core_node1 x:collection1] o.a.s.c.ZkController Register replica - core:collection1 address:http://127.0.0.1:52384 collection:control_collection shard:shard1
   [junit4]   2> 1029057 INFO  (coreZkRegister-3700-thread-1-processing-n:127.0.0.1:52384_ x:collection1 s:shard1 c:control_collection r:core_node1) [n:127.0.0.1:52384_ c:control_collection s:shard1 r:core_node1 x:collection1] o.a.s.c.LeaderElector Joined leadership election with path: /collections/control_collection/leader_elect/shard1/election/94024746679336963-core_node1-n_0000000000
   [junit4]   2> 1029058 INFO  (coreZkRegister-3700-thread-1-processing-n:127.0.0.1:52384_ x:collection1 s:shard1 c:control_collection r:core_node1) [n:127.0.0.1:52384_ c:control_collection s:shard1 r:core_node1 x:collection1] o.a.s.c.ShardLeaderElectionContext Running the leader process for shard shard1
   [junit4]   2> 1029058 INFO  (zkCallback-768-thread-1-processing-n:127.0.0.1:52384_) [n:127.0.0.1:52384_    ] o.a.s.c.DistributedQueue NodeChildrenChanged fired on path /overseer/queue state SyncConnected
   [junit4]   2> 1029058 INFO  (coreZkRegister-3700-thread-1-processing-n:127.0.0.1:52384_ x:collection1 s:shard1 c:control_collection r:core_node1) [n:127.0.0.1:52384_ c:control_collection s:shard1 r:core_node1 x:collection1] o.a.s.c.ShardLeaderElectionContext Enough replicas found to continue.
   [junit4]   2> 1029059 INFO  (coreZkRegister-3700-thread-1-processing-n:127.0.0.1:52384_ x:collection1 s:shard1 c:control_collection r:core_node1) [n:127.0.0.1:52384_ c:control_collection s:shard1 r:core_node1 x:collection1] o.a.s.c.ShardLeaderElectionContext I may be the new leader - try and sync
   [junit4]   2> 1029059 INFO  (OverseerStateUpdate-94024746679336963-127.0.0.1:52384_-n_0000000000) [n:127.0.0.1:52384_    ] o.a.s.c.Overseer processMessage: queueSize: 1, message = {
   [junit4]   2>   "operation":"leader",
   [junit4]   2>   "shard":"shard1",
   [junit4]   2>   "collection":"control_collection"} current state version: 1
   [junit4]   2> 1029059 INFO  (coreZkRegister-3700-thread-1-processing-n:127.0.0.1:52384_ x:collection1 s:shard1 c:control_collection r:core_node1) [n:127.0.0.1:52384_ c:control_collection s:shard1 r:core_node1 x:collection1] o.a.s.c.SyncStrategy Sync replicas to http://127.0.0.1:52384/collection1/
   [junit4]   2> 1029059 INFO  (coreZkRegister-3700-thread-1-processing-n:127.0.0.1:52384_ x:collection1 s:shard1 c:control_collection r:core_node1) [n:127.0.0.1:52384_ c:control_collection s:shard1 r:core_node1 x:collection1] o.a.s.c.SyncStrategy Sync Success - now sync replicas to me
   [junit4]   2> 1029059 INFO  (coreZkRegister-3700-thread-1-processing-n:127.0.0.1:52384_ x:collection1 s:shard1 c:control_collection r:core_node1) [n:127.0.0.1:52384_ c:control_collection s:shard1 r:core_node1 x:collection1] o.a.s.c.SyncStrategy http://127.0.0.1:52384/collection1/ has no replicas
   [junit4]   2> 1029059 INFO  (coreZkRegister-3700-thread-1-processing-n:127.0.0.1:52384_ x:collection1 s:shard1 c:control_collection r:core_node1) [n:127.0.0.1:52384_ c:control_collection s:shard1 r:core_node1 x:collection1] o.a.s.c.ShardLeaderElectionContext I am the new leader: http://127.0.0.1:52384/collection1/ shard1
   [junit4]   2> 1029060 INFO  (zkCallback-768-thread-1-processing-n:127.0.0.1:52384_) [n:127.0.0.1:52384_    ] o.a.s.c.DistributedQueue NodeChildrenChanged fired on path /overseer/queue state SyncConnected
   [junit4]   2> 1029061 INFO  (OverseerStateUpdate-94024746679336963-127.0.0.1:52384_-n_0000000000) [n:127.0.0.1:52384_    ] o.a.s.c.Overseer processMessage: queueSize: 1, message = {
   [junit4]   2>   "operation":"leader",
   [junit4]   2>   "shard":"shard1",
   [junit4]   2>   "collection":"control_collection",
   [junit4]   2>   "base_url":"http://127.0.0.1:52384",
   [junit4]   2>   "core":"collection1",
   [junit4]   2>   "state":"active"} current state version: 1
   [junit4]   2> 1029211 INFO  (coreZkRegister-3700-thread-1-processing-n:127.0.0.1:52384_ x:collection1 s:shard1 c:control_collection r:core_node1) [n:127.0.0.1:52384_ c:control_collection s:shard1 r:core_node1 x:collection1] o.a.s.c.ZkController We are http://127.0.0.1:52384/collection1/ and leader is http://127.0.0.1:52384/collection1/
   [junit4]   2> 1029211 INFO  (coreZkRegister-3700-thread-1-processing-n:127.0.0.1:52384_ x:collection1 s:shard1 c:control_collection r:core_node1) [n:127.0.0.1:52384_ c:control_collection s:shard1 r:core_node1 x:collection1] o.a.s.c.ZkController No LogReplay needed for core=collection1 baseURL=http://127.0.0.1:52384
   [junit4]   2> 1029211 INFO  (coreZkRegister-3700-thread-1-processing-n:127.0.0.1:52384_ x:collection1 s:shard1 c:control_collection r:core_node1) [n:127.0.0.1:52384_ c:control_collection s:shard1 r:core_node1 x:collection1] o.a.s.c.ZkController I am the leader, no recovery necessary
   [junit4]   2> 1029211 INFO  (coreZkRegister-3700-thread-1-processing-n:127.0.0.1:52384_ x:collection1 s:shard1 c:control_collection r:core_node1) [n:127.0.0.1:52384_ c:control_collection s:shard1 r:core_node1 x:collection1] o.a.s.c.ZkController publishing state=active
   [junit4]   2> 1029211 INFO  (coreZkRegister-3700-thread-1-processing-n:127.0.0.1:52384_ x:collection1 s:shard1 c:control_collection r:core_node1) [n:127.0.0.1:52384_ c:control_collection s:shard1 r:core_node1 x:collection1] o.a.s.c.ZkController numShards not found on descriptor - reading it from system property
   [junit4]   2> 1029212 INFO  (zkCallback-768-thread-1-processing-n:127.0.0.1:52384_) [n:127.0.0.1:52384_    ] o.a.s.c.DistributedQueue NodeChildrenChanged fired on path /overseer/queue state SyncConnected
   [junit4]   2> 1029212 INFO  (OverseerStateUpdate-94024746679336963-127.0.0.1:52384_-n_0000000000) [n:127.0.0.1:52384_    ] o.a.s.c.Overseer processMessage: queueSize: 1, message = {
   [junit4]   2>   "core":"collection1",
   [junit4]   2>   "core_node_name":"core_node1",
   [junit4]   2>   "roles":null,
   [junit4]   2>   "base_url":"http://127.0.0.1:52384",
   [junit4]   2>   "node_name":"127.0.0.1:52384_",
   [junit4]   2>   "numShards":"1",
   [junit4]   2>   "state":"active",
   [junit4]   2>   "shard":"shard1",
   [junit4]   2>   "collection":"control_collection",
   [junit4]   2>   "operation":"state"} current state version: 2
   [junit4]   2> 1029212 INFO  (OverseerStateUpdate-94024746679336963-127.0.0.1:52384_-n_0000000000) [n:127.0.0.1:52384_    ] o.a.s.c.o.ReplicaMutator Update state numShards=1 message={
   [junit4]   2>   "core":"collection1",
   [junit4]   2>   "core_node_name":"core_node1",
   [junit4]   2>   "roles":null,
   [junit4]   2>   "base_url":"http://127.0.0.1:52384",
   [junit4]   2>   "node_name":"127.0.0.1:52384_",
   [junit4]   2>   "numShards":"1",
   [junit4]   2>   "state":"active",
   [junit4]   2>   "shard":"shard1",
   [junit4]   2>   "collection":"control_collection",
   [junit4]   2>   "operation":"state"}
   [junit4]   2> 1029439 INFO  (TEST-HttpPartitionTest.test-seed#[F234AB4A49AAE75C]) [    ] o.a.s.c.ChaosMonkey monkey: init - expire sessions:false cause connection loss:false
   [junit4]   2> 1029481 INFO  (TEST-HttpPartitionTest.test-seed#[F234AB4A49AAE75C]) [    ] o.a.s.SolrTestCaseJ4 Writing core.properties file to /home/jenkins/workspace/Lucene-Solr-trunk-Linux/solr/build/solr-core/test/J1/temp/solr.cloud.HttpPartitionTest_F234AB4A49AAE75C-001/shard-1-001/cores/collection1
   [junit4]   2> 1029481 INFO  (TEST-HttpPartitionTest.test-seed#[F234AB4A49AAE75C]) [    ] o.a.s.c.AbstractFullDistribZkTestBase create jetty 1 in directory /home/jenkins/workspace/Lucene-Solr-trunk-Linux/solr/build/solr-core/test/J1/temp/solr.cloud.HttpPartitionTest_F234AB4A49AAE75C-001/shard-1-001
   [junit4]   2> 1029482 INFO  (TEST-HttpPartitionTest.test-seed#[F234AB4A49AAE75C]) [    ] o.e.j.s.Server jetty-9.2.11.v20150529
   [junit4]   2> 1029482 INFO  (TEST-HttpPartitionTest.test-seed#[F234AB4A49AAE75C]) [    ] o.e.j.s.h.ContextHandler Started o.e.j.s.ServletContextHandler@6af9415f{/,null,AVAILABLE}
   [junit4]   2> 1029483 INFO  (TEST-HttpPartitionTest.test-seed#[F234AB4A49AAE75C]) [    ] o.e.j.s.ServerConnector Started ServerConnector@58ef02d8{HTTP/1.1}{127.0.0.1:51391}
   [junit4]   2> 1029483 INFO  (TEST-HttpPartitionTest.test-seed#[F234AB4A49AAE75C]) [    ] o.e.j.s.Server Started @1030960ms
   [junit4]   2> 1029483 INFO  (TEST-HttpPartitionTest.test-seed#[F234AB4A49AAE75C]) [    ] o.a.s.c.s.e.JettySolrRunner Jetty properties: {solr.data.dir=/home/jenkins/workspace/Lucene-Solr-trunk-Linux/solr/build/solr-core/test/J1/temp/solr.cloud.HttpPartitionTest_F234AB4A49AAE75C-001/tempDir-001/jetty1, solrconfig=solrconfig.xml, hostContext=/, hostPort=43508, coreRootDirectory=/home/jenkins/workspace/Lucene-Solr-trunk-Linux/solr/build/solr-core/test/J1/temp/solr.cloud.HttpPartitionTest_F234AB4A49AAE75C-001/shard-1-001/cores}
   [junit4]   2> 1029483 INFO  (TEST-HttpPartitionTest.test-seed#[F234AB4A49AAE75C]) [    ] o.a.s.s.SolrDispatchFilter SolrDispatchFilter.init(): sun.misc.Launcher$AppClassLoader@759ebb3d
   [junit4]   2> 1029483 INFO  (TEST-HttpPartitionTest.test-seed#[F234AB4A49AAE75C]) [    ] o.a.s.c.SolrResourceLoader new SolrResourceLoader for directory: '/home/jenkins/workspace/Lucene-Solr-trunk-Linux/solr/build/solr-core/test/J1/temp/solr.cloud.HttpPartitionTest_F234AB4A49AAE75C-001/shard-1-001/'
   [junit4]   2> 1029491 INFO  (TEST-HttpPartitionTest.test-seed#[F234AB4A49AAE75C]) [    ] o.a.s.c.SolrXmlConfig Loading container configuration from /home/jenkins/workspace/Lucene-Solr-trunk-Linux/solr/build/solr-core/test/J1/temp/solr.cloud.HttpPartitionTest_F234AB4A49AAE75C-001/shard-1-001/solr.xml
   [junit4]   2> 1029494 INFO  (TEST-HttpPartitionTest.test-seed#[F234AB4A49AAE75C]) [    ] o.a.s.c.CoresLocator Config-defined core root directory: /home/jenkins/workspace/Lucene-Solr-trunk-Linux/solr/build/solr-core/test/J1/temp/solr.cloud.HttpPartitionTest_F234AB4A49AAE75C-001/shard-1-001/cores
   [junit4]   2> 1029494 INFO  (TEST-HttpPartitionTest.test-seed#[F234AB4A49AAE75C]) [    ] o.a.s.c.CoreContainer New CoreContainer 1119047936
   [junit4]   2> 1029494 INFO  (TEST-HttpPartitionTest.test-seed#[F234AB4A49AAE75C]) [    ] o.a.s.c.CoreContainer Loading cores into CoreContainer [instanceDir=/home/jenkins/workspace/Lucene-Solr-trunk-Linux/solr/build/solr-core/test/J1/temp/solr.cloud.HttpPartitionTest_F234AB4A49AAE75C-001/shard-1-001/]
   [junit4]   2> 1029494 INFO  (TEST-HttpPartitionTest.test-seed#[F234AB4A49AAE75C]) [    ] o.a.s.c.CoreContainer loading shared library: /home/jenkins/workspace/Lucene-Solr-trunk-Linux/solr/build/solr-core/test/J1/temp/solr.cloud.HttpPartitionTest_F234AB4A49AAE75C-001/shard-1-001/lib
   [junit4]   2> 1029494 WARN  (TEST-HttpPartitionTest.test-seed#[F234AB4A49AAE75C]) [    ] o.a.s.c.SolrResourceLoader Can't find (or read) directory to add to classloader: lib (resolved as: /home/jenkins/workspace/Lucene-Solr-trunk-Linux/solr/build/solr-core/test/J1/temp/solr.cloud.HttpPartitionTest_F234AB4A49AAE75C-001/shard-1-001/lib).
   [junit4]   2> 1029499 INFO  (TEST-HttpPartitionTest.test-seed#[F234AB4A49AAE75C]) [    ] o.a.s.h.c.HttpShardHandlerFactory created with socketTimeout : 90000,urlScheme : ,connTimeout : 15000,maxConnectionsPerHost : 20,maxConnections : 10000,corePoolSize : 0,maximumPoolSize : 2147483647,maxThreadIdleTime : 5,sizeOfQueue : -1,fairnessPolicy : false,useRetries : false,
   [junit4]   2> 1029499 INFO  (TEST-HttpPartitionTest.test-seed#[F234AB4A49AAE75C]) [    ] o.a.s.u.UpdateShardHandler Creating UpdateShardHandler HTTP client with params: socketTimeout=340000&connTimeout=45000&retry=true
   [junit4]   2> 1029500 INFO  (TEST-HttpPartitionTest.test-seed#[F234AB4A49AAE75C]) [    ] o.a.s.l.LogWatcher SLF4J impl is org.slf4j.impl.Log4jLoggerFactory
   [junit4]   2> 1029500 INFO  (TEST-HttpPartitionTest.test-seed#[F234AB4A49AAE75C]) [    ] o.a.s.l.LogWatcher Registering Log Listener [Log4j (org.slf4j.impl.Log4jLoggerFactory)]
   [junit4]   2> 1029500 INFO  (TEST-HttpPartitionTest.test-seed#[F234AB4A49AAE75C]) [    ] o.a.s.c.ZkContainer Zookeeper client=127.0.0.1:34848/solr
   [junit4]   2> 1029500 INFO  (TEST-HttpPartitionTest.test-seed#[F234AB4A49AAE75C]) [    ] o.a.s.c.ZkController zkHost includes chroot
   [junit4]   2> 1030505 INFO  (TEST-HttpPartitionTest.test-seed#[F234AB4A49AAE75C]) [n:127.0.0.1:43508_    ] o.a.s.c.ZkController Register node as live in ZooKeeper:/live_nodes/127.0.0.1:43508_
   [junit4]   2> 1030506 INFO  (TEST-HttpPartitionTest.test-seed#[F234AB4A49AAE75C]) [n:127.0.0.1:43508_    ] o.a.s.c.Overseer Overseer (id=null) closing
   [junit4]   2> 1030507 INFO  (TEST-HttpPartitionTest.test-seed#[F234AB4A49AAE75C]) [n:127.0.0.1:43508_    ] o.a.s.c.LeaderElector Joined leadership election with path: /overseer_elect/election/94024746679336966-127.0.0.1:43508_-n_0000000001
   [junit4]   2> 1030507 INFO  (TEST-HttpPartitionTest.test-seed#[F234AB4A49AAE75C]) [n:127.0.0.1:43508_    ] o.a.s.c.LeaderElector Watching path /overseer_elect/election/94024746679336963-127.0.0.1:52384_-n_0000000000 to know if I could be the leader
   [junit4]   2> 1030507 INFO  (TEST-HttpPartitionTest.test-seed#[F234AB4A49AAE75C]) [n:127.0.0.1:43508_    ] o.a.s.c.CoreContainer No authentication plugin used.
   [junit4]   2> 1030507 INFO  (TEST-HttpPartitionTest.test-seed#[F234AB4A49AAE75C]) [n:127.0.0.1:43508_    ] o.a.s.c.CoreContainer Security conf doesn't exist. Skipping setup for authorization module.
   [junit4]   2> 1030508 INFO  (TEST-HttpPartitionTest.test-seed#[F234AB4A49AAE75C]) [n:127.0.0.1:43508_    ] o.a.s.c.CoresLocator Looking for core definitions underneath /home/jenkins/workspace/Lucene-Solr-trunk-Linux/solr/build/solr-core/test/J1/temp/solr.cloud.HttpPartitionTest_F234AB4A49AAE75C-001/shard-1-001/cores
   [junit4]   2> 1030508 INFO  (TEST-HttpPartitionTest.test-seed#[F234AB4A49AAE75C]) [n:127.0.0.1:43508_    ] o.a.s.c.SolrCore Created CoreDescriptor: {name=collection1, config=solrconfig.xml, transient=false, schema=schema.xml, loadOnStartup=true, instanceDir=/home/jenkins/workspace/Lucene-Solr-trunk-Linux/solr/build/solr-core/test/J1/temp/solr.cloud.HttpPartitionTest_F234AB4A49AAE75C-001/shard-1-001/cores/collection1, collection=collection1, absoluteInstDir=/home/jenkins/workspace/Lucene-Solr-trunk-Linux/solr/build/solr-core/test/J1/temp/solr.cloud.HttpPartitionTest_F234AB4A49AAE75C-001/shard-1-001/cores/collection1/, coreNodeName=, dataDir=data/, shard=}
   [junit4]   2> 1030508 INFO  (TEST-HttpPartitionTest.test-seed#[F234AB4A49AAE75C]) [n:127.0.0.1:43508_    ] o.a.s.c.CoresLocator Found core collection1 in /home/jenkins/workspace/Lucene-Solr-trunk-Linux/solr/build/solr-core/test/J1/temp/solr.cloud.HttpPartitionTest_F234AB4A49AAE75C-001/shard-1-001/cores/collection1/
   [junit4]   2> 1030508 INFO  (TEST-HttpPartitionTest.test-seed#[F234AB4A49AAE75C]) [n:127.0.0.1:43508_    ] o.a.s.c.CoresLocator Found 1 core definitions
   [junit4]   2> 1030509 INFO  (coreLoadExecutor-3717-thread-1-processing-n:127.0.0.1:43508_) [n:127.0.0.1:43508_ c:collection1   x:collection1] o.a.s.c.ZkController publishing state=down
   [junit4]   2> 1030510 INFO  (coreLoadExecutor-3717-thread-1-processing-n:127.0.0.1:43508_) [n:127.0.0.1:43508_ c:collection1   x:collection1] o.a.s.c.ZkController numShards not found on descriptor - reading it from system property
   [junit4]   2> 1030509 INFO  (TEST-HttpPartitionTest.test-seed#[F234AB4A49AAE75C]) [n:127.0.0.1:43508_    ] o.a.s.s.SolrDispatchFilter user.dir=/home/jenkins/workspace/Lucene-Solr-trunk-Linux/solr/build/solr-core/test/J1
   [junit4]   2> 1030510 INFO  (TEST-HttpPartitionTest.test-seed#[F234AB4A49AAE75C]) [n:127.0.0.1:43508_    ] o.a.s.s.SolrDispatchFilter SolrDispatchFilter.init() done
   [junit4]   2> 1030510 INFO  (coreLoadExecutor-3717-thread-1-processing-n:127.0.0.1:43508_) [n:127.0.0.1:43508_ c:collection1   x:collection1] o.a.s.c.ZkController look for our core node name
   [junit4]   2> 1030510 INFO  (zkCallback-768-thread-1-processing-n:127.0.0.1:52384_) [n:127.0.0.1:52384_    ] o.a.s.c.DistributedQueue NodeChildrenChanged fired on path /overseer/queue state SyncConnected
   [junit4]   2> 1030511 INFO  (OverseerStateUpdate-94024746679336963-127.0.0.1:52384_-n_0000000000) [n:127.0.0.1:52384_    ] o.a.s.c.Overseer processMessage: queueSize: 1, message = {
   [junit4]   2>   "core":"collection1",
   [junit4]   2>   "roles":null,
   [junit4]   2>   "base_url":"http://127.0.0.1:43508",
   [junit4]   2>   "node_name":"127.0.0.1:43508_",
   [junit4]   2>   "numShards":"2",
   [junit4]   2>   "state":"down",
   [junit4]   2>   "shard":null,
   [junit4]   2>   "collection":"collection1",
   [junit4]   2>   "operation":"state"} current state version: 3
   [junit4]   2> 1030511 INFO  (OverseerStateUpdate-94024746679336963-127.0.0.1:52384_-n_0000000000) [n:127.0.0.1:52384_    ] o.a.s.c.o.ReplicaMutator Update state numShards=2 message={
   [junit4]   2>   "core":"collection1",
   [junit4]   2>   "roles":null,
   [junit4]   2>   "base_url":"http://127.0.0.1:43508",
   [junit4]   2>   "node_name":"127.0.0.1:43508_",
   [junit4]   2>   "numShards":"2",
   [junit4]   2>   "state":"down",
   [junit4]   2>   "shard":null,
   [junit4]   2>   "collection":"collection1",
   [junit4]   2>   "operation":"state"}
   [junit4]   2> 1030511 INFO  (OverseerStateUpdate-94024746679336963-127.0.0.1:52384_-n_0000000000) [n:127.0.0.1:52384_    ] o.a.s.c.o.ClusterStateMutator building a new cName: collection1
   [junit4]   2> 1030511 INFO  (OverseerStateUpdate-94024746679336963-127.0.0.1:52384_-n_0000000000) [n:127.0.0.1:52384_    ] o.a.s.c.o.ReplicaMutator Assigning new node to shard shard=shard2
   [junit4]   2> 1031510 INFO  (coreLoadExecutor-3717-thread-1-processing-n:127.0.0.1:43508_) [n:127.0.0.1:43508_ c:collection1   x:collection1] o.a.s.c.ZkController waiting to find shard id in clusterstate for collection1
   [junit4]   2> 1031510 INFO  (coreLoadExecutor-3717-thread-1-processing-n:127.0.0.1:43508_) [n:127.0.0.1:43508_ c:collection1   x:collection1] o.a.s.c.ZkController Check for collection zkNode:collection1
   [junit4]   2> 1031511 INFO  (coreLoadExecutor-3717-thread-1-processing-n:127.0.0.1:43508_) [n:127.0.0.1:43508_ c:collection1   x:collection1] o.a.s.c.ZkController Collection zkNode exists
   [junit4]   2> 1031511 INFO  (coreLoadExecutor-3717-thread-1-processing-n:127.0.0.1:43508_) [n:127.0.0.1:43508_ c:collection1   x:collection1] o.a.s.c.SolrResourceLoader new SolrResourceLoader for directory: '/home/jenkins/workspace/Lucene-Solr-trunk-Linux/solr/build/solr-core/test/J1/temp/solr.cloud.HttpPartitionTest_F234AB4A49AAE75C-001/shard-1-001/cores/collection1/'
   [junit4]   2> 1031519 INFO  (coreLoadExecutor-3717-thread-1-processing-n:127.0.0.1:43508_) [n:127.0.0.1:43508_ c:collection1   x:collection1] o.a.s.c.Config loaded config solrconfig.xml with version 0 
   [junit4]   2> 1031522 INFO  (coreLoadExecutor-3717-thread-1-processing-n:127.0.0.1:43508_) [n:127.0.0.1:43508_ c:collection1   x:collection1] o.a.s.c.SolrConfig current version of requestparams : -1
   [junit4]   2> 1031539 INFO  (coreLoadExecutor-3717-thread-1-processing-n:127.0.0.1:43508_) [n:127.0.0.1:43508_ c:collection1   x:collection1] o.a.s.c.SolrConfig Using Lucene MatchVersion: 6.0.0
   [junit4]   2> 1031545 INFO  (coreLoadExecutor-3717-thread-1-processing-n:127.0.0.1:43508_) [n:127.0.0.1:43508_ c:collection1   x:collection1] o.a.s.c.Config Loaded SolrConfig: solrconfig.xml
   [junit4]   2> 1031546 INFO  (coreLoadExecutor-3717-thread-1-processing-n:127.0.0.1:43508_) [n:127.0.0.1:43508_ c:collection1   x:collection1] o.a.s.s.IndexSchema Reading Solr Schema from /configs/conf1/schema.xml
   [junit4]   2> 1031549 INFO  (coreLoadExecutor-3717-thread-1-processing-n:127.0.0.1:43508_) [n:127.0.0.1:43508_ c:collection1   x:collection1] o.a.s.s.IndexSchema [collection1] Schema name=test
   [junit4]   2> 1031615 INFO  (coreLoadExecutor-3717-thread-1-processing-n:127.0.0.1:43508_) [n:127.0.0.1:43508_ c:collection1   x:collection1] o.a.s.s.OpenExchangeRatesOrgProvider Initialized with rates=open-exchange-rates.json, refreshInterval=1440.
   [junit4]   2> 1031618 INFO  (coreLoadExecutor-3717-thread-1-processing-n:127.0.0.1:43508_) [n:127.0.0.1:43508_ c:collection1   x:collection1] o.a.s.s.IndexSchema default search field in schema is text
   [junit4]   2> 1031619 INFO  (coreLoadExecutor-3717-thread-1-processing-n:127.0.0.1:43508_) [n:127.0.0.1:43508_ c:collection1   x:collection1] o.a.s.s.IndexSchema unique key field: id
   [junit4]   2> 1031622 INFO  (coreLoadExecutor-3717-thread-1-processing-n:127.0.0.1:43508_) [n:127.0.0.1:43508_ c:collection1   x:collection1] o.a.s.s.FileExchangeRateProvider Reloading exchange rates from file currency.xml
   [junit4]   2> 1031623 INFO  (coreLoadExecutor-3717-thread-1-processing-n:127.0.0.1:43508_) [n:127.0.0.1:43508_ c:collection1   x:collection1] o.a.s.s.FileExchangeRateProvider Reloading exchange rates from file currency.xml
   [junit4]   2> 1031625 INFO  (coreLoadExecutor-3717-thread-1-processing-n:127.0.0.1:43508_) [n:127.0.0.1:43508_ c:collection1   x:collection1] o.a.s.s.OpenExchangeRatesOrgProvider Reloading exchange rates from open-exchange-rates.json
   [junit4]   2> 1031625 WARN  (coreLoadExecutor-3717-thread-1-processing-n:127.0.0.1:43508_) [n:127.0.0.1:43508_ c:collection1   x:collection1] o.a.s.s.OpenExchangeRatesOrgProvider Unknown key IMPORTANT NOTE
   [junit4]   2> 1031625 WARN  (coreLoadExecutor-3717-thread-1-processing-n:127.0.0.1:43508_) [n:127.0.0.1:43508_ c:collection1   x:collection1] o.a.s.s.OpenExchangeRatesOrgProvider Expected key, got STRING
   [junit4]   2> 1031625 INFO  (coreLoadExecutor-3717-thread-1-processing-n:127.0.0.1:43508_) [n:127.0.0.1:43508_ c:collection1   x:collection1] o.a.s.s.OpenExchangeRatesOrgProvider Reloading exchange rates from open-exchange-rates.json
   [junit4]   2> 1031625 WARN  (coreLoadExecutor-3717-thread-1-processing-n:127.0.0.1:43508_) [n:127.0.0.1:43508_ c:collection1   x:collection1] o.a.s.s.OpenExchangeRatesOrgProvider Unknown key IMPORTANT NOTE
   [junit4]   2> 1031625 WARN  (coreLoadExecutor-3717-thread-1-processing-n:127.0.0.1:43508_) [n:127.0.0.1:43508_ c:collection1   x:collection1] o.a.s.s.OpenExchangeRatesOrgProvider Expected key, got STRING
   [junit4]   2> 1031625 INFO  (coreLoadExecutor-3717-thread-1-processing-n:127.0.0.1:43508_) [n:127.0.0.1:43508_ c:collection1   x:collection1] o.a.s.c.CoreContainer Creating SolrCore 'collection1' using configuration from collection collection1
   [junit4]   2> 1031626 INFO  (coreLoadExecutor-3717-thread-1-processing-n:127.0.0.1:43508_) [n:127.0.0.1:43508_ c:collection1 s:shard2 r:core_node1 x:collection1] o.a.s.c.SolrCore org.apache.solr.core.MockDirectoryFactory
   [junit4]   2> 1031626 INFO  (coreLoadExecutor-3717-thread-1-processing-n:127.0.0.1:43508_) [n:127.0.0.1:43508_ c:collection1 s:shard2 r:core_node1 x:collection1] o.a.s.c.SolrCore [[collection1] ] Opening new SolrCore at [/home/jenkins/workspace/Lucene-Solr-trunk-Linux/solr/build/solr-core/test/J1/temp/solr.cloud.HttpPartitionTest_F234AB4A49AAE75C-001/shard-1-001/cores/collection1/], dataDir=[null]
   [junit4]   2> 1031626 INFO  (coreLoadExecutor-3717-thread-1-processing-n:127.0.0.1:43508_) [n:127.0.0.1:43508_ c:collection1 s:shard2 r:core_node1 x:collection1] o.a.s.c.JmxMonitoredMap JMX monitoring is enabled. Adding Solr mbeans to JMX Server: com.sun.jmx.mbeanserver.JmxMBeanServer@6c35f5a9
   [junit4]   2> 1031626 INFO  (coreLoadExecutor-3717-thread-1-processing-n:127.0.0.1:43508_) [n:127.0.0.1:43508_ c:collection1 s:shard2 r:core_node1 x:collection1] o.a.s.c.CachingDirectoryFactory return new directory for /home/jenkins/workspace/Lucene-Solr-trunk-Linux/solr/build/solr-core/test/J1/temp/solr.cloud.HttpPartitionTest_F234AB4A49AAE75C-001/shard-1-001/cores/collection1/data
   [junit4]   2> 1031626 INFO  (coreLoadExecutor-3717-thread-1-processing-n:127.0.0.1:43508_) [n:127.0.0.1:43508_ c:collection1 s:shard2 r:core_node1 x:collection1] o.a.s.c.SolrCore New index directory detected: old=null new=/home/jenkins/workspace/Lucene-Solr-trunk-Linux/solr/build/solr-core/test/J1/temp/solr.cloud.HttpPartitionTest_F234AB4A49AAE75C-001/shard-1-001/cores/collection1/data/index/
   [junit4]   2> 1031626 WARN  (coreLoadExecutor-3717-thread-1-processing-n:127.0.0.1:43508_) [n:127.0.0.1:43508_ c:collection1 s:shard2 r:core_node1 x:collection1] o.a.s.c.SolrCore [collection1] Solr index directory '/home/jenkins/workspace/Lucene-Solr-trunk-Linux/solr/build/solr-core/test/J1/temp/solr.cloud.HttpPartitionTest_F234AB4A49AAE75C-001/shard-1-001/cores/collection1/data/index' doesn't exist. Creating new index...
   [junit4]   2> 1031627 INFO  (coreLoadExecutor-3717-thread-1-processing-n:127.0.0.1:43508_) [n:127.0.0.1:43508_ c:collection1 s:shard2 r:core_node1 x:collection1] o.a.s.c.CachingDirectoryFactory return new directory for /home/jenkins/workspace/Lucene-Solr-trunk-Linux/solr/build/solr-core/test/J1/temp/solr.cloud.HttpPartitionTest_F234AB4A49AAE75C-001/shard-1-001/cores/collection1/data/index
   [junit4]   2> 1031627 INFO  (coreLoadExecutor-3717-thread-1-processing-n:127.0.0.1:43508_) [n:127.0.0.1:43508_ c:collection1 s:shard2 r:core_node1 x:collection1] o.a.s.u.RandomMergePolicy RandomMergePolicy wrapping class org.apache.lucene.index.LogDocMergePolicy: [LogDocMergePolicy: minMergeSize=1000, mergeFactor=21, maxMergeSize=9223372036854775807, maxMergeSizeForForcedMerge=9223372036854775807, calibrateSizeByDeletes=true, maxMergeDocs=2147483647, maxCFSSegmentSizeMB=8.796093022207999E12, noCFSRatio=0.5451409602304521]
   [junit4]   2> 1031627 INFO  (coreLoadExecutor-3717-thread-1-processing-n:127.0.0.1:43508_) [n:127.0.0.1:43508_ c:collection1 s:shard2 r:core_node1 x:collection1] o.a.s.c.SolrCore SolrDeletionPolicy.onCommit: commits: num=1
   [junit4]   2> 	commit{dir=MockDirectoryWrapper(RAMDirectory@3cd2ace lockFactory=org.apache.lucene.store.SingleInstanceLockFactory@2cc029eb),segFN=segments_1,generation=1}
   [junit4]   2> 1031627 INFO  (coreLoadExecutor-3717-thread-1-processing-n:127.0.0.1:43508_) [n:127.0.0.1:43508_ c:collection1 s:shard2 r:core_node1 x:collection1] o.a.s.c.SolrCore newest commit generation = 1
   [junit4]   2> 1031627 INFO  (OldIndexDirectoryCleanupThreadForCore-collection1) [n:127.0.0.1:43508_ c:collection1 s:shard2 r:core_node1 x:collection1] o.a.s.c.SolrCore Looking for old index directories to cleanup for core collection1 in /home/jenkins/workspace/Lucene-Solr-trunk-Linux/solr/build/solr-core/test/J1/temp/solr.cloud.HttpPartitionTest_F234AB4A49AAE75C-001/shard-1-001/cores/collection1/data/
   [junit4]   2> 1031628 WARN  (OldIndexDirectoryCleanupThreadForCore-collection1) [n:127.0.0.1:43508_ c:collection1 s:shard2 r:core_node1 x:collection1] o.a.s.c.DirectoryFactory /home/jenkins/workspace/Lucene-Solr-trunk-Linux/solr/build/solr-core/test/J1/temp/solr.cloud.HttpPartitionTest_F234AB4A49AAE75C-001/shard-1-001/cores/collection1/data/ does not point to a valid data directory; skipping clean-up of old index directories.
   [junit4]   2> 1031630 INFO  (coreLoadExecutor-3717-thread-1-processing-n:127.0.0.1:43508_) [n:127.0.0.1:43508_ c:collection1 s:shard2 r:core_node1 x:collection1] o.a.s.u.p.UpdateRequestProcessorChain creating updateRequestProcessorChain "nodistrib"
   [junit4]   2> 1031630 INFO  (coreLoadExecutor-3717-thread-1-processing-n:127.0.0.1:43508_) [n:127.0.0.1:43508_ c:collection1 s:shard2 r:core_node1 x:collection1] o.a.s.u.p.UpdateRequestProcessorChain creating updateRequestProcessorChain "dedupe"
   [junit4]   2> 1031630 INFO  (coreLoadExecutor-3717-thread-1-processing-n:127.0.0.1:43508_) [n:127.0.0.1:43508_ c:collection1 s:shard2 r:core_node1 x:collection1] o.a.s.u.p.UpdateRequestProcessorChain inserting DistributedUpdateProcessorFactory into updateRequestProcessorChain "dedupe"
   [junit4]   2> 1031630 INFO  (coreLoadExecutor-3717-thread-1-processing-n:127.0.0.1:43508_) [n:127.0.0.1:43508_ c:collection1 s:shard2 r:core_node1 x:collection1] o.a.s.u.p.UpdateRequestProcessorChain creating updateRequestProcessorChain "stored_sig"
   [junit4]   2> 1031630 INFO  (coreLoadExecutor-3717-thread-1-processing-n:127.0.0.1:43508_) [n:127.0.0.1:43508_ c:collection1 s:shard2 r:core_node1 x:collection1] o.a.s.u.p.UpdateRequestProcessorChain inserting DistributedUpdateProcessorFactory into updateRequestProcessorChain "stored_sig"
   [junit4]   2> 1031630 INFO  (coreLoadExecutor-3717-thread-1-processing-n:127.0.0.1:43508_) [n:127.0.0.1:43508_ c:collection1 s:shard2 r:core_node1 x:collection1] o.a.s.u.p.UpdateRequestProcessorChain creating updateRequestProcessorChain "distrib-dup-test-chain-explicit"
   [junit4]   2> 1031631 INFO  (coreLoadExecutor-3717-thread-1-processing-n:127.0.0.1:43508_) [n:127.0.0.1:43508_ c:collection1 s:shard2 r:core_node1 x:collection1] o.a.s.u.p.UpdateRequestProcessorChain creating updateRequestProcessorChain "distrib-dup-test-chain-implicit"
   [junit4]   2> 1031631 INFO  (coreLoadExecutor-3717-thread-1-processing-n:127.0.0.1:43508_) [n:127.0.0.1:43508_ c:collection1 s:shard2 r:core_node1 x:collection1] o.a.s.u.p.UpdateRequestProcessorChain inserting DistributedUpdateProcessorFactory into updateRequestProcessorChain "distrib-dup-test-chain-implicit"
   [junit4]   2> 1031631 INFO  (coreLoadExecutor-3717-thread-1-processing-n:127.0.0.1:43508_) [n:127.0.0.1:43508_ c:collection1 s:shard2 r:core_node1 x:collection1] o.a.s.c.SolrCore no updateRequestProcessorChain defined as default, creating implicit default
   [junit4]   2> 1031632 INFO  (coreLoadExecutor-3717-thread-1-processing-n:127.0.0.1:43508_) [n:127.0.0.1:43508_ c:collection1 s:shard2 r:core_node1 x:collection1] o.a.s.h.l.XMLLoader xsltCacheLifetimeSeconds=60
   [junit4]   2> 1031633 INFO  (coreLoadExecutor-3717-thread-1-processing-n:127.0.0.1:43508_) [n:127.0.0.1:43508_ c:collection1 s:shard2 r:core_node1 x:collection1] o.a.s.h.l.XMLLoader xsltCacheLifetimeSeconds=60
   [junit4]   2> 1031633 INFO  (coreLoadExecutor-3717-thread-1-processing-n:127.0.0.1:43508_) [n:127.0.0.1:43508_ c:collection1 s:shard2 r:core_node1 x:collection1] o.a.s.h.l.XMLLoader xsltCacheLifetimeSeconds=60
   [junit4]   2> 1031634 INFO  (coreLoadExecutor-3717-thread-1-processing-n:127.0.0.1:43508_) [n:127.0.0.1:43508_ c:collection1 s:shard2 r:core_node1 x:collection1] o.a.s.h.l.XMLLoader xsltCacheLifetimeSeconds=60
   [junit4]   2> 1031635 INFO  (coreLoadExecutor-3717-thread-1-processing-n:127.0.0.1:43508_) [n:127.0.0.1:43508_ c:collection1 s:shard2 r:core_node1 x:collection1] o.a.s.c.RequestHandlers Registered paths: /admin/mbeans,standard,/update/csv,/update/json/docs,/admin/luke,/admin/segments,/get,/admin/system,/replication,/admin/properties,/config,/schema,/admin/plugins,/admin/logging,/update/json,/admin/threads,/admin/ping,/update,/admin/file
   [junit4]   2> 1031636 INFO  (coreLoadExecutor-3717-thread-1-processing-n:127.0.0.1:43508_) [n:127.0.0.1:43508_ c:collection1 s:shard2 r:core_node1 x:collection1] o.a.s.c.SolrCore Using default statsCache cache: org.apache.solr.search.stats.LocalStatsCache
   [junit4]   2> 1031636 INFO  (coreLoadExecutor-3717-thread-1-processing-n:127.0.0.1:43508_) [n:127.0.0.1:43508_ c:collection1 s:shard2 r:core_node1 x:collection1] o.a.s.u.UpdateHandler Using UpdateLog implementation: org.apache.solr.update.UpdateLog
   [junit4]   2> 1031636 INFO  (coreLoadExecutor-3717-thread-1-processing-n:127.0.0.1:43508_) [n:127.0.0.1:43508_ c:collection1 s:shard2 r:core_node1 x:collection1] o.a.s.u.UpdateLog Initializing UpdateLog: dataDir= defaultSyncLevel=FLUSH numRecordsToKeep=100 maxNumLogsToKeep=10 numVersionBuckets=65536
   [junit4]   2> 1031637 INFO  (coreLoadExecutor-3717-thread-1-processing-n:127.0.0.1:43508_) [n:127.0.0.1:43508_ c:collection1 s:shard2 r:core_node1 x:collection1] o.a.s.c.SolrCore Hard AutoCommit: disabled
   [junit4]   2> 1031637 INFO  (coreLoadExecutor-3717-thread-1-processing-n:127.0.0.1:43508_) [n:127.0.0.1:43508_ c:collection1 s:shard2 r:core_node1 x:collection1] o.a.s.c.SolrCore Soft AutoCommit: disabled
   [junit4]   2> 1031638 INFO  (coreLoadExecutor-3717-thread-1-processing-n:127.0.0.1:43508_) [n:127.0.0.1:43508_ c:collection1 s:shard2 r:core_node1 x:collection1] o.a.s.u.RandomMergePolicy RandomMergePolicy wrapping class org.apache.lucene.index.TieredMergePolicy: [TieredMergePolicy: maxMergeAtOnce=21, maxMergeAtOnceExplicit=30, maxMergedSegmentMB=38.4931640625, floorSegmentMB=0.9599609375, forceMergeDeletesPctAllowed=19.28028538148536, segmentsPerTier=47.0, maxCFSSegmentSizeMB=8.796093022207999E12, noCFSRatio=0.0
   [junit4]   2> 1031638 INFO  (coreLoadExecutor-3717-thread-1-processing-n:127.0.0.1:43508_) [n:127.0.0.1:43508_ c:collection1 s:shard2 r:core_node1 x:collection1] o.a.s.c.SolrCore SolrDeletionPolicy.onInit: commits: num=1
   [junit4]   2> 	commit{dir=MockDirectoryWrapper(RAMDirectory@3cd2ace lockFactory=org.apache.lucene.store.SingleInstanceLockFactory@2cc029eb),segFN=segments_1,generation=1}
   [junit4]   2> 1031638 INFO  (coreLoadExecutor-3717-thread-1-processing-n:127.0.0.1:43508_) [n:127.0.0.1:43508_ c:collection1 s:shard2 r:core_node1 x:collection1] o.a.s.c.SolrCore newest commit generation = 1
   [junit4]   2> 1031638 INFO  (coreLoadExecutor-3717-thread-1-processing-n:127.0.0.1:43508_) [n:127.0.0.1:43508_ c:collection1 s:shard2 r:core_node1 x:collection1] o.a.s.s.SolrIndexSearcher Opening Searcher@1c7d57b5[collection1] main
   [junit4]   2> 1031638 INFO  (coreLoadExecutor-3717-thread-1-processing-n:127.0.0.1:43508_) [n:127.0.0.1:43508_ c:collection1 s:shard2 r:core_node1 x:collection1] o.a.s.r.ManagedResourceStorage Setting up ZooKeeper-based storage for the RestManager with znodeBase: /configs/conf1
   [junit4]   2> 1031639 INFO  (coreLoadExecutor-3717-thread-1-processing-n:127.0.0.1:43508_) [n:127.0.0.1:43508_ c:collection1 s:shard2 r:core_node1 x:collection1] o.a.s.r.ManagedResourceStorage Configured ZooKeeperStorageIO with znodeBase: /configs/conf1
   [junit4]   2> 1031639 INFO  (coreLoadExecutor-3717-thread-1-processing-n:127.0.0.1:43508_) [n:127.0.0.1:43508_ c:collection1 s:shard2 r:core_node1 x:collection1] o.a.s.r.RestManager Initializing RestManager with initArgs: {}
   [junit4]   2> 1031639 INFO  (coreLoadExecutor-3717-thread-1-processing-n:127.0.0.1:43508_) [n:127.0.0.1:43508_ c:collection1 s:shard2 r:core_node1 x:collection1] o.a.s.r.ManagedResourceStorage Reading _rest_managed.json using ZooKeeperStorageIO:path=/configs/conf1
   [junit4]   2> 1031639 INFO  (coreLoadExecutor-3717-thread-1-processing-n:127.0.0.1:43508_) [n:127.0.0.1:43508_ c:collection1 s:shard2 r:core_node1 x:collection1] o.a.s.r.ManagedResourceStorage No data found for znode /configs/conf1/_rest_managed.json
   [junit4]   2> 1031639 INFO  (coreLoadExecutor-3717-thread-1-processing-n:127.0.0.1:43508_) [n:127.0.0.1:43508_ c:collection1 s:shard2 r:core_node1 x:collection1] o.a.s.r.ManagedResourceStorage Loaded null at path _rest_managed.json using ZooKeeperStorageIO:path=/configs/conf1
   [junit4]   2> 1031639 INFO  (coreLoadExecutor-3717-thread-1-processing-n:127.0.0.1:43508_) [n:127.0.0.1:43508_ c:collection1 s:shard2 r:core_node1 x:collection1] o.a.s.r.RestManager Initializing 0 registered ManagedResources
   [junit4]   2> 1031639 INFO  (coreLoadExecutor-3717-thread-1-processing-n:127.0.0.1:43508_) [n:127.0.0.1:43508_ c:collection1 s:shard2 r:core_node1 x:collection1] o.a.s.h.ReplicationHandler Commits will be reserved for  10000
   [junit4]   2> 1031640 INFO  (searcherExecutor-3718-thread-1-processing-n:127.0.0.1:43508_ x:collection1 s:shard2 c:collection1 r:core_node1) [n:127.0.0.1:43508_ c:collection1 s:shard2 r:core_node1 x:collection1] o.a.s.c.SolrCore [collection1] Registered new searcher Searcher@1c7d57b5[collection1] main{ExitableDirectoryReader(UninvertingDirectoryReader())}
   [junit4]   2> 1031640 INFO  (coreLoadExecutor-3717-thread-1-processing-n:127.0.0.1:43508_) [n:127.0.0.1:43508_ c:collection1 s:shard2 r:core_node1 x:collection1] o.a.s.u.UpdateLog Looking up max value of version field to seed version buckets
   [junit4]   2> 1031640 INFO  (coreLoadExecutor-3717-thread-1-processing-n:127.0.0.1:43508_) [n:127.0.0.1:43508_ c:collection1 s:shard2 r:core_node1 x:collection1] o.a.s.u.VersionInfo Refreshing highest value of _version_ for 65536 version buckets from index
   [junit4]   2> 1031640 INFO  (coreLoadExecutor-3717-thread-1-processing-n:127.0.0.1:43508_) [n:127.0.0.1:43508_ c:collection1 s:shard2 r:core_node1 x:collection1] o.a.s.u.VersionInfo No terms found for _version_, cannot seed version bucket highest value from index
   [junit4]   2> 1031640 INFO  (coreLoadExecutor-3717-thread-1-processing-n:127.0.0.1:43508_) [n:127.0.0.1:43508_ c:collection1 s:shard2 r:core_node1 x:collection1] o.a.s.u.UpdateLog Could not find max version in index or recent updates, using new clock 1504395950955692032
   [junit4]   2> 1031642 INFO  (coreLoadExecutor-3717-thread-1-processing-n:127.0.0.1:43508_) [n:127.0.0.1:43508_ c:collection1 s:shard2 r:core_node1 x:collection1] o.a.s.u.UpdateLog Took 2 ms to seed version buckets with highest version 1504395950955692032
   [junit4]   2> 1031642 INFO  (coreLoadExecutor-3717-thread-1-processing-n:127.0.0.1:43508_) [n:127.0.0.1:43508_ c:collection1 s:shard2 r:core_node1 x:collection1] o.a.s.c.ZkController watch zkdir /configs/conf1
   [junit4]   2> 1031642 INFO  (coreLoadExecutor-3717-thread-1-processing-n:127.0.0.1:43508_) [n:127.0.0.1:43508_ c:collection1 s:shard2 r:core_node1 x:collection1] o.a.s.c.CoreContainer registering core: collection1
   [junit4]   2> 1031642 INFO  (coreZkRegister-3712-thread-1-processing-n:127.0.0.1:43508_ x:collection1 s:shard2 c:collection1 r:core_node1) [n:127.0.0.1:43508_ c:collection1 s:shard2 r:core_node1 x:collection1] o.a.s.c.ZkController Register replica - core:collection1 address:http://127.0.0.1:43508 collection:collection1 shard:shard2
   [junit4]   2> 1031644 INFO  (coreZkRegister-3712-thread-1-processing-n:127.0.0.1:43508_ x:collection1 s:shard2 c:collection1 r:core_node1) [n:127.0.0.1:43508_ c:collection1 s:shard2 r:core_node1 x:collection1] o.a.s.c.LeaderElector Joined leadership election with path: /collections/collection1/leader_elect/shard2/election/94024746679336966-core_node1-n_0000000000
   [junit4]   2> 1031644 INFO  (coreZkRegister-3712-thread-1-processing-n:127.0.0.1:43508_ x:collection1 s:shard2 c:collection1 r:core_node1) [n:127.0.0.1:43508_ c:collection1 s:shard2 r:core_node1 x:collection1] o.a.s.c.ShardLeaderElectionContext Running the leader process for shard shard2
   [junit4]   2> 1031645 INFO  (zkCallback-768-thread-1-processing-n:127.0.0.1:52384_) [n:127.0.0.1:52384_    ] o.a.s.c.DistributedQueue NodeChildrenChanged fired on path /overseer/queue state SyncConnected
   [junit4]   2> 1031645 INFO  (coreZkRegister-3712-thread-1-processing-n:127.0.0.1:43508_ x:collection1 s:shard2 c:collection1 r:core_node1) [n:127.0.0.1:43508_ c:collection1 s:shard2 r:core_node1 x:collection1] o.a.s.c.ShardLeaderElectionContext Enough replicas found to continue.
   [junit4]   2> 1031645 INFO  (coreZkRegister-3712-thread-1-processing-n:127.0.0.1:43508_ x:collection1 s:shard2 c:collection1 r:core_node1) [n:127.0.0.1:43508_ c:collection1 s:shard2 r:core_node1 x:collection1] o.a.s.c.ShardLeaderElectionContext I may be the new leader - try and sync
   [junit4]   2> 1031645 INFO  (coreZkRegister-3712-thread-1-processing-n:127.0.0.1:43508_ x:collection1 s:shard2 c:collection1 r:core_node1) [n:127.0.0.1:43508_ c:collection1 s:shard2 r:core_node1 x:collection1] o.a.s.c.SyncStrategy Sync replicas to http://127.0.0.1:43508/collection1/
   [junit4]   2> 1031645 INFO  (OverseerStateUpdate-94024746679336963-127.0.0.1:52384_-n_0000000000) [n:127.0.0.1:52384_    ] o.a.s.c.Overseer processMessage: queueSize: 1, message = {
   [junit4]   2>   "operation":"leader",
   [junit4]   2>   "shard":"shard2",
   [junit4]   2>   "collection":"collection1"} current state version: 4
   [junit4]   2> 1031645 INFO  (coreZkRegister-3712-thread-1-processing-n:127.0.0.1:43508_ x:collection1 s:shard2 c:collection1 r:core_node1) [n:127.0.0.1:43508_ c:collection1 s:shard2 r:core_node1 x:collection1] o.a.s.c.SyncStrategy Sync Success - now sync replicas to me
   [junit4]   2> 1031645 INFO  (coreZkRegister-3712-thread-1-processing-n:127.0.0.1:43508_ x:collection1 s:shard2 c:collection1 r:core_node1) [n:127.0.0.1:43508_ c:collection1 s:shard2 r:core_node1 x:collection1] o.a.s.c.SyncStrategy http://127.0.0.1:43508/collection1/ has no replicas
   [junit4]   2> 1031645 INFO  (coreZkRegister-3712-thread-1-processing-n:127.0.0.1:43508_ x:collection1 s:shard2 c:collection1 r:core_node1) [n:127.0.0.1:43508_ c:collection1 s:shard2 r:core_node1 x:collection1] o.a.s.c.ShardLeaderElectionContext I am the new leader: http://127.0.0.1:43508/collection1/ shard2
   [junit4]   2> 1031646 INFO  (zkCallback-768-thread-1-processing-n:127.0.0.1:52384_) [n:127.0.0.1:52384_    ] o.a.s.c.DistributedQueue NodeChildrenChanged fired on path /overseer/queue state SyncConnected
   [junit4]   2> 1031647 INFO  (OverseerStateUpdate-94024746679336963-127.0.0.1:52384_-n_0000000000) [n:127.0.0.1:52384_    ] o.a.s.c.Overseer processMessage: queueSize: 1, message = {
   [junit4]   2>   "operation":"leader",
   [junit4]   2>   "shard":"shard2",
   [junit4]   2>   "collection":"collection1",
   [junit4]   2>   "base_url":"http://127.0.0.1:43508",
   [junit4]   2>   "core":"collection1",
   [junit4]   2>   "state":"active"} current state version: 4
   [junit4]   2> 1031797 INFO  (coreZkRegister-3712-thread-1-processing-n:127.0.0.1:43508_ x:collection1 s:shard2 c:collection1 r:core_node1) [n:127.0.0.1:43508_ c:collection1 s:shard2 r:core_node1 x:collection1] o.a.s.c.ZkController We are http://127.0.0.1:43508/collection1/ and leader is http://127.0.0.1:43508/collection1/
   [junit4]   2> 1031797 INFO  (coreZkRegister-3712-thread-1-processing-n:127.0.0.1:43508_ x:collection1 s:shard2 c:collection1 r:core_node1) [n:127.0.0.1:43508_ c:collection1 s:shard2 r:core_node1 x:collection1] o.a.s.c.ZkController No LogReplay needed for core=collection1 baseURL=http://127.0.0.1:43508
   [junit4]   2> 1031797 INFO  (coreZkRegister-3712-thread-1-processing-n:127.0.0.1:43508_ x:collection1 s:shard2 c:collection1 r:core_node1) [n:127.0.0.1:43508_ c:collection1 s:shard2 r:core_node1 x:collection1] o.a.s.c.ZkController I am the leader, no recovery necessary
   [junit4]   2> 1031797 INFO  (coreZkRegister-3712-thread-1-processing-n:127.0.0.1:43508_ x:collection1 s:shard2 c:collection1 r:core_node1) [n:127.0.0.1:43508_ c:collection1 s:shard2 r:core_node1 x:collection1] o.a.s.c.ZkController publishing state=active
   [junit4]   2> 1031797 INFO  (coreZkRegister-3712-thread-1-processing-n:127.0.0.1:43508_ x:collection1 s:shard2 c:collection1 r:core_node1) [n:127.0.0.1:43508_ c:collection1 s:shard2 r:core_node1 x:collection1] o.a.s.c.ZkController numShards not found on descriptor - reading it from system property
   [junit4]   2> 1031797 INFO  (zkCallback-768-thread-1-processing-n:127.0.0.1:52384_) [n:127.0.0.1:52384_    ] o.a.s.c.DistributedQueue NodeChildrenChanged fired on path /overseer/queue state SyncConnected
   [junit4]   2> 1031798 INFO  (OverseerStateUpdate-94024746679336963-127.0.0.1:52384_-n_0000000000) [n:127.0.0.1:52384_    ] o.a.s.c.Overseer processMessage: queueSize: 1, message = {
   [junit4]   2>   "core":"collection1",
   [junit4]   2>   "core_node_name":"core_node1",
   [junit4]   2>   "roles":null,
   [junit4]   2>   "base_url":"http://127.0.0.1:43508",
   [junit4]   2>   "node_name":"127.0.0.1:43508_",
   [junit4]   2>   "numShards":"2",
   [junit4]   2>   "state":"active",
   [junit4]   2>   "shard":"shard2",
   [junit4]   2>   "collection":"collection1",
   [junit4]   2>   "operation":"state"} current state version: 5
   [junit4]   2> 1031798 INFO  (OverseerStateUpdate-94024746679336963-127.0.0.1:52384_-n_0000000000) [n:127.0.0.1:52384_    ] o.a.s.c.o.ReplicaMutator Update state numShards=2 message={
   [junit4]   2>   "core":"collection1",
   [junit4]   2>   "core_node_name":"core_node1",
   [junit4]   2>   "roles":null,
   [junit4]   2>   "base_url":"http://127.0.0.1:43508",
   [junit4]   2>   "node_name":"127.0.0.1:43508_",
   [junit4]   2>   "numShards":"2",
   [junit4]   2>   "state":"active",
   [junit4]   2>   "shard":"shard2",
   [junit4]   2>   "collection":"collection1",
   [junit4]   2>   "operation":"state"}
   [junit4]   2> 1032053 INFO  (TEST-HttpPartitionTest.test-seed#[F234AB4A49AAE75C]) [    ] o.a.s.SolrTestCaseJ4 Writing core.properties file to /home/jenkins/workspace/Lucene-Solr-trunk-Linux/solr/build/solr-core/test/J1/temp/solr.cloud.HttpPartitionTest_F234AB4A49AAE75C-001/shard-2-001/cores/collection1
   [junit4]   2> 1032054 INFO  (TEST-HttpPartitionTest.test-seed#[F234AB4A49AAE75C]) [    ] o.a.s.c.AbstractFullDistribZkTestBase create jetty 2 in directory /home/jenkins/workspace/Lucene-Solr-trunk-Linux/solr/build/solr-core/test/J1/temp/solr.cloud.HttpPartitionTest_F234AB4A49AAE75C-001/shard-2-001
   [junit4]   2> 1032055 INFO  (TEST-HttpPartitionTest.test-seed#[F234AB4A49AAE75C]) [    ] o.e.j.s.Server jetty-9.2.11.v20150529
   [junit4]   2> 1032055 INFO  (TEST-HttpPartitionTest.test-seed#[F234AB4A49AAE75C]) [    ] o.e.j.s.h.ContextHandler Started o.e.j.s.ServletContextHandler@522229d1{/,null,AVAILABLE}
   [junit4]   2> 1032056 INFO  (TEST-HttpPartitionTest.test-seed#[F234AB4A49AAE75C]) [    ] o.e.j.s.ServerConnector Started ServerConnector@2d4d0d3a{HTTP/1.1}{127.0.0.1:59895}
   [junit4]   2> 1032056 INFO  (TEST-HttpPartitionTest.test-seed#[F234AB4A49AAE75C]) [    ] o.e.j.s.Server Started @1033533ms
   [junit4]   2> 1032056 INFO  (TEST-HttpPartitionTest.test-seed#[F234AB4A49AAE75C]) [    ] o.a.s.c.s.e.JettySolrRunner Jetty properties: {solr.data.dir=/home/jenkins/workspace/Lucene-Solr-trunk-Linux/solr/build/solr-core/test/J1/temp/solr.cloud.HttpPartitionTest_F234AB4A49AAE75C-001/tempDir-001/jetty2, solrconfig=solrconfig.xml, hostContext=/, hostPort=37605, coreRootDirectory=/home/jenkins/workspace/Lucene-Solr-trunk-Linux/solr/build/solr-core/test/J1/temp/solr.cloud.HttpPartitionTest_F234AB4A49AAE75C-001/shard-2-001/cores}
   [junit4]   2> 1032056 INFO  (TEST-HttpPartitionTest.test-seed#[F234AB4A49AAE75C]) [    ] o.a.s.s.SolrDispatchFilter SolrDispatchFilter.init(): sun.misc.Launcher$AppClassLoader@759ebb3d
   [junit4]   2> 1032056 INFO  (TEST-HttpPartitionTest.test-seed#[F234AB4A49AAE75C]) [    ] o.a.s.c.SolrResourceLoader new SolrResourceLoader for directory: '/home/jenkins/workspace/Lucene-Solr-trunk-Linux/solr/build/solr-core/test/J1/temp/solr.cloud.HttpPartitionTest_F234AB4A49AAE75C-001/shard-2-001/'
   [junit4]   2> 1032063 INFO  (TEST-HttpPartitionTest.test-seed#[F234AB4A49AAE75C]) [    ] o.a.s.c.SolrXmlConfig Loading container configuration from /home/jenkins/workspace/Lucene-Solr-trunk-Linux/solr/build/solr-core/test/J1/temp/solr.cloud.HttpPartitionTest_F234AB4A49AAE75C-001/shard-2-001/solr.xml
   [junit4]   2> 1032066 INFO  (TEST-HttpPartitionTest.test-seed#[F234AB4A49AAE75C]) [    ] o.a.s.c.CoresLocator Config-defined core root directory: /home/jenkins/workspace/Lucene-Solr-trunk-Linux/solr/build/solr-core/test/J1/temp/solr.cloud.HttpPartitionTest_F234AB4A49AAE75C-001/shard-2-001/cores
   [junit4]   2> 1032066 INFO  (TEST-HttpPartitionTest.test-seed#[F234AB4A49AAE75C]) [    ] o.a.s.c.CoreContainer New CoreContainer 790368038
   [junit4]   2> 1032066 INFO  (TEST-HttpPartitionTest.test-seed#[F234AB4A49AAE75C]) [    ] o.a.s.c.CoreContainer Loading cores into CoreContainer [instanceDir=/home/jenkins/workspace/Lucene-Solr-trunk-Linux/solr/build/solr-core/test/J1/temp/solr.cloud.HttpPartitionTest_F234AB4A49AAE75C-001/shard-2-001/]
   [junit4]   2> 1032066 INFO  (TEST-HttpPartitionTest.test-seed#[F234AB4A49AAE75C]) [    ] o.a.s.c.CoreContainer loading shared library: /home/jenkins/workspace/Lucene-Solr-trunk-Linux/solr/build/solr-core/test/J1/temp/solr.cloud.HttpPartitionTest_F234AB4A49AAE75C-001/shard-2-001/lib
   [junit4]   2> 1032067 WARN  (TEST-HttpPartitionTest.test-seed#[F234AB4A49AAE75C]) [    ] o.a.s.c.SolrResourceLoader Can't find (or read) directory to add to classloader: lib (resolved as: /home/jenkins/workspace/Lucene-Solr-trunk-Linux/solr/build/solr-core/test/J1/temp/solr.cloud.HttpPartitionTest_F234AB4A49AAE75C-001/shard-2-001/lib).
   [junit4]   2> 1032070 INFO  (TEST-HttpPartitionTest.test-seed#[F234AB4A49AAE75C]) [    ] o.a.s.h.c.HttpShardHandlerFactory created with socketTimeout : 90000,urlScheme : ,connTimeout : 15000,maxConnectionsPerHost : 20,maxConnections : 10000,corePoolSize : 0,maximumPoolSize : 2147483647,maxThreadIdleTime : 5,sizeOfQueue : -1,fairnessPolicy : false,useRetries : false,
   [junit4]   2> 1032071 INFO  (TEST-HttpPartitionTest.test-seed#[F234AB4A49AAE75C]) [    ] o.a.s.u.UpdateShardHandler Creating UpdateShardHandler HTTP client with params: socketTimeout=340000&connTimeout=45000&retry=true
   [junit4]   2> 1032071 INFO  (TEST-HttpPartitionTest.test-seed#[F234AB4A49AAE75C]) [    ] o.a.s.l.LogWatcher SLF4J impl is org.slf4j.impl.Log4jLoggerFactory
   [junit4]   2> 1032071 INFO  (TEST-HttpPartitionTest.test-seed#[F234AB4A49AAE75C]) [    ] o.a.s.l.LogWatcher Registering Log Listener [Log4j (org.slf4j.impl.Log4jLoggerFactory)]
   [junit4]   2> 1032071 INFO  (TEST-HttpPartitionTest.test-seed#[F234AB4A49AAE75C]) [    ] o.a.s.c.ZkContainer Zookeeper client=127.0.0.1:34848/solr
   [junit4]   2> 1032071 INFO  (TEST-HttpPartitionTest.test-seed#[F234AB4A49AAE75C]) [    ] o.a.s.c.ZkController zkHost includes chroot
   [junit4]   2> 1033076 INFO  (TEST-HttpPartitionTest.test-seed#[F234AB4A49AAE75C]) [n:127.0.0.1:37605_    ] o.a.s.c.ZkController Register node as live in ZooKeeper:/live_nodes/127.0.0.1:37605_
   [junit4]   2> 1033078 INFO  (TEST-HttpPartitionTest.test-seed#[F234AB4A49AAE75C]) [n:127.0.0.1:37605_    ] o.a.s.c.Overseer Overseer (id=null) closing
   [junit4]   2> 1033078 INFO  (TEST-HttpPartitionTest.test-seed#[F234AB4A49AAE75C]) [n:127.0.0.1:37605_    ] o.a.s.c.LeaderElector Joined leadership election with path: /overseer_elect/election/94024746679336968-127.0.0.1:37605_-n_0000000002
   [junit4]   2> 1033079 INFO  (TEST-HttpPartitionTest.test-seed#[F234AB4A49AAE75C]) [n:127.0.0.1:37605_    ] o.a.s.c.LeaderElector Watching path /overseer_elect/election/94024746679336966-127.0.0.1:43508_-n_0000000001 to know if I could be the leader
   [junit4]   2> 1033079 INFO  (TEST-HttpPartitionTest.test-seed#[F234AB4A49AAE75C]) [n:127.0.0.1:37605_    ] o.a.s.c.CoreContainer No authentication plugin used.
   [junit4]   2> 1033079 INFO  (TEST-HttpPartitionTest.test-seed#[F234AB4A49AAE75C]) [n:127.0.0.1:37605_    ] o.a.s.c.CoreContainer Security conf doesn't exist. Skipping setup for authorization module.
   [junit4]   2> 1033080 INFO  (TEST-HttpPartitionTest.test-seed#[F234AB4A49AAE75C]) [n:127.0.0.1:37605_    ] o.a.s.c.CoresLocator Looking for core definitions underneath /home/jenkins/workspace/Lucene-Solr-trunk-Linux/solr/build/solr-core/test/J1/temp/solr.cloud.HttpPartitionTest_F234AB4A49AAE75C-001/shard-2-001/cores
   [junit4]   2> 1033080 INFO  (TEST-HttpPartitionTest.test-seed#[F234AB4A49AAE75C]) [n:127.0.0.1:37605_    ] o.a.s.c.SolrCore Created CoreDescriptor: {name=collection1, config=solrconfig.xml, transient=false, schema=schema.xml, loadOnStartup=true, instanceDir=/home/jenkins/workspace/Lucene-Solr-trunk-Linux/solr/build/solr-core/test/J1/temp/solr.cloud.HttpPartitionTest_F234AB4A49AAE75C-001/shard-2-001/cores/collection1, collection=collection1, absoluteInstDir=/home/jenkins/workspace/Lucene-Solr-trunk-Linux/solr/b

[...truncated too long message...]

update.processor.LogUpdateProcessor.processAdd(LogUpdateProcessorFactory.java:104)
   [junit4]   2> 	at org.apache.solr.handler.loader.JavabinLoader$1.update(JavabinLoader.java:101)
   [junit4]   2> 	at org.apache.solr.client.solrj.request.JavaBinUpdateRequestCodec$1.readOuterMostDocIterator(JavaBinUpdateRequestCodec.java:179)
   [junit4]   2> 	at org.apache.solr.client.solrj.request.JavaBinUpdateRequestCodec$1.readIterator(JavaBinUpdateRequestCodec.java:135)
   [junit4]   2> 	at org.apache.solr.common.util.JavaBinCodec.readVal(JavaBinCodec.java:249)
   [junit4]   2> 	at org.apache.solr.client.solrj.request.JavaBinUpdateRequestCodec$1.readNamedList(JavaBinUpdateRequestCodec.java:121)
   [junit4]   2> 	at org.apache.solr.common.util.JavaBinCodec.readVal(JavaBinCodec.java:214)
   [junit4]   2> 	at org.apache.solr.common.util.JavaBinCodec.unmarshal(JavaBinCodec.java:134)
   [junit4]   2> 	at org.apache.solr.client.solrj.request.JavaBinUpdateRequestCodec.unmarshal(JavaBinUpdateRequestCodec.java:186)
   [junit4]   2> 	at org.apache.solr.handler.loader.JavabinLoader.parseAndLoadDocs(JavabinLoader.java:111)
   [junit4]   2> 	at org.apache.solr.handler.loader.JavabinLoader.load(JavabinLoader.java:58)
   [junit4]   2> 	at org.apache.solr.handler.UpdateRequestHandler$1.load(UpdateRequestHandler.java:98)
   [junit4]   2> 	at org.apache.solr.handler.ContentStreamHandlerBase.handleRequestBody(ContentStreamHandlerBase.java:74)
   [junit4]   2> 	at org.apache.solr.handler.RequestHandlerBase.handleRequest(RequestHandlerBase.java:143)
   [junit4]   2> 	at org.apache.solr.core.SolrCore.execute(SolrCore.java:2057)
   [junit4]   2> 	at org.apache.solr.servlet.HttpSolrCall.execute(HttpSolrCall.java:648)
   [junit4]   2> 	at org.apache.solr.servlet.HttpSolrCall.call(HttpSolrCall.java:452)
   [junit4]   2> 	at org.apache.solr.servlet.SolrDispatchFilter.doFilter(SolrDispatchFilter.java:227)
   [junit4]   2> 	at org.apache.solr.servlet.SolrDispatchFilter.doFilter(SolrDispatchFilter.java:196)
   [junit4]   2> 	at org.eclipse.jetty.servlet.ServletHandler$CachedChain.doFilter(ServletHandler.java:1652)
   [junit4]   2> 	at org.apache.solr.client.solrj.embedded.JettySolrRunner$DebugFilter.doFilter(JettySolrRunner.java:106)
   [junit4]   2> 	at org.eclipse.jetty.servlet.ServletHandler$CachedChain.doFilter(ServletHandler.java:1652)
   [junit4]   2> 	at org.eclipse.jetty.servlets.UserAgentFilter.doFilter(UserAgentFilter.java:83)
   [junit4]   2> 	at org.eclipse.jetty.servlets.GzipFilter.doFilter(GzipFilter.java:300)
   [junit4]   2> 	at org.eclipse.jetty.servlet.ServletHandler$CachedChain.doFilter(ServletHandler.java:1652)
   [junit4]   2> 	at org.eclipse.jetty.servlet.ServletHandler.doHandle(ServletHandler.java:585)
   [junit4]   2> 	at org.eclipse.jetty.server.session.SessionHandler.doHandle(SessionHandler.java:221)
   [junit4]   2> 	at org.eclipse.jetty.server.handler.ContextHandler.doHandle(ContextHandler.java:1127)
   [junit4]   2> 	at org.eclipse.jetty.servlet.ServletHandler.doScope(ServletHandler.java:515)
   [junit4]   2> 	at org.eclipse.jetty.server.session.SessionHandler.doScope(SessionHandler.java:185)
   [junit4]   2> 	at org.eclipse.jetty.server.handler.ContextHandler.doScope(ContextHandler.java:1061)
   [junit4]   2> 	at org.eclipse.jetty.server.handler.ScopedHandler.handle(ScopedHandler.java:141)
   [junit4]   2> 	at org.eclipse.jetty.server.handler.HandlerWrapper.handle(HandlerWrapper.java:97)
   [junit4]   2> 	at org.eclipse.jetty.server.Server.handle(Server.java:499)
   [junit4]   2> 	at org.eclipse.jetty.server.HttpChannel.handle(HttpChannel.java:310)
   [junit4]   2> 	at org.eclipse.jetty.server.HttpConnection.onFillable(HttpConnection.java:257)
   [junit4]   2> 	at org.eclipse.jetty.io.AbstractConnection$2.run(AbstractConnection.java:540)
   [junit4]   2> 	at org.eclipse.jetty.util.thread.QueuedThreadPool.runJob(QueuedThreadPool.java:635)
   [junit4]   2> 	at org.eclipse.jetty.util.thread.QueuedThreadPool$3.run(QueuedThreadPool.java:555)
   [junit4]   2> 	at java.lang.Thread.run(Thread.java:745)
   [junit4]   2> 
   [junit4]   2> Jun 19, 2015 8:52:12 AM com.carrotsearch.randomizedtesting.ThreadLeakControl checkThreadLeaks
   [junit4]   2> WARNING: Will linger awaiting termination of 3 leaked thread(s).
   [junit4]   2> NOTE: test params are: codec=Asserting(Lucene53): {range_facet_l_dv=TestBloomFilteredLucenePostings(BloomFilteringPostingsFormat(Lucene50(blocksize=128))), _version_=PostingsFormat(name=Direct), multiDefault=BlockTreeOrds(blocksize=128), a_t=PostingsFormat(name=Direct), intDefault=PostingsFormat(name=Direct), id=TestBloomFilteredLucenePostings(BloomFilteringPostingsFormat(Lucene50(blocksize=128))), range_facet_i_dv=PostingsFormat(name=Direct), text=PostingsFormat(name=LuceneFixedGap), range_facet_l=PostingsFormat(name=Direct), timestamp=PostingsFormat(name=Direct)}, docValues:{range_facet_l_dv=DocValuesFormat(name=Lucene50), range_facet_i_dv=DocValuesFormat(name=Lucene50), timestamp=DocValuesFormat(name=Lucene50)}, sim=DefaultSimilarity, locale=sr, timezone=Africa/Dakar
   [junit4]   2> NOTE: Linux 3.13.0-54-generic amd64/Oracle Corporation 1.9.0-ea (64-bit)/cpus=12,threads=1,free=104441304,total=536870912
   [junit4]   2> NOTE: All tests run in this JVM: [TestSerializedLuceneMatchVersion, FileUtilsTest, DistributedTermsComponentTest, ShardSplitTest, TestAtomicUpdateErrorCases, TestFuzzyAnalyzedSuggestions, InfoHandlerTest, TestEmbeddedSolrServerConstructors, TestDistributedGrouping, AlternateDirectoryTest, ZkSolrClientTest, ConvertedLegacyTest, CoreAdminHandlerTest, BufferStoreTest, SpellPossibilityIteratorTest, TestConfigSets, TestAnalyzeInfixSuggestions, TestDefaultStatsCache, ShowFileRequestHandlerTest, TestHashPartitioner, TestLFUCache, AddSchemaFieldsUpdateProcessorFactoryTest, ReturnFieldsTest, TestWriterPerf, TestOmitPositions, TestTolerantSearch, TestFiltering, CollectionsAPIDistributedZkTest, NoCacheHeaderTest, TestOrdValues, CacheHeaderTest, TestManagedSchemaDynamicFieldResource, DistributedExpandComponentTest, TestSolrConfigHandlerConcurrent, HdfsLockFactoryTest, WordBreakSolrSpellCheckerTest, SpellingQueryConverterTest, BlockCacheTest, TestRandomMergePolicy, FacetPivotSmallTest, ResourceLoaderTest, DistributedMLTComponentTest, DocValuesMultiTest, TestRTGBase, RAMDirectoryFactoryTest, TriLevelCompositeIdRoutingTest, DistributedQueryComponentCustomSortTest, DocumentBuilderTest, TestLeaderElectionZkExpiry, SpellCheckComponentTest, ParsingFieldUpdateProcessorsTest, TestBlobHandler, PreAnalyzedFieldTest, SolrCloudExampleTest, SystemInfoHandlerTest, BadCopyFieldTest, RequestLoggingTest, FieldAnalysisRequestHandlerTest, JSONWriterTest, UpdateParamsTest, TestFastWriter, HdfsChaosMonkeySafeLeaderTest, TestBulkSchemaAPI, StatelessScriptUpdateProcessorFactoryTest, SliceStateTest, UUIDUpdateProcessorFallbackTest, TestDefaultSearchFieldResource, TestSolrDeletionPolicy2, HdfsWriteToMultipleCollectionsTest, TestElisionMultitermQuery, ZkCLITest, AddBlockUpdateTest, SuggesterTSTTest, CachingDirectoryFactoryTest, TestSolrCoreProperties, TestManagedResourceStorage, ReplicationFactorTest, DistanceFunctionTest, TestSuggestSpellingConverter, MigrateRouteKeyTest, TestJettySolrRunner, IgnoreCommitOptimizeUpdateProcessorFactoryTest, TestCustomSort, ChaosMonkeySafeLeaderTest, SyncSliceTest, ShardRoutingTest, TestReplicationHandler, DistributedSpellCheckComponentTest, TestJoin, SolrCmdDistributorTest, BadIndexSchemaTest, TestSort, HighlighterTest, SoftAutoCommitTest, TestReversedWildcardFilterFactory, DocumentAnalysisRequestHandlerTest, TermsComponentTest, TestValueSourceCache, MoreLikeThisHandlerTest, LoggingHandlerTest, TestCollationField, MBeansHandlerTest, TestPHPSerializedResponseWriter, TestComponentsName, CopyFieldTest, TestStressRecovery, AsyncCallRequestStatusResponseTest, BaseCdcrDistributedZkTest, CdcrVersionReplicationTest, DeleteLastCustomShardedReplicaTest, DistribJoinFromCollectionTest, HttpPartitionTest]
   [junit4]   2> NOTE: reproduce with: ant test  -Dtestcase=HttpPartitionTest -Dtests.seed=F234AB4A49AAE75C -Dtests.multiplier=3 -Dtests.slow=true -Dtests.locale=sr -Dtests.timezone=Africa/Dakar -Dtests.asserts=true -Dtests.file.encoding=UTF-8
   [junit4] ERROR   0.00s J1 | HttpPartitionTest (suite) <<<
   [junit4]    > Throwable #1: java.lang.AssertionError: ObjectTracker found 1 object(s) that were not released!!! [TransactionLog]
   [junit4]    > 	at __randomizedtesting.SeedInfo.seed([F234AB4A49AAE75C]:0)
   [junit4]    > 	at org.apache.solr.SolrTestCaseJ4.afterClass(SolrTestCaseJ4.java:235)
   [junit4]    > 	at java.lang.Thread.run(Thread.java:745)
   [junit4] Completed [405/512] on J1 in 156.99s, 1 test, 1 failure <<< FAILURES!

[...truncated 338 lines...]
BUILD FAILED
/home/jenkins/workspace/Lucene-Solr-trunk-Linux/build.xml:526: The following error occurred while executing this line:
/home/jenkins/workspace/Lucene-Solr-trunk-Linux/build.xml:474: The following error occurred while executing this line:
/home/jenkins/workspace/Lucene-Solr-trunk-Linux/build.xml:61: The following error occurred while executing this line:
/home/jenkins/workspace/Lucene-Solr-trunk-Linux/extra-targets.xml:39: The following error occurred while executing this line:
/home/jenkins/workspace/Lucene-Solr-trunk-Linux/solr/build.xml:230: The following error occurred while executing this line:
/home/jenkins/workspace/Lucene-Solr-trunk-Linux/solr/common-build.xml:513: The following error occurred while executing this line:
/home/jenkins/workspace/Lucene-Solr-trunk-Linux/lucene/common-build.xml:1426: The following error occurred while executing this line:
/home/jenkins/workspace/Lucene-Solr-trunk-Linux/lucene/common-build.xml:981: There were test failures: 512 suites, 2015 tests, 1 suite-level error, 59 ignored (25 assumptions)

Total time: 40 minutes 54 seconds
Build step 'Invoke Ant' marked build as failure
Archiving artifacts
Recording test results
Email was triggered for: Failure - Any
Sending email for trigger: Failure - Any



Mime
View raw message