lucene-dev mailing list archives

Site index · List index
Message view « Date » · « Thread »
Top « Date » · « Thread »
From Policeman Jenkins Server <jenk...@thetaphi.de>
Subject [JENKINS] Lucene-Solr-5.x-Linux (64bit/jdk1.8.0_60-ea-b12) - Build # 12716 - Failure!
Date Mon, 01 Jun 2015 03:07:02 GMT
Build: http://jenkins.thetaphi.de/job/Lucene-Solr-5.x-Linux/12716/
Java: 64bit/jdk1.8.0_60-ea-b12 -XX:+UseCompressedOops -XX:+UseParallelGC

1 tests failed.
FAILED:  org.apache.solr.search.TestSearcherReuse.test

Error Message:
expected same:<Searcher@676f29c0[collection1] main{ExitableDirectoryReader(UninvertingDirectoryReader(Uninverting(_0(5.3.0):c2)
Uninverting(_1(5.3.0):c1) Uninverting(_2(5.3.0):c1)))}> was not:<Searcher@c8a13cd[collection1]
main{ExitableDirectoryReader(UninvertingDirectoryReader(Uninverting(_0(5.3.0):c2) Uninverting(_1(5.3.0):c1)
Uninverting(_2(5.3.0):c1)))}>

Stack Trace:
java.lang.AssertionError: expected same:<Searcher@676f29c0[collection1] main{ExitableDirectoryReader(UninvertingDirectoryReader(Uninverting(_0(5.3.0):c2)
Uninverting(_1(5.3.0):c1) Uninverting(_2(5.3.0):c1)))}> was not:<Searcher@c8a13cd[collection1]
main{ExitableDirectoryReader(UninvertingDirectoryReader(Uninverting(_0(5.3.0):c2) Uninverting(_1(5.3.0):c1)
Uninverting(_2(5.3.0):c1)))}>
	at __randomizedtesting.SeedInfo.seed([78C689305CC6D7E6:F092B6EAF23ABA1E]:0)
	at org.junit.Assert.fail(Assert.java:93)
	at org.junit.Assert.failNotSame(Assert.java:641)
	at org.junit.Assert.assertSame(Assert.java:580)
	at org.junit.Assert.assertSame(Assert.java:593)
	at org.apache.solr.search.TestSearcherReuse.assertSearcherHasNotChanged(TestSearcherReuse.java:247)
	at org.apache.solr.search.TestSearcherReuse.test(TestSearcherReuse.java:117)
	at sun.reflect.NativeMethodAccessorImpl.invoke0(Native Method)
	at sun.reflect.NativeMethodAccessorImpl.invoke(NativeMethodAccessorImpl.java:62)
	at sun.reflect.DelegatingMethodAccessorImpl.invoke(DelegatingMethodAccessorImpl.java:43)
	at java.lang.reflect.Method.invoke(Method.java:497)
	at com.carrotsearch.randomizedtesting.RandomizedRunner.invoke(RandomizedRunner.java:1627)
	at com.carrotsearch.randomizedtesting.RandomizedRunner$6.evaluate(RandomizedRunner.java:836)
	at com.carrotsearch.randomizedtesting.RandomizedRunner$7.evaluate(RandomizedRunner.java:872)
	at com.carrotsearch.randomizedtesting.RandomizedRunner$8.evaluate(RandomizedRunner.java:886)
	at com.carrotsearch.randomizedtesting.rules.SystemPropertiesRestoreRule$1.evaluate(SystemPropertiesRestoreRule.java:57)
	at org.apache.lucene.util.TestRuleSetupTeardownChained$1.evaluate(TestRuleSetupTeardownChained.java:50)
	at org.apache.lucene.util.AbstractBeforeAfterRule$1.evaluate(AbstractBeforeAfterRule.java:46)
	at org.apache.lucene.util.TestRuleThreadAndTestName$1.evaluate(TestRuleThreadAndTestName.java:49)
	at org.apache.lucene.util.TestRuleIgnoreAfterMaxFailures$1.evaluate(TestRuleIgnoreAfterMaxFailures.java:65)
	at org.apache.lucene.util.TestRuleMarkFailure$1.evaluate(TestRuleMarkFailure.java:48)
	at com.carrotsearch.randomizedtesting.rules.StatementAdapter.evaluate(StatementAdapter.java:36)
	at com.carrotsearch.randomizedtesting.ThreadLeakControl$StatementRunner.run(ThreadLeakControl.java:365)
	at com.carrotsearch.randomizedtesting.ThreadLeakControl.forkTimeoutingTask(ThreadLeakControl.java:798)
	at com.carrotsearch.randomizedtesting.ThreadLeakControl$3.evaluate(ThreadLeakControl.java:458)
	at com.carrotsearch.randomizedtesting.RandomizedRunner.runSingleTest(RandomizedRunner.java:845)
	at com.carrotsearch.randomizedtesting.RandomizedRunner$3.evaluate(RandomizedRunner.java:747)
	at com.carrotsearch.randomizedtesting.RandomizedRunner$4.evaluate(RandomizedRunner.java:781)
	at com.carrotsearch.randomizedtesting.RandomizedRunner$5.evaluate(RandomizedRunner.java:792)
	at com.carrotsearch.randomizedtesting.rules.StatementAdapter.evaluate(StatementAdapter.java:36)
	at com.carrotsearch.randomizedtesting.rules.SystemPropertiesRestoreRule$1.evaluate(SystemPropertiesRestoreRule.java:57)
	at org.apache.lucene.util.AbstractBeforeAfterRule$1.evaluate(AbstractBeforeAfterRule.java:46)
	at com.carrotsearch.randomizedtesting.rules.StatementAdapter.evaluate(StatementAdapter.java:36)
	at org.apache.lucene.util.TestRuleStoreClassName$1.evaluate(TestRuleStoreClassName.java:42)
	at com.carrotsearch.randomizedtesting.rules.NoShadowingOrOverridesOnMethodsRule$1.evaluate(NoShadowingOrOverridesOnMethodsRule.java:39)
	at com.carrotsearch.randomizedtesting.rules.NoShadowingOrOverridesOnMethodsRule$1.evaluate(NoShadowingOrOverridesOnMethodsRule.java:39)
	at com.carrotsearch.randomizedtesting.rules.StatementAdapter.evaluate(StatementAdapter.java:36)
	at com.carrotsearch.randomizedtesting.rules.StatementAdapter.evaluate(StatementAdapter.java:36)
	at com.carrotsearch.randomizedtesting.rules.StatementAdapter.evaluate(StatementAdapter.java:36)
	at org.apache.lucene.util.TestRuleAssertionsRequired$1.evaluate(TestRuleAssertionsRequired.java:54)
	at org.apache.lucene.util.TestRuleMarkFailure$1.evaluate(TestRuleMarkFailure.java:48)
	at org.apache.lucene.util.TestRuleIgnoreAfterMaxFailures$1.evaluate(TestRuleIgnoreAfterMaxFailures.java:65)
	at org.apache.lucene.util.TestRuleIgnoreTestSuites$1.evaluate(TestRuleIgnoreTestSuites.java:55)
	at com.carrotsearch.randomizedtesting.rules.StatementAdapter.evaluate(StatementAdapter.java:36)
	at com.carrotsearch.randomizedtesting.ThreadLeakControl$StatementRunner.run(ThreadLeakControl.java:365)
	at java.lang.Thread.run(Thread.java:745)




Build Log:
[...truncated 10456 lines...]
   [junit4] Suite: org.apache.solr.search.TestSearcherReuse
   [junit4]   2> Creating dataDir: /home/jenkins/workspace/Lucene-Solr-5.x-Linux/solr/build/solr-core/test/J0/temp/solr.search.TestSearcherReuse
78C689305CC6D7E6-001/init-core-data-001
   [junit4]   2> 708535 INFO  (SUITE-TestSearcherReuse-seed#[78C689305CC6D7E6]-worker)
[    ] o.a.s.SolrTestCaseJ4 Randomized ssl (false) and clientAuth (true)
   [junit4]   2> 708536 INFO  (SUITE-TestSearcherReuse-seed#[78C689305CC6D7E6]-worker)
[    ] o.a.s.SolrTestCaseJ4 ####initCore
   [junit4]   2> 708537 INFO  (SUITE-TestSearcherReuse-seed#[78C689305CC6D7E6]-worker)
[    ] o.a.s.c.SolrResourceLoader new SolrResourceLoader for directory: '/home/jenkins/workspace/Lucene-Solr-5.x-Linux/solr/build/solr-core/test/J0/temp/solr.search.TestSearcherReuse
78C689305CC6D7E6-001/tempDir-001/collection1/'
   [junit4]   2> 708546 INFO  (SUITE-TestSearcherReuse-seed#[78C689305CC6D7E6]-worker)
[    ] o.a.s.c.SolrConfig current version of requestparams : -1
   [junit4]   2> 708548 INFO  (SUITE-TestSearcherReuse-seed#[78C689305CC6D7E6]-worker)
[    ] o.a.s.c.SolrConfig Using Lucene MatchVersion: 5.3.0
   [junit4]   2> 708550 INFO  (SUITE-TestSearcherReuse-seed#[78C689305CC6D7E6]-worker)
[    ] o.a.s.c.Config Loaded SolrConfig: solrconfig-managed-schema.xml
   [junit4]   2> 708551 INFO  (SUITE-TestSearcherReuse-seed#[78C689305CC6D7E6]-worker)
[    ] o.a.s.s.ManagedIndexSchemaFactory The schema is configured as managed, but managed
schema resource managed-schema not found - loading non-managed schema schema-id-and-version-fields-only.xml
instead
   [junit4]   2> 708551 INFO  (SUITE-TestSearcherReuse-seed#[78C689305CC6D7E6]-worker)
[    ] o.a.s.s.IndexSchema Reading Solr Schema from /home/jenkins/workspace/Lucene-Solr-5.x-Linux/solr/build/solr-core/test/J0/temp/solr.search.TestSearcherReuse
78C689305CC6D7E6-001/tempDir-001/collection1/conf/schema-id-and-version-fields-only.xml
   [junit4]   2> 708553 INFO  (SUITE-TestSearcherReuse-seed#[78C689305CC6D7E6]-worker)
[    ] o.a.s.s.IndexSchema [null] Schema name=id-and-version-fields-only
   [junit4]   2> 708554 INFO  (SUITE-TestSearcherReuse-seed#[78C689305CC6D7E6]-worker)
[    ] o.a.s.s.IndexSchema unique key field: id
   [junit4]   2> 708554 INFO  (SUITE-TestSearcherReuse-seed#[78C689305CC6D7E6]-worker)
[    ] o.a.s.s.IndexSchema Upgraded to managed schema at /home/jenkins/workspace/Lucene-Solr-5.x-Linux/solr/build/solr-core/test/J0/temp/solr.search.TestSearcherReuse
78C689305CC6D7E6-001/tempDir-001/collection1/conf/managed-schema
   [junit4]   2> 708755 INFO  (SUITE-TestSearcherReuse-seed#[78C689305CC6D7E6]-worker)
[    ] o.a.s.s.ManagedIndexSchemaFactory After upgrading to managed schema, renamed the non-managed
schema /home/jenkins/workspace/Lucene-Solr-5.x-Linux/solr/build/solr-core/test/J0/temp/solr.search.TestSearcherReuse
78C689305CC6D7E6-001/tempDir-001/collection1/conf/schema-id-and-version-fields-only.xml to
/home/jenkins/workspace/Lucene-Solr-5.x-Linux/solr/build/solr-core/test/J0/temp/solr.search.TestSearcherReuse
78C689305CC6D7E6-001/tempDir-001/collection1/conf/schema-id-and-version-fields-only.xml.bak
   [junit4]   2> 708756 INFO  (SUITE-TestSearcherReuse-seed#[78C689305CC6D7E6]-worker)
[    ] o.a.s.c.SolrResourceLoader JNDI not configured for solr (NoInitialContextEx)
   [junit4]   2> 708756 INFO  (SUITE-TestSearcherReuse-seed#[78C689305CC6D7E6]-worker)
[    ] o.a.s.c.SolrResourceLoader using system property solr.solr.home: /home/jenkins/workspace/Lucene-Solr-5.x-Linux/solr/build/solr-core/test/J0/temp/solr.search.TestSearcherReuse
78C689305CC6D7E6-001/tempDir-001
   [junit4]   2> 708756 INFO  (SUITE-TestSearcherReuse-seed#[78C689305CC6D7E6]-worker)
[    ] o.a.s.c.SolrResourceLoader new SolrResourceLoader for directory: '/home/jenkins/workspace/Lucene-Solr-5.x-Linux/solr/build/solr-core/test/J0/temp/solr.search.TestSearcherReuse
78C689305CC6D7E6-001/tempDir-001/'
   [junit4]   2> 708764 INFO  (SUITE-TestSearcherReuse-seed#[78C689305CC6D7E6]-worker)
[    ] o.a.s.c.CoreContainer New CoreContainer 2021460876
   [junit4]   2> 708764 INFO  (SUITE-TestSearcherReuse-seed#[78C689305CC6D7E6]-worker)
[    ] o.a.s.c.CoreContainer Loading cores into CoreContainer [instanceDir=/home/jenkins/workspace/Lucene-Solr-5.x-Linux/solr/build/solr-core/test/J0/temp/solr.search.TestSearcherReuse
78C689305CC6D7E6-001/tempDir-001/]
   [junit4]   2> 708764 INFO  (SUITE-TestSearcherReuse-seed#[78C689305CC6D7E6]-worker)
[    ] o.a.s.c.CoreContainer loading shared library: /home/jenkins/workspace/Lucene-Solr-5.x-Linux/solr/build/solr-core/test/J0/temp/solr.search.TestSearcherReuse
78C689305CC6D7E6-001/tempDir-001/lib
   [junit4]   2> 708764 WARN  (SUITE-TestSearcherReuse-seed#[78C689305CC6D7E6]-worker)
[    ] o.a.s.c.SolrResourceLoader Can't find (or read) directory to add to classloader: lib
(resolved as: /home/jenkins/workspace/Lucene-Solr-5.x-Linux/solr/build/solr-core/test/J0/temp/solr.search.TestSearcherReuse
78C689305CC6D7E6-001/tempDir-001/lib).
   [junit4]   2> 708767 INFO  (SUITE-TestSearcherReuse-seed#[78C689305CC6D7E6]-worker)
[    ] o.a.s.h.c.HttpShardHandlerFactory created with socketTimeout : 600000,connTimeout :
60000,maxConnectionsPerHost : 20,maxConnections : 10000,corePoolSize : 0,maximumPoolSize :
2147483647,maxThreadIdleTime : 5,sizeOfQueue : -1,fairnessPolicy : false,useRetries : false,
   [junit4]   2> 708768 INFO  (SUITE-TestSearcherReuse-seed#[78C689305CC6D7E6]-worker)
[    ] o.a.s.u.UpdateShardHandler Creating UpdateShardHandler HTTP client with params: socketTimeout=30000&connTimeout=30000&retry=true
   [junit4]   2> 708768 INFO  (SUITE-TestSearcherReuse-seed#[78C689305CC6D7E6]-worker)
[    ] o.a.s.l.LogWatcher SLF4J impl is org.slf4j.impl.Log4jLoggerFactory
   [junit4]   2> 708768 INFO  (SUITE-TestSearcherReuse-seed#[78C689305CC6D7E6]-worker)
[    ] o.a.s.l.LogWatcher Registering Log Listener [Log4j (org.slf4j.impl.Log4jLoggerFactory)]
   [junit4]   2> 708768 INFO  (SUITE-TestSearcherReuse-seed#[78C689305CC6D7E6]-worker)
[    ] o.a.s.c.CoreContainer No authentication plugin used.
   [junit4]   2> 708769 INFO  (SUITE-TestSearcherReuse-seed#[78C689305CC6D7E6]-worker)
[    ] o.a.s.c.SolrCore Created CoreDescriptor: {name=collection1, config=solrconfig-managed-schema.xml,
transient=false, schema=managed-schema, loadOnStartup=true, instanceDir=collection1, collection=collection1,
absoluteInstDir=/home/jenkins/workspace/Lucene-Solr-5.x-Linux/solr/build/solr-core/test/J0/temp/solr.search.TestSearcherReuse
78C689305CC6D7E6-001/tempDir-001/collection1/, dataDir=/home/jenkins/workspace/Lucene-Solr-5.x-Linux/solr/build/solr-core/test/J0/temp/solr.search.TestSearcherReuse
78C689305CC6D7E6-001/init-core-data-001, shard=shard1}
   [junit4]   2> 708769 INFO  (coreLoadExecutor-2812-thread-1) [    ] o.a.s.c.SolrResourceLoader
new SolrResourceLoader for directory: '/home/jenkins/workspace/Lucene-Solr-5.x-Linux/solr/build/solr-core/test/J0/temp/solr.search.TestSearcherReuse
78C689305CC6D7E6-001/tempDir-001/collection1/'
   [junit4]   2> 708778 INFO  (coreLoadExecutor-2812-thread-1) [    ] o.a.s.c.SolrConfig
current version of requestparams : -1
   [junit4]   2> 708779 INFO  (coreLoadExecutor-2812-thread-1) [    ] o.a.s.c.SolrConfig
Using Lucene MatchVersion: 5.3.0
   [junit4]   2> 708782 INFO  (coreLoadExecutor-2812-thread-1) [    ] o.a.s.c.Config Loaded
SolrConfig: solrconfig-managed-schema.xml
   [junit4]   2> 708783 INFO  (coreLoadExecutor-2812-thread-1) [    ] o.a.s.s.IndexSchema
Reading Solr Schema from /home/jenkins/workspace/Lucene-Solr-5.x-Linux/solr/build/solr-core/test/J0/temp/solr.search.TestSearcherReuse
78C689305CC6D7E6-001/tempDir-001/collection1/conf/managed-schema
   [junit4]   2> 708784 INFO  (coreLoadExecutor-2812-thread-1) [    ] o.a.s.s.IndexSchema
[collection1] Schema name=id-and-version-fields-only
   [junit4]   2> 708786 INFO  (coreLoadExecutor-2812-thread-1) [    ] o.a.s.s.IndexSchema
unique key field: id
   [junit4]   2> 708786 INFO  (coreLoadExecutor-2812-thread-1) [    ] o.a.s.c.CoreContainer
Creating SolrCore 'collection1' using configuration from instancedir /home/jenkins/workspace/Lucene-Solr-5.x-Linux/solr/build/solr-core/test/J0/temp/solr.search.TestSearcherReuse
78C689305CC6D7E6-001/tempDir-001/collection1/
   [junit4]   2> 708786 INFO  (coreLoadExecutor-2812-thread-1) [    x:collection1] o.a.s.c.SolrCore
solr.NRTCachingDirectoryFactory
   [junit4]   2> 708786 INFO  (coreLoadExecutor-2812-thread-1) [    x:collection1] o.a.s.c.SolrCore
[[collection1] ] Opening new SolrCore at [/home/jenkins/workspace/Lucene-Solr-5.x-Linux/solr/build/solr-core/test/J0/temp/solr.search.TestSearcherReuse
78C689305CC6D7E6-001/tempDir-001/collection1/], dataDir=[null]
   [junit4]   2> 708786 INFO  (coreLoadExecutor-2812-thread-1) [    x:collection1] o.a.s.c.SolrCore
JMX monitoring not detected for core: collection1
   [junit4]   2> 708786 INFO  (coreLoadExecutor-2812-thread-1) [    x:collection1] o.a.s.c.CachingDirectoryFactory
return new directory for /home/jenkins/workspace/Lucene-Solr-5.x-Linux/solr/build/solr-core/test/J0/temp/solr.search.TestSearcherReuse
78C689305CC6D7E6-001/init-core-data-001
   [junit4]   2> 708787 INFO  (coreLoadExecutor-2812-thread-1) [    x:collection1] o.a.s.c.SolrCore
New index directory detected: old=null new=/home/jenkins/workspace/Lucene-Solr-5.x-Linux/solr/build/solr-core/test/J0/temp/solr.search.TestSearcherReuse
78C689305CC6D7E6-001/init-core-data-001/index/
   [junit4]   2> 708787 WARN  (coreLoadExecutor-2812-thread-1) [    x:collection1] o.a.s.c.SolrCore
[collection1] Solr index directory '/home/jenkins/workspace/Lucene-Solr-5.x-Linux/solr/build/solr-core/test/J0/temp/solr.search.TestSearcherReuse
78C689305CC6D7E6-001/init-core-data-001/index' doesn't exist. Creating new index...
   [junit4]   2> 708787 INFO  (coreLoadExecutor-2812-thread-1) [    x:collection1] o.a.s.c.CachingDirectoryFactory
return new directory for /home/jenkins/workspace/Lucene-Solr-5.x-Linux/solr/build/solr-core/test/J0/temp/solr.search.TestSearcherReuse
78C689305CC6D7E6-001/init-core-data-001/index
   [junit4]   2> 708787 INFO  (coreLoadExecutor-2812-thread-1) [    x:collection1] o.a.s.u.RandomMergePolicy
RandomMergePolicy wrapping class org.apache.lucene.index.LogByteSizeMergePolicy: [LogByteSizeMergePolicy:
minMergeSize=1677721, mergeFactor=33, maxMergeSize=2147483648, maxMergeSizeForForcedMerge=9223372036854775807,
calibrateSizeByDeletes=false, maxMergeDocs=2147483647, maxCFSSegmentSizeMB=8.796093022207999E12,
noCFSRatio=1.0]
   [junit4]   2> 708932 INFO  (coreLoadExecutor-2812-thread-1) [    x:collection1] o.a.s.c.SolrCore
SolrDeletionPolicy.onCommit: commits: num=1
   [junit4]   2> 	commit{dir=NRTCachingDirectory(MMapDirectory@/home/jenkins/workspace/Lucene-Solr-5.x-Linux/solr/build/solr-core/test/J0/temp/solr.search.TestSearcherReuse
78C689305CC6D7E6-001/init-core-data-001/index lockFactory=org.apache.lucene.store.SingleInstanceLockFactory@1be0ef72;
maxCacheMB=48.0 maxMergeSizeMB=4.0),segFN=segments_1,generation=1}
   [junit4]   2> 708932 INFO  (coreLoadExecutor-2812-thread-1) [    x:collection1] o.a.s.c.SolrCore
newest commit generation = 1
   [junit4]   2> 708934 INFO  (coreLoadExecutor-2812-thread-1) [    x:collection1] o.a.s.c.SolrCore
no updateRequestProcessorChain defined as default, creating implicit default
   [junit4]   2> 708934 WARN  (coreLoadExecutor-2812-thread-1) [    x:collection1] o.a.s.c.RequestHandlers
INVALID paramSet a in requestHandler {type = requestHandler,name = /dump,class = DumpRequestHandler,args
= {defaults={a=A,b=B}}}
   [junit4]   2> 708935 INFO  (coreLoadExecutor-2812-thread-1) [    x:collection1] o.a.s.h.l.XMLLoader
xsltCacheLifetimeSeconds=60
   [junit4]   2> 708935 INFO  (coreLoadExecutor-2812-thread-1) [    x:collection1] o.a.s.h.l.XMLLoader
xsltCacheLifetimeSeconds=60
   [junit4]   2> 708936 INFO  (coreLoadExecutor-2812-thread-1) [    x:collection1] o.a.s.h.l.XMLLoader
xsltCacheLifetimeSeconds=60
   [junit4]   2> 708936 INFO  (coreLoadExecutor-2812-thread-1) [    x:collection1] o.a.s.h.l.XMLLoader
xsltCacheLifetimeSeconds=60
   [junit4]   2> 708937 INFO  (coreLoadExecutor-2812-thread-1) [    x:collection1] o.a.s.c.RequestHandlers
Registered paths: /admin/mbeans,standard,/dump,/update/csv,/update/json/docs,/admin/luke,/admin/segments,/get,/admin/system,/replication,/admin/properties,/config,/schema,/admin/plugins,/admin/logging,/update/json,/admin/threads,/admin/ping,/update,/admin/file
   [junit4]   2> 708937 INFO  (coreLoadExecutor-2812-thread-1) [    x:collection1] o.a.s.c.SolrCore
Using default statsCache cache: org.apache.solr.search.stats.LocalStatsCache
   [junit4]   2> 708937 INFO  (coreLoadExecutor-2812-thread-1) [    x:collection1] o.a.s.c.SolrCore
Hard AutoCommit: disabled
   [junit4]   2> 708938 INFO  (coreLoadExecutor-2812-thread-1) [    x:collection1] o.a.s.c.SolrCore
Soft AutoCommit: disabled
   [junit4]   2> 708938 INFO  (coreLoadExecutor-2812-thread-1) [    x:collection1] o.a.s.u.RandomMergePolicy
RandomMergePolicy wrapping class org.apache.lucene.index.TieredMergePolicy: [TieredMergePolicy:
maxMergeAtOnce=26, maxMergeAtOnceExplicit=21, maxMergedSegmentMB=36.4873046875, floorSegmentMB=0.6572265625,
forceMergeDeletesPctAllowed=2.1644046667993244, segmentsPerTier=45.0, maxCFSSegmentSizeMB=8.796093022207999E12,
noCFSRatio=1.0
   [junit4]   2> 708938 INFO  (coreLoadExecutor-2812-thread-1) [    x:collection1] o.a.s.c.SolrCore
SolrDeletionPolicy.onInit: commits: num=1
   [junit4]   2> 	commit{dir=NRTCachingDirectory(MMapDirectory@/home/jenkins/workspace/Lucene-Solr-5.x-Linux/solr/build/solr-core/test/J0/temp/solr.search.TestSearcherReuse
78C689305CC6D7E6-001/init-core-data-001/index lockFactory=org.apache.lucene.store.SingleInstanceLockFactory@1be0ef72;
maxCacheMB=48.0 maxMergeSizeMB=4.0),segFN=segments_1,generation=1}
   [junit4]   2> 708938 INFO  (coreLoadExecutor-2812-thread-1) [    x:collection1] o.a.s.c.SolrCore
newest commit generation = 1
   [junit4]   2> 708938 INFO  (coreLoadExecutor-2812-thread-1) [    x:collection1] o.a.s.s.SolrIndexSearcher
Opening Searcher@3691049c[collection1] main
   [junit4]   2> 708939 INFO  (coreLoadExecutor-2812-thread-1) [    x:collection1] o.a.s.r.ManagedResourceStorage
File-based storage initialized to use dir: /home/jenkins/workspace/Lucene-Solr-5.x-Linux/solr/build/solr-core/test/J0/temp/solr.search.TestSearcherReuse
78C689305CC6D7E6-001/tempDir-001/collection1/conf
   [junit4]   2> 708939 INFO  (coreLoadExecutor-2812-thread-1) [    x:collection1] o.a.s.r.RestManager
Initializing RestManager with initArgs: {storageDir=/home/jenkins/workspace/Lucene-Solr-5.x-Linux/solr/build/solr-core/test/J0/temp/solr.search.TestSearcherReuse
78C689305CC6D7E6-001/tempDir-001/collection1/conf}
   [junit4]   2> 708939 INFO  (coreLoadExecutor-2812-thread-1) [    x:collection1] o.a.s.r.ManagedResourceStorage
Reading _rest_managed.json using file:dir=/home/jenkins/workspace/Lucene-Solr-5.x-Linux/solr/build/solr-core/test/J0/temp/solr.search.TestSearcherReuse
78C689305CC6D7E6-001/tempDir-001/collection1/conf
   [junit4]   2> 708939 INFO  (coreLoadExecutor-2812-thread-1) [    x:collection1] o.a.s.r.RestManager
Initializing 0 registered ManagedResources
   [junit4]   2> 708939 INFO  (coreLoadExecutor-2812-thread-1) [    x:collection1] o.a.s.h.ReplicationHandler
Commits will be reserved for  10000
   [junit4]   2> 708939 INFO  (searcherExecutor-2813-thread-1-processing-x:collection1)
[    x:collection1] o.a.s.c.SolrCore [collection1] Registered new searcher Searcher@3691049c[collection1]
main{ExitableDirectoryReader(UninvertingDirectoryReader())}
   [junit4]   2> 708939 INFO  (coreLoadExecutor-2812-thread-1) [    x:collection1] o.a.s.c.CoreContainer
registering core: collection1
   [junit4]   2> 708940 INFO  (SUITE-TestSearcherReuse-seed#[78C689305CC6D7E6]-worker)
[    ] o.a.s.SolrTestCaseJ4 ####initCore end
   [junit4]   2> 708942 INFO  (TEST-TestSearcherReuse.test-seed#[78C689305CC6D7E6]) [ 
  ] o.a.s.SolrTestCaseJ4 ###Starting test
   [junit4]   2> 708942 INFO  (TEST-TestSearcherReuse.test-seed#[78C689305CC6D7E6]) [ 
  ] o.a.s.u.p.LogUpdateProcessor [collection1] webapp=null path=null params={} {add=[1]} 0
0
   [junit4]   2> 708943 INFO  (TEST-TestSearcherReuse.test-seed#[78C689305CC6D7E6]) [ 
  ] o.a.s.u.p.LogUpdateProcessor [collection1] webapp=null path=null params={} {add=[2]} 0
0
   [junit4]   2> 708944 INFO  (TEST-TestSearcherReuse.test-seed#[78C689305CC6D7E6]) [ 
  ] o.a.s.u.UpdateHandler start commit{,optimize=false,openSearcher=true,waitSearcher=true,expungeDeletes=false,softCommit=false,prepareCommit=false}
   [junit4]   2> 709290 INFO  (TEST-TestSearcherReuse.test-seed#[78C689305CC6D7E6]) [ 
  ] o.a.s.c.SolrCore SolrDeletionPolicy.onCommit: commits: num=2
   [junit4]   2> 	commit{dir=NRTCachingDirectory(MMapDirectory@/home/jenkins/workspace/Lucene-Solr-5.x-Linux/solr/build/solr-core/test/J0/temp/solr.search.TestSearcherReuse
78C689305CC6D7E6-001/init-core-data-001/index lockFactory=org.apache.lucene.store.SingleInstanceLockFactory@1be0ef72;
maxCacheMB=48.0 maxMergeSizeMB=4.0),segFN=segments_1,generation=1}
   [junit4]   2> 	commit{dir=NRTCachingDirectory(MMapDirectory@/home/jenkins/workspace/Lucene-Solr-5.x-Linux/solr/build/solr-core/test/J0/temp/solr.search.TestSearcherReuse
78C689305CC6D7E6-001/init-core-data-001/index lockFactory=org.apache.lucene.store.SingleInstanceLockFactory@1be0ef72;
maxCacheMB=48.0 maxMergeSizeMB=4.0),segFN=segments_2,generation=2}
   [junit4]   2> 709291 INFO  (TEST-TestSearcherReuse.test-seed#[78C689305CC6D7E6]) [ 
  ] o.a.s.c.SolrCore newest commit generation = 2
   [junit4]   2> 709292 INFO  (TEST-TestSearcherReuse.test-seed#[78C689305CC6D7E6]) [ 
  ] o.a.s.s.SolrIndexSearcher Opening Searcher@52b0a199[collection1] main
   [junit4]   2> 709293 INFO  (TEST-TestSearcherReuse.test-seed#[78C689305CC6D7E6]) [ 
  ] o.a.s.u.UpdateHandler end_commit_flush
   [junit4]   2> 709293 INFO  (searcherExecutor-2813-thread-1) [    ] o.a.s.c.SolrCore
[collection1] Registered new searcher Searcher@52b0a199[collection1] main{ExitableDirectoryReader(UninvertingDirectoryReader(Uninverting(_0(5.3.0):c2)))}
   [junit4]   2> 709293 INFO  (TEST-TestSearcherReuse.test-seed#[78C689305CC6D7E6]) [ 
  ] o.a.s.u.p.LogUpdateProcessor [collection1] webapp=null path=null params={} {commit=} 0
349
   [junit4]   2> 709294 INFO  (TEST-TestSearcherReuse.test-seed#[78C689305CC6D7E6]) [ 
  ] o.a.s.u.p.LogUpdateProcessor [collection1] webapp=null path=null params={} {add=[3]} 0
1
   [junit4]   2> 709294 INFO  (TEST-TestSearcherReuse.test-seed#[78C689305CC6D7E6]) [ 
  ] o.a.s.u.UpdateHandler start commit{,optimize=false,openSearcher=true,waitSearcher=true,expungeDeletes=false,softCommit=false,prepareCommit=false}
   [junit4]   2> 709408 INFO  (TEST-TestSearcherReuse.test-seed#[78C689305CC6D7E6]) [ 
  ] o.a.s.c.SolrCore SolrDeletionPolicy.onCommit: commits: num=2
   [junit4]   2> 	commit{dir=NRTCachingDirectory(MMapDirectory@/home/jenkins/workspace/Lucene-Solr-5.x-Linux/solr/build/solr-core/test/J0/temp/solr.search.TestSearcherReuse
78C689305CC6D7E6-001/init-core-data-001/index lockFactory=org.apache.lucene.store.SingleInstanceLockFactory@1be0ef72;
maxCacheMB=48.0 maxMergeSizeMB=4.0),segFN=segments_2,generation=2}
   [junit4]   2> 	commit{dir=NRTCachingDirectory(MMapDirectory@/home/jenkins/workspace/Lucene-Solr-5.x-Linux/solr/build/solr-core/test/J0/temp/solr.search.TestSearcherReuse
78C689305CC6D7E6-001/init-core-data-001/index lockFactory=org.apache.lucene.store.SingleInstanceLockFactory@1be0ef72;
maxCacheMB=48.0 maxMergeSizeMB=4.0),segFN=segments_3,generation=3}
   [junit4]   2> 709408 INFO  (TEST-TestSearcherReuse.test-seed#[78C689305CC6D7E6]) [ 
  ] o.a.s.c.SolrCore newest commit generation = 3
   [junit4]   2> 709409 INFO  (TEST-TestSearcherReuse.test-seed#[78C689305CC6D7E6]) [ 
  ] o.a.s.s.SolrIndexSearcher Opening Searcher@ea5f17a[collection1] main
   [junit4]   2> 709409 INFO  (TEST-TestSearcherReuse.test-seed#[78C689305CC6D7E6]) [ 
  ] o.a.s.u.UpdateHandler end_commit_flush
   [junit4]   2> 709409 INFO  (searcherExecutor-2813-thread-1) [    ] o.a.s.c.SolrCore
[collection1] Registered new searcher Searcher@ea5f17a[collection1] main{ExitableDirectoryReader(UninvertingDirectoryReader(Uninverting(_0(5.3.0):c2)
Uninverting(_1(5.3.0):c1)))}
   [junit4]   2> 709409 INFO  (TEST-TestSearcherReuse.test-seed#[78C689305CC6D7E6]) [ 
  ] o.a.s.u.p.LogUpdateProcessor [collection1] webapp=null path=null params={} {commit=} 0
115
   [junit4]   2> 709410 INFO  (TEST-TestSearcherReuse.test-seed#[78C689305CC6D7E6]) [ 
  ] o.a.s.u.p.LogUpdateProcessor [collection1] webapp=null path=null params={} {add=[4]} 0
0
   [junit4]   2> 709411 INFO  (TEST-TestSearcherReuse.test-seed#[78C689305CC6D7E6]) [ 
  ] o.a.s.u.UpdateHandler start commit{,optimize=false,openSearcher=true,waitSearcher=true,expungeDeletes=false,softCommit=false,prepareCommit=false}
   [junit4]   2> 709499 INFO  (TEST-TestSearcherReuse.test-seed#[78C689305CC6D7E6]) [ 
  ] o.a.s.c.SolrCore SolrDeletionPolicy.onCommit: commits: num=2
   [junit4]   2> 	commit{dir=NRTCachingDirectory(MMapDirectory@/home/jenkins/workspace/Lucene-Solr-5.x-Linux/solr/build/solr-core/test/J0/temp/solr.search.TestSearcherReuse
78C689305CC6D7E6-001/init-core-data-001/index lockFactory=org.apache.lucene.store.SingleInstanceLockFactory@1be0ef72;
maxCacheMB=48.0 maxMergeSizeMB=4.0),segFN=segments_3,generation=3}
   [junit4]   2> 	commit{dir=NRTCachingDirectory(MMapDirectory@/home/jenkins/workspace/Lucene-Solr-5.x-Linux/solr/build/solr-core/test/J0/temp/solr.search.TestSearcherReuse
78C689305CC6D7E6-001/init-core-data-001/index lockFactory=org.apache.lucene.store.SingleInstanceLockFactory@1be0ef72;
maxCacheMB=48.0 maxMergeSizeMB=4.0),segFN=segments_4,generation=4}
   [junit4]   2> 709499 INFO  (TEST-TestSearcherReuse.test-seed#[78C689305CC6D7E6]) [ 
  ] o.a.s.c.SolrCore newest commit generation = 4
   [junit4]   2> 709500 INFO  (TEST-TestSearcherReuse.test-seed#[78C689305CC6D7E6]) [ 
  ] o.a.s.s.SolrIndexSearcher Opening Searcher@676f29c0[collection1] main
   [junit4]   2> 709500 INFO  (TEST-TestSearcherReuse.test-seed#[78C689305CC6D7E6]) [ 
  ] o.a.s.u.UpdateHandler end_commit_flush
   [junit4]   2> 709500 INFO  (searcherExecutor-2813-thread-1) [    ] o.a.s.c.SolrCore
[collection1] Registered new searcher Searcher@676f29c0[collection1] main{ExitableDirectoryReader(UninvertingDirectoryReader(Uninverting(_0(5.3.0):c2)
Uninverting(_1(5.3.0):c1) Uninverting(_2(5.3.0):c1)))}
   [junit4]   2> 709500 INFO  (TEST-TestSearcherReuse.test-seed#[78C689305CC6D7E6]) [ 
  ] o.a.s.u.p.LogUpdateProcessor [collection1] webapp=null path=null params={} {commit=} 0
89
   [junit4]   2> 709501 INFO  (TEST-TestSearcherReuse.test-seed#[78C689305CC6D7E6]) [ 
  ] o.a.s.c.S.Request [collection1] webapp=null path=null params={q=*:*&qt=standard&start=0&rows=20&version=2.2}
hits=4 status=0 QTime=0 
   [junit4]   2> 709502 INFO  (TEST-TestSearcherReuse.test-seed#[78C689305CC6D7E6]) [ 
  ] o.a.s.u.UpdateHandler start commit{,optimize=false,openSearcher=true,waitSearcher=true,expungeDeletes=false,softCommit=false,prepareCommit=false}
   [junit4]   2> 709502 INFO  (TEST-TestSearcherReuse.test-seed#[78C689305CC6D7E6]) [ 
  ] o.a.s.u.UpdateHandler No uncommitted changes. Skipping IW.commit.
   [junit4]   2> 709502 INFO  (TEST-TestSearcherReuse.test-seed#[78C689305CC6D7E6]) [ 
  ] o.a.s.c.SolrCore SolrIndexSearcher has not changed - not re-opening: org.apache.solr.search.SolrIndexSearcher
   [junit4]   2> 709503 INFO  (TEST-TestSearcherReuse.test-seed#[78C689305CC6D7E6]) [ 
  ] o.a.s.u.UpdateHandler end_commit_flush
   [junit4]   2> 709503 INFO  (TEST-TestSearcherReuse.test-seed#[78C689305CC6D7E6]) [ 
  ] o.a.s.u.p.LogUpdateProcessor [collection1] webapp=null path=null params={} {commit=} 0
1
   [junit4]   2> 709503 INFO  (TEST-TestSearcherReuse.test-seed#[78C689305CC6D7E6]) [ 
  ] o.a.s.u.UpdateHandler start commit{,optimize=false,openSearcher=true,waitSearcher=true,expungeDeletes=false,softCommit=false,prepareCommit=false}
   [junit4]   2> 709503 INFO  (TEST-TestSearcherReuse.test-seed#[78C689305CC6D7E6]) [ 
  ] o.a.s.u.UpdateHandler No uncommitted changes. Skipping IW.commit.
   [junit4]   2> 709503 INFO  (TEST-TestSearcherReuse.test-seed#[78C689305CC6D7E6]) [ 
  ] o.a.s.c.SolrCore SolrIndexSearcher has not changed - not re-opening: org.apache.solr.search.SolrIndexSearcher
   [junit4]   2> 709504 INFO  (TEST-TestSearcherReuse.test-seed#[78C689305CC6D7E6]) [ 
  ] o.a.s.u.UpdateHandler end_commit_flush
   [junit4]   2> 709504 INFO  (TEST-TestSearcherReuse.test-seed#[78C689305CC6D7E6]) [ 
  ] o.a.s.u.p.LogUpdateProcessor [collection1] webapp=null path=null params={} {commit=} 0
1
   [junit4]   2> 709504 INFO  (TEST-TestSearcherReuse.test-seed#[78C689305CC6D7E6]) [ 
  ] o.a.s.u.UpdateHandler start commit{,optimize=false,openSearcher=true,waitSearcher=true,expungeDeletes=false,softCommit=true,prepareCommit=false}
   [junit4]   2> 709504 INFO  (TEST-TestSearcherReuse.test-seed#[78C689305CC6D7E6]) [ 
  ] o.a.s.c.SolrCore SolrIndexSearcher has not changed - not re-opening: org.apache.solr.search.SolrIndexSearcher
   [junit4]   2> 709504 INFO  (TEST-TestSearcherReuse.test-seed#[78C689305CC6D7E6]) [ 
  ] o.a.s.u.UpdateHandler end_commit_flush
   [junit4]   2> 709505 INFO  (TEST-TestSearcherReuse.test-seed#[78C689305CC6D7E6]) [ 
  ] o.a.s.u.p.LogUpdateProcessor [collection1] webapp=null path=null params={} {commit=} 0
1
   [junit4]   2> 709505 INFO  (TEST-TestSearcherReuse.test-seed#[78C689305CC6D7E6]) [ 
  ] o.a.s.u.UpdateHandler start commit{,optimize=false,openSearcher=true,waitSearcher=true,expungeDeletes=false,softCommit=true,prepareCommit=false}
   [junit4]   2> 709505 INFO  (TEST-TestSearcherReuse.test-seed#[78C689305CC6D7E6]) [ 
  ] o.a.s.c.SolrCore SolrIndexSearcher has not changed - not re-opening: org.apache.solr.search.SolrIndexSearcher
   [junit4]   2> 709505 INFO  (TEST-TestSearcherReuse.test-seed#[78C689305CC6D7E6]) [ 
  ] o.a.s.u.UpdateHandler end_commit_flush
   [junit4]   2> 709505 INFO  (TEST-TestSearcherReuse.test-seed#[78C689305CC6D7E6]) [ 
  ] o.a.s.u.p.LogUpdateProcessor [collection1] webapp=null path=null params={} {commit=} 0
0
   [junit4]   2> 709515 INFO  (TEST-TestSearcherReuse.test-seed#[78C689305CC6D7E6]) [ 
  ] o.a.s.u.p.LogUpdateProcessor [collection1] webapp=null path=null params={} {deleteByQuery=id:match_no_documents}
0 1
   [junit4]   2> 709515 INFO  (TEST-TestSearcherReuse.test-seed#[78C689305CC6D7E6]) [ 
  ] o.a.s.u.UpdateHandler start commit{,optimize=false,openSearcher=true,waitSearcher=true,expungeDeletes=false,softCommit=false,prepareCommit=false}
   [junit4]   2> 709540 INFO  (TEST-TestSearcherReuse.test-seed#[78C689305CC6D7E6]) [ 
  ] o.a.s.c.SolrCore SolrDeletionPolicy.onCommit: commits: num=2
   [junit4]   2> 	commit{dir=NRTCachingDirectory(MMapDirectory@/home/jenkins/workspace/Lucene-Solr-5.x-Linux/solr/build/solr-core/test/J0/temp/solr.search.TestSearcherReuse
78C689305CC6D7E6-001/init-core-data-001/index lockFactory=org.apache.lucene.store.SingleInstanceLockFactory@1be0ef72;
maxCacheMB=48.0 maxMergeSizeMB=4.0),segFN=segments_4,generation=4}
   [junit4]   2> 	commit{dir=NRTCachingDirectory(MMapDirectory@/home/jenkins/workspace/Lucene-Solr-5.x-Linux/solr/build/solr-core/test/J0/temp/solr.search.TestSearcherReuse
78C689305CC6D7E6-001/init-core-data-001/index lockFactory=org.apache.lucene.store.SingleInstanceLockFactory@1be0ef72;
maxCacheMB=48.0 maxMergeSizeMB=4.0),segFN=segments_5,generation=5}
   [junit4]   2> 709540 INFO  (TEST-TestSearcherReuse.test-seed#[78C689305CC6D7E6]) [ 
  ] o.a.s.c.SolrCore newest commit generation = 5
   [junit4]   2> 709540 INFO  (TEST-TestSearcherReuse.test-seed#[78C689305CC6D7E6]) [ 
  ] o.a.s.s.SolrIndexSearcher Opening Searcher@c8a13cd[collection1] main
   [junit4]   2> 709540 INFO  (TEST-TestSearcherReuse.test-seed#[78C689305CC6D7E6]) [ 
  ] o.a.s.u.UpdateHandler end_commit_flush
   [junit4]   2> 709540 INFO  (searcherExecutor-2813-thread-1) [    ] o.a.s.c.SolrCore
[collection1] Registered new searcher Searcher@c8a13cd[collection1] main{ExitableDirectoryReader(UninvertingDirectoryReader(Uninverting(_0(5.3.0):c2)
Uninverting(_1(5.3.0):c1) Uninverting(_2(5.3.0):c1)))}
   [junit4]   2> 709541 INFO  (TEST-TestSearcherReuse.test-seed#[78C689305CC6D7E6]) [ 
  ] o.a.s.u.p.LogUpdateProcessor [collection1] webapp=null path=null params={} {commit=} 0
26
   [junit4]   2> 709541 INFO  (TEST-TestSearcherReuse.test-seed#[78C689305CC6D7E6]) [ 
  ] o.a.s.SolrTestCaseJ4 ###Ending test
   [junit4]   2> 709541 INFO  (TEST-TestSearcherReuse.test-seed#[78C689305CC6D7E6]) [ 
  ] o.a.s.c.SolrCore [collection1] REMOVING ALL DOCUMENTS FROM INDEX
   [junit4]   2> 709541 INFO  (TEST-TestSearcherReuse.test-seed#[78C689305CC6D7E6]) [ 
  ] o.a.s.u.p.LogUpdateProcessor [collection1] webapp=null path=null params={} {deleteByQuery=*:*}
0 0
   [junit4]   2> 709542 INFO  (TEST-TestSearcherReuse.test-seed#[78C689305CC6D7E6]) [ 
  ] o.a.s.u.UpdateHandler start commit{,optimize=false,openSearcher=true,waitSearcher=true,expungeDeletes=false,softCommit=false,prepareCommit=false}
   [junit4]   2> 709566 INFO  (TEST-TestSearcherReuse.test-seed#[78C689305CC6D7E6]) [ 
  ] o.a.s.c.SolrCore SolrDeletionPolicy.onCommit: commits: num=2
   [junit4]   2> 	commit{dir=NRTCachingDirectory(MMapDirectory@/home/jenkins/workspace/Lucene-Solr-5.x-Linux/solr/build/solr-core/test/J0/temp/solr.search.TestSearcherReuse
78C689305CC6D7E6-001/init-core-data-001/index lockFactory=org.apache.lucene.store.SingleInstanceLockFactory@1be0ef72;
maxCacheMB=48.0 maxMergeSizeMB=4.0),segFN=segments_5,generation=5}
   [junit4]   2> 	commit{dir=NRTCachingDirectory(MMapDirectory@/home/jenkins/workspace/Lucene-Solr-5.x-Linux/solr/build/solr-core/test/J0/temp/solr.search.TestSearcherReuse
78C689305CC6D7E6-001/init-core-data-001/index lockFactory=org.apache.lucene.store.SingleInstanceLockFactory@1be0ef72;
maxCacheMB=48.0 maxMergeSizeMB=4.0),segFN=segments_6,generation=6}
   [junit4]   2> 709567 INFO  (TEST-TestSearcherReuse.test-seed#[78C689305CC6D7E6]) [ 
  ] o.a.s.c.SolrCore newest commit generation = 6
   [junit4]   2> 709567 INFO  (TEST-TestSearcherReuse.test-seed#[78C689305CC6D7E6]) [ 
  ] o.a.s.s.SolrIndexSearcher Opening Searcher@300e8081[collection1] main
   [junit4]   2> 709567 INFO  (TEST-TestSearcherReuse.test-seed#[78C689305CC6D7E6]) [ 
  ] o.a.s.u.UpdateHandler end_commit_flush
   [junit4]   2> 709567 INFO  (searcherExecutor-2813-thread-1) [    ] o.a.s.c.SolrCore
[collection1] Registered new searcher Searcher@300e8081[collection1] main{ExitableDirectoryReader(UninvertingDirectoryReader())}
   [junit4]   2> 709568 INFO  (TEST-TestSearcherReuse.test-seed#[78C689305CC6D7E6]) [ 
  ] o.a.s.u.p.LogUpdateProcessor [collection1] webapp=null path=null params={} {commit=} 0
26
   [junit4]   2> NOTE: reproduce with: ant test  -Dtestcase=TestSearcherReuse -Dtests.method=test
-Dtests.seed=78C689305CC6D7E6 -Dtests.multiplier=3 -Dtests.slow=true -Dtests.locale=sr_RS
-Dtests.timezone=GB -Dtests.asserts=true -Dtests.file.encoding=UTF-8
   [junit4] FAILURE 0.63s J0 | TestSearcherReuse.test <<<
   [junit4]    > Throwable #1: java.lang.AssertionError: expected same:<Searcher@676f29c0[collection1]
main{ExitableDirectoryReader(UninvertingDirectoryReader(Uninverting(_0(5.3.0):c2) Uninverting(_1(5.3.0):c1)
Uninverting(_2(5.3.0):c1)))}> was not:<Searcher@c8a13cd[collection1] main{ExitableDirectoryReader(UninvertingDirectoryReader(Uninverting(_0(5.3.0):c2)
Uninverting(_1(5.3.0):c1) Uninverting(_2(5.3.0):c1)))}>
   [junit4]    > 	at __randomizedtesting.SeedInfo.seed([78C689305CC6D7E6:F092B6EAF23ABA1E]:0)
   [junit4]    > 	at org.apache.solr.search.TestSearcherReuse.assertSearcherHasNotChanged(TestSearcherReuse.java:247)
   [junit4]    > 	at org.apache.solr.search.TestSearcherReuse.test(TestSearcherReuse.java:117)
   [junit4]    > 	at java.lang.Thread.run(Thread.java:745)
   [junit4]   2> 709573 INFO  (SUITE-TestSearcherReuse-seed#[78C689305CC6D7E6]-worker)
[    ] o.a.s.SolrTestCaseJ4 ###deleteCore
   [junit4]   2> 709573 INFO  (SUITE-TestSearcherReuse-seed#[78C689305CC6D7E6]-worker)
[    ] o.a.s.c.CoreContainer Shutting down CoreContainer instance=2021460876
   [junit4]   2> 709573 INFO  (SUITE-TestSearcherReuse-seed#[78C689305CC6D7E6]-worker)
[    x:collection1] o.a.s.c.SolrCore [collection1]  CLOSING SolrCore org.apache.solr.core.SolrCore@35f348be
   [junit4]   2> 709573 INFO  (SUITE-TestSearcherReuse-seed#[78C689305CC6D7E6]-worker)
[    x:collection1] o.a.s.u.UpdateHandler closing DirectUpdateHandler2{commits=9,autocommits=0,soft
autocommits=0,optimizes=0,rollbacks=0,expungeDeletes=0,docsPending=0,adds=0,deletesById=0,deletesByQuery=0,errors=0,cumulative_adds=4,cumulative_deletesById=0,cumulative_deletesByQuery=2,cumulative_errors=0}
   [junit4]   2> 709573 INFO  (SUITE-TestSearcherReuse-seed#[78C689305CC6D7E6]-worker)
[    x:collection1] o.a.s.u.SolrCoreState Closing SolrCoreState
   [junit4]   2> 709573 INFO  (SUITE-TestSearcherReuse-seed#[78C689305CC6D7E6]-worker)
[    x:collection1] o.a.s.u.DefaultSolrCoreState SolrCoreState ref count has reached 0 - closing
IndexWriter
   [junit4]   2> 709573 INFO  (SUITE-TestSearcherReuse-seed#[78C689305CC6D7E6]-worker)
[    x:collection1] o.a.s.u.DefaultSolrCoreState closing IndexWriter with IndexWriterCloser
   [junit4]   2> 709574 INFO  (SUITE-TestSearcherReuse-seed#[78C689305CC6D7E6]-worker)
[    x:collection1] o.a.s.c.SolrCore [collection1] Closing main searcher on request.
   [junit4]   2> 709574 INFO  (SUITE-TestSearcherReuse-seed#[78C689305CC6D7E6]-worker)
[    x:collection1] o.a.s.c.CachingDirectoryFactory Closing NRTCachingDirectoryFactory - 2
directories currently being tracked
   [junit4]   2> 709574 INFO  (SUITE-TestSearcherReuse-seed#[78C689305CC6D7E6]-worker)
[    x:collection1] o.a.s.c.CachingDirectoryFactory looking to close /home/jenkins/workspace/Lucene-Solr-5.x-Linux/solr/build/solr-core/test/J0/temp/solr.search.TestSearcherReuse
78C689305CC6D7E6-001/init-core-data-001 [CachedDir<<refCount=0;path=/home/jenkins/workspace/Lucene-Solr-5.x-Linux/solr/build/solr-core/test/J0/temp/solr.search.TestSearcherReuse
78C689305CC6D7E6-001/init-core-data-001;done=false>>]
   [junit4]   2> 709574 INFO  (SUITE-TestSearcherReuse-seed#[78C689305CC6D7E6]-worker)
[    x:collection1] o.a.s.c.CachingDirectoryFactory Closing directory: /home/jenkins/workspace/Lucene-Solr-5.x-Linux/solr/build/solr-core/test/J0/temp/solr.search.TestSearcherReuse
78C689305CC6D7E6-001/init-core-data-001
   [junit4]   2> 709574 INFO  (SUITE-TestSearcherReuse-seed#[78C689305CC6D7E6]-worker)
[    x:collection1] o.a.s.c.CachingDirectoryFactory looking to close /home/jenkins/workspace/Lucene-Solr-5.x-Linux/solr/build/solr-core/test/J0/temp/solr.search.TestSearcherReuse
78C689305CC6D7E6-001/init-core-data-001/index [CachedDir<<refCount=0;path=/home/jenkins/workspace/Lucene-Solr-5.x-Linux/solr/build/solr-core/test/J0/temp/solr.search.TestSearcherReuse
78C689305CC6D7E6-001/init-core-data-001/index;done=false>>]
   [junit4]   2> 709574 INFO  (SUITE-TestSearcherReuse-seed#[78C689305CC6D7E6]-worker)
[    x:collection1] o.a.s.c.CachingDirectoryFactory Closing directory: /home/jenkins/workspace/Lucene-Solr-5.x-Linux/solr/build/solr-core/test/J0/temp/solr.search.TestSearcherReuse
78C689305CC6D7E6-001/init-core-data-001/index
   [junit4]   2> NOTE: leaving temporary files on disk at: /home/jenkins/workspace/Lucene-Solr-5.x-Linux/solr/build/solr-core/test/J0/temp/solr.search.TestSearcherReuse
78C689305CC6D7E6-001
   [junit4]   2> NOTE: test params are: codec=Asserting(Lucene50), sim=RandomSimilarityProvider(queryNorm=false,coord=yes):
{}, locale=sr_RS, timezone=GB
   [junit4]   2> NOTE: Linux 3.13.0-53-generic amd64/Oracle Corporation 1.8.0_60-ea (64-bit)/cpus=12,threads=1,free=328626680,total=534249472
   [junit4]   2> NOTE: All tests run in this JVM: [TestStressLucene, TestSolrXml, TestReplicationHandler,
TermVectorComponentTest, TestLeaderElectionZkExpiry, TestFieldCollectionResource, TestSolr4Spatial2,
MultiTermTest, URLClassifyProcessorTest, DistributedIntervalFacetingTest, SignatureUpdateProcessorFactoryTest,
DefaultValueUpdateProcessorTest, DocValuesMissingTest, CSVRequestHandlerTest, TestCloudInspectUtil,
TestMiniSolrCloudClusterSSL, PrimitiveFieldTypeTest, TestRemoteStreaming, TestTolerantSearch,
TestArbitraryIndexDir, TestCopyFieldCollectionResource, RequestHandlersTest, SolrRequestParserTest,
TestShortCircuitedRequests, TestImplicitCoreProperties, SuggesterFSTTest, StandardRequestHandlerTest,
TestReplicationHandlerBackup, VersionInfoTest, CoreMergeIndexesAdminHandlerTest, TestFunctionQuery,
TestMissingGroups, TestPhraseSuggestions, DistributedQueryComponentCustomSortTest, TestInitQParser,
TestRandomDVFaceting, TestRemoveLastDynamicCopyField, HighlighterConfigTest, HdfsChaosMonkeySafeLeaderTest,
LeaderInitiatedRecoveryOnCommitTest, TestMergePolicyConfig, BasicDistributedZkTest, TestJoin,
DistribJoinFromCollectionTest, HdfsRecoverLeaseTest, FastVectorHighlighterTest, IndexSchemaTest,
TestInfoStreamLogging, MinimalSchemaTest, ExternalFileFieldSortTest, TestUpdate, TestDistributedSearch,
TermsComponentTest, SolrCoreTest, TestSweetSpotSimilarityFactory, DistributedSpellCheckComponentTest,
StressHdfsTest, DebugComponentTest, PingRequestHandlerTest, DistributedDebugComponentTest,
ZkNodePropsTest, DistributedQueryComponentOptimizationTest, MultiThreadedOCPTest, TestDFRSimilarityFactory,
OutOfBoxZkACLAndCredentialsProvidersTest, DistributedSuggestComponentTest, TestBinaryField,
TestIndexingPerformance, TimeZoneUtilsTest, TestJmxIntegration, UUIDFieldTest, TestMaxScoreQueryParser,
SyncSliceTest, TestLazyCores, TestRealTimeGet, TestBadConfig, TestSearcherReuse]
   [junit4] Completed [241/497] on J0 in 1.05s, 1 test, 1 failure <<< FAILURES!

[...truncated 802 lines...]
BUILD FAILED
/home/jenkins/workspace/Lucene-Solr-5.x-Linux/build.xml:536: The following error occurred
while executing this line:
/home/jenkins/workspace/Lucene-Solr-5.x-Linux/build.xml:484: The following error occurred
while executing this line:
/home/jenkins/workspace/Lucene-Solr-5.x-Linux/build.xml:61: The following error occurred while
executing this line:
/home/jenkins/workspace/Lucene-Solr-5.x-Linux/extra-targets.xml:39: The following error occurred
while executing this line:
/home/jenkins/workspace/Lucene-Solr-5.x-Linux/solr/build.xml:230: The following error occurred
while executing this line:
/home/jenkins/workspace/Lucene-Solr-5.x-Linux/solr/common-build.xml:511: The following error
occurred while executing this line:
/home/jenkins/workspace/Lucene-Solr-5.x-Linux/lucene/common-build.xml:1436: The following
error occurred while executing this line:
/home/jenkins/workspace/Lucene-Solr-5.x-Linux/lucene/common-build.xml:991: There were test
failures: 497 suites, 1974 tests, 1 failure, 58 ignored (25 assumptions)

Total time: 49 minutes 49 seconds
Build step 'Invoke Ant' marked build as failure
Archiving artifacts
Recording test results
Email was triggered for: Failure - Any
Sending email for trigger: Failure - Any



Mime
View raw message