lucene-dev mailing list archives

Site index · List index
Message view « Date » · « Thread »
Top « Date » · « Thread »
From Policeman Jenkins Server <jenk...@thetaphi.de>
Subject [JENKINS] Lucene-Solr-trunk-Linux (32bit/jdk1.9.0-ea-b60) - Build # 12967 - Failure!
Date Sun, 07 Jun 2015 03:25:37 GMT
Build: http://jenkins.thetaphi.de/job/Lucene-Solr-trunk-Linux/12967/
Java: 32bit/jdk1.9.0-ea-b60 -client -XX:+UseParallelGC

1 tests failed.
FAILED:  org.apache.solr.cloud.CollectionsAPIAsyncDistributedZkTest.testSolrJAPICalls

Error Message:
Shard split did not complete. Last recorded state: running expected:<[completed]> but was:<[running]>

Stack Trace:
org.junit.ComparisonFailure: Shard split did not complete. Last recorded state: running expected:<[completed]> but was:<[running]>
	at __randomizedtesting.SeedInfo.seed([1A58B13484DE1995:423C3D5582B4B141]:0)
	at org.junit.Assert.assertEquals(Assert.java:125)
	at org.apache.solr.cloud.CollectionsAPIAsyncDistributedZkTest.testSolrJAPICalls(CollectionsAPIAsyncDistributedZkTest.java:90)
	at sun.reflect.NativeMethodAccessorImpl.invoke0(Native Method)
	at sun.reflect.NativeMethodAccessorImpl.invoke(NativeMethodAccessorImpl.java:62)
	at sun.reflect.DelegatingMethodAccessorImpl.invoke(DelegatingMethodAccessorImpl.java:43)
	at java.lang.reflect.Method.invoke(Method.java:502)
	at com.carrotsearch.randomizedtesting.RandomizedRunner.invoke(RandomizedRunner.java:1627)
	at com.carrotsearch.randomizedtesting.RandomizedRunner$6.evaluate(RandomizedRunner.java:836)
	at com.carrotsearch.randomizedtesting.RandomizedRunner$7.evaluate(RandomizedRunner.java:872)
	at com.carrotsearch.randomizedtesting.RandomizedRunner$8.evaluate(RandomizedRunner.java:886)
	at org.apache.solr.BaseDistributedSearchTestCase$ShardsRepeatRule$ShardsFixedStatement.callStatement(BaseDistributedSearchTestCase.java:960)
	at org.apache.solr.BaseDistributedSearchTestCase$ShardsRepeatRule$ShardsStatement.evaluate(BaseDistributedSearchTestCase.java:935)
	at com.carrotsearch.randomizedtesting.rules.SystemPropertiesRestoreRule$1.evaluate(SystemPropertiesRestoreRule.java:57)
	at org.apache.lucene.util.TestRuleSetupTeardownChained$1.evaluate(TestRuleSetupTeardownChained.java:50)
	at org.apache.lucene.util.AbstractBeforeAfterRule$1.evaluate(AbstractBeforeAfterRule.java:46)
	at org.apache.lucene.util.TestRuleThreadAndTestName$1.evaluate(TestRuleThreadAndTestName.java:49)
	at org.apache.lucene.util.TestRuleIgnoreAfterMaxFailures$1.evaluate(TestRuleIgnoreAfterMaxFailures.java:65)
	at org.apache.lucene.util.TestRuleMarkFailure$1.evaluate(TestRuleMarkFailure.java:48)
	at com.carrotsearch.randomizedtesting.rules.StatementAdapter.evaluate(StatementAdapter.java:36)
	at com.carrotsearch.randomizedtesting.ThreadLeakControl$StatementRunner.run(ThreadLeakControl.java:365)
	at com.carrotsearch.randomizedtesting.ThreadLeakControl.forkTimeoutingTask(ThreadLeakControl.java:798)
	at com.carrotsearch.randomizedtesting.ThreadLeakControl$3.evaluate(ThreadLeakControl.java:458)
	at com.carrotsearch.randomizedtesting.RandomizedRunner.runSingleTest(RandomizedRunner.java:845)
	at com.carrotsearch.randomizedtesting.RandomizedRunner$3.evaluate(RandomizedRunner.java:747)
	at com.carrotsearch.randomizedtesting.RandomizedRunner$4.evaluate(RandomizedRunner.java:781)
	at com.carrotsearch.randomizedtesting.RandomizedRunner$5.evaluate(RandomizedRunner.java:792)
	at com.carrotsearch.randomizedtesting.rules.StatementAdapter.evaluate(StatementAdapter.java:36)
	at com.carrotsearch.randomizedtesting.rules.SystemPropertiesRestoreRule$1.evaluate(SystemPropertiesRestoreRule.java:57)
	at org.apache.lucene.util.AbstractBeforeAfterRule$1.evaluate(AbstractBeforeAfterRule.java:46)
	at com.carrotsearch.randomizedtesting.rules.StatementAdapter.evaluate(StatementAdapter.java:36)
	at org.apache.lucene.util.TestRuleStoreClassName$1.evaluate(TestRuleStoreClassName.java:42)
	at com.carrotsearch.randomizedtesting.rules.NoShadowingOrOverridesOnMethodsRule$1.evaluate(NoShadowingOrOverridesOnMethodsRule.java:39)
	at com.carrotsearch.randomizedtesting.rules.NoShadowingOrOverridesOnMethodsRule$1.evaluate(NoShadowingOrOverridesOnMethodsRule.java:39)
	at com.carrotsearch.randomizedtesting.rules.StatementAdapter.evaluate(StatementAdapter.java:36)
	at com.carrotsearch.randomizedtesting.rules.StatementAdapter.evaluate(StatementAdapter.java:36)
	at com.carrotsearch.randomizedtesting.rules.StatementAdapter.evaluate(StatementAdapter.java:36)
	at org.apache.lucene.util.TestRuleAssertionsRequired$1.evaluate(TestRuleAssertionsRequired.java:54)
	at org.apache.lucene.util.TestRuleMarkFailure$1.evaluate(TestRuleMarkFailure.java:48)
	at org.apache.lucene.util.TestRuleIgnoreAfterMaxFailures$1.evaluate(TestRuleIgnoreAfterMaxFailures.java:65)
	at org.apache.lucene.util.TestRuleIgnoreTestSuites$1.evaluate(TestRuleIgnoreTestSuites.java:55)
	at com.carrotsearch.randomizedtesting.rules.StatementAdapter.evaluate(StatementAdapter.java:36)
	at com.carrotsearch.randomizedtesting.ThreadLeakControl$StatementRunner.run(ThreadLeakControl.java:365)
	at java.lang.Thread.run(Thread.java:745)




Build Log:
[...truncated 9656 lines...]
   [junit4] Suite: org.apache.solr.cloud.CollectionsAPIAsyncDistributedZkTest
   [junit4]   2> Creating dataDir: /home/jenkins/workspace/Lucene-Solr-trunk-Linux/solr/build/solr-core/test/J0/temp/solr.cloud.CollectionsAPIAsyncDistributedZkTest 1A58B13484DE1995-001/init-core-data-001
   [junit4]   2> 118365 INFO  (SUITE-CollectionsAPIAsyncDistributedZkTest-seed#[1A58B13484DE1995]-worker) [    ] o.a.s.SolrTestCaseJ4 Randomized ssl (false) and clientAuth (false)
   [junit4]   2> 118365 INFO  (SUITE-CollectionsAPIAsyncDistributedZkTest-seed#[1A58B13484DE1995]-worker) [    ] o.a.s.BaseDistributedSearchTestCase Setting hostContext system property: /
   [junit4]   2> 118367 INFO  (TEST-CollectionsAPIAsyncDistributedZkTest.testSolrJAPICalls-seed#[1A58B13484DE1995]) [    ] o.a.s.c.ZkTestServer STARTING ZK TEST SERVER
   [junit4]   2> 118367 INFO  (Thread-465) [    ] o.a.s.c.ZkTestServer client port:0.0.0.0/0.0.0.0:0
   [junit4]   2> 118368 INFO  (Thread-465) [    ] o.a.s.c.ZkTestServer Starting server
   [junit4]   2> 118468 INFO  (TEST-CollectionsAPIAsyncDistributedZkTest.testSolrJAPICalls-seed#[1A58B13484DE1995]) [    ] o.a.s.c.ZkTestServer start zk server on port:33820
   [junit4]   2> 118468 INFO  (TEST-CollectionsAPIAsyncDistributedZkTest.testSolrJAPICalls-seed#[1A58B13484DE1995]) [    ] o.a.s.c.c.SolrZkClient Using default ZkCredentialsProvider
   [junit4]   2> 118468 INFO  (TEST-CollectionsAPIAsyncDistributedZkTest.testSolrJAPICalls-seed#[1A58B13484DE1995]) [    ] o.a.s.c.c.ConnectionManager Waiting for client to connect to ZooKeeper
   [junit4]   2> 118470 INFO  (zkCallback-558-thread-1) [    ] o.a.s.c.c.ConnectionManager Watcher org.apache.solr.common.cloud.ConnectionManager@1652476 name:ZooKeeperConnection Watcher:127.0.0.1:33820 got event WatchedEvent state:SyncConnected type:None path:null path:null type:None
   [junit4]   2> 118470 INFO  (TEST-CollectionsAPIAsyncDistributedZkTest.testSolrJAPICalls-seed#[1A58B13484DE1995]) [    ] o.a.s.c.c.ConnectionManager Client is connected to ZooKeeper
   [junit4]   2> 118471 INFO  (TEST-CollectionsAPIAsyncDistributedZkTest.testSolrJAPICalls-seed#[1A58B13484DE1995]) [    ] o.a.s.c.c.SolrZkClient Using default ZkACLProvider
   [junit4]   2> 118471 INFO  (TEST-CollectionsAPIAsyncDistributedZkTest.testSolrJAPICalls-seed#[1A58B13484DE1995]) [    ] o.a.s.c.c.SolrZkClient makePath: /solr
   [junit4]   2> 118472 INFO  (TEST-CollectionsAPIAsyncDistributedZkTest.testSolrJAPICalls-seed#[1A58B13484DE1995]) [    ] o.a.s.c.c.SolrZkClient Using default ZkCredentialsProvider
   [junit4]   2> 118473 INFO  (TEST-CollectionsAPIAsyncDistributedZkTest.testSolrJAPICalls-seed#[1A58B13484DE1995]) [    ] o.a.s.c.c.ConnectionManager Waiting for client to connect to ZooKeeper
   [junit4]   2> 118476 INFO  (zkCallback-559-thread-1) [    ] o.a.s.c.c.ConnectionManager Watcher org.apache.solr.common.cloud.ConnectionManager@d3f4ac name:ZooKeeperConnection Watcher:127.0.0.1:33820/solr got event WatchedEvent state:SyncConnected type:None path:null path:null type:None
   [junit4]   2> 118476 INFO  (TEST-CollectionsAPIAsyncDistributedZkTest.testSolrJAPICalls-seed#[1A58B13484DE1995]) [    ] o.a.s.c.c.ConnectionManager Client is connected to ZooKeeper
   [junit4]   2> 118477 INFO  (TEST-CollectionsAPIAsyncDistributedZkTest.testSolrJAPICalls-seed#[1A58B13484DE1995]) [    ] o.a.s.c.c.SolrZkClient Using default ZkACLProvider
   [junit4]   2> 118477 INFO  (TEST-CollectionsAPIAsyncDistributedZkTest.testSolrJAPICalls-seed#[1A58B13484DE1995]) [    ] o.a.s.c.c.SolrZkClient makePath: /collections/collection1
   [junit4]   2> 118479 INFO  (TEST-CollectionsAPIAsyncDistributedZkTest.testSolrJAPICalls-seed#[1A58B13484DE1995]) [    ] o.a.s.c.c.SolrZkClient makePath: /collections/collection1/shards
   [junit4]   2> 118479 INFO  (TEST-CollectionsAPIAsyncDistributedZkTest.testSolrJAPICalls-seed#[1A58B13484DE1995]) [    ] o.a.s.c.c.SolrZkClient makePath: /collections/control_collection
   [junit4]   2> 118480 INFO  (TEST-CollectionsAPIAsyncDistributedZkTest.testSolrJAPICalls-seed#[1A58B13484DE1995]) [    ] o.a.s.c.c.SolrZkClient makePath: /collections/control_collection/shards
   [junit4]   2> 118482 INFO  (TEST-CollectionsAPIAsyncDistributedZkTest.testSolrJAPICalls-seed#[1A58B13484DE1995]) [    ] o.a.s.c.AbstractZkTestCase put /home/jenkins/workspace/Lucene-Solr-trunk-Linux/solr/core/src/test-files/solr/collection1/conf/solrconfig-tlog.xml to /configs/conf1/solrconfig.xml
   [junit4]   2> 118482 INFO  (TEST-CollectionsAPIAsyncDistributedZkTest.testSolrJAPICalls-seed#[1A58B13484DE1995]) [    ] o.a.s.c.c.SolrZkClient makePath: /configs/conf1/solrconfig.xml
   [junit4]   2> 118484 INFO  (TEST-CollectionsAPIAsyncDistributedZkTest.testSolrJAPICalls-seed#[1A58B13484DE1995]) [    ] o.a.s.c.AbstractZkTestCase put /home/jenkins/workspace/Lucene-Solr-trunk-Linux/solr/core/src/test-files/solr/collection1/conf/schema.xml to /configs/conf1/schema.xml
   [junit4]   2> 118484 INFO  (TEST-CollectionsAPIAsyncDistributedZkTest.testSolrJAPICalls-seed#[1A58B13484DE1995]) [    ] o.a.s.c.c.SolrZkClient makePath: /configs/conf1/schema.xml
   [junit4]   2> 118485 INFO  (TEST-CollectionsAPIAsyncDistributedZkTest.testSolrJAPICalls-seed#[1A58B13484DE1995]) [    ] o.a.s.c.AbstractZkTestCase put /home/jenkins/workspace/Lucene-Solr-trunk-Linux/solr/core/src/test-files/solr/collection1/conf/solrconfig.snippet.randomindexconfig.xml to /configs/conf1/solrconfig.snippet.randomindexconfig.xml
   [junit4]   2> 118485 INFO  (TEST-CollectionsAPIAsyncDistributedZkTest.testSolrJAPICalls-seed#[1A58B13484DE1995]) [    ] o.a.s.c.c.SolrZkClient makePath: /configs/conf1/solrconfig.snippet.randomindexconfig.xml
   [junit4]   2> 118486 INFO  (TEST-CollectionsAPIAsyncDistributedZkTest.testSolrJAPICalls-seed#[1A58B13484DE1995]) [    ] o.a.s.c.AbstractZkTestCase put /home/jenkins/workspace/Lucene-Solr-trunk-Linux/solr/core/src/test-files/solr/collection1/conf/stopwords.txt to /configs/conf1/stopwords.txt
   [junit4]   2> 118486 INFO  (TEST-CollectionsAPIAsyncDistributedZkTest.testSolrJAPICalls-seed#[1A58B13484DE1995]) [    ] o.a.s.c.c.SolrZkClient makePath: /configs/conf1/stopwords.txt
   [junit4]   2> 118488 INFO  (TEST-CollectionsAPIAsyncDistributedZkTest.testSolrJAPICalls-seed#[1A58B13484DE1995]) [    ] o.a.s.c.AbstractZkTestCase put /home/jenkins/workspace/Lucene-Solr-trunk-Linux/solr/core/src/test-files/solr/collection1/conf/protwords.txt to /configs/conf1/protwords.txt
   [junit4]   2> 118488 INFO  (TEST-CollectionsAPIAsyncDistributedZkTest.testSolrJAPICalls-seed#[1A58B13484DE1995]) [    ] o.a.s.c.c.SolrZkClient makePath: /configs/conf1/protwords.txt
   [junit4]   2> 118489 INFO  (TEST-CollectionsAPIAsyncDistributedZkTest.testSolrJAPICalls-seed#[1A58B13484DE1995]) [    ] o.a.s.c.AbstractZkTestCase put /home/jenkins/workspace/Lucene-Solr-trunk-Linux/solr/core/src/test-files/solr/collection1/conf/currency.xml to /configs/conf1/currency.xml
   [junit4]   2> 118489 INFO  (TEST-CollectionsAPIAsyncDistributedZkTest.testSolrJAPICalls-seed#[1A58B13484DE1995]) [    ] o.a.s.c.c.SolrZkClient makePath: /configs/conf1/currency.xml
   [junit4]   2> 118490 INFO  (TEST-CollectionsAPIAsyncDistributedZkTest.testSolrJAPICalls-seed#[1A58B13484DE1995]) [    ] o.a.s.c.AbstractZkTestCase put /home/jenkins/workspace/Lucene-Solr-trunk-Linux/solr/core/src/test-files/solr/collection1/conf/enumsConfig.xml to /configs/conf1/enumsConfig.xml
   [junit4]   2> 118490 INFO  (TEST-CollectionsAPIAsyncDistributedZkTest.testSolrJAPICalls-seed#[1A58B13484DE1995]) [    ] o.a.s.c.c.SolrZkClient makePath: /configs/conf1/enumsConfig.xml
   [junit4]   2> 118491 INFO  (TEST-CollectionsAPIAsyncDistributedZkTest.testSolrJAPICalls-seed#[1A58B13484DE1995]) [    ] o.a.s.c.AbstractZkTestCase put /home/jenkins/workspace/Lucene-Solr-trunk-Linux/solr/core/src/test-files/solr/collection1/conf/open-exchange-rates.json to /configs/conf1/open-exchange-rates.json
   [junit4]   2> 118492 INFO  (TEST-CollectionsAPIAsyncDistributedZkTest.testSolrJAPICalls-seed#[1A58B13484DE1995]) [    ] o.a.s.c.c.SolrZkClient makePath: /configs/conf1/open-exchange-rates.json
   [junit4]   2> 118492 INFO  (TEST-CollectionsAPIAsyncDistributedZkTest.testSolrJAPICalls-seed#[1A58B13484DE1995]) [    ] o.a.s.c.AbstractZkTestCase put /home/jenkins/workspace/Lucene-Solr-trunk-Linux/solr/core/src/test-files/solr/collection1/conf/mapping-ISOLatin1Accent.txt to /configs/conf1/mapping-ISOLatin1Accent.txt
   [junit4]   2> 118493 INFO  (TEST-CollectionsAPIAsyncDistributedZkTest.testSolrJAPICalls-seed#[1A58B13484DE1995]) [    ] o.a.s.c.c.SolrZkClient makePath: /configs/conf1/mapping-ISOLatin1Accent.txt
   [junit4]   2> 118494 INFO  (TEST-CollectionsAPIAsyncDistributedZkTest.testSolrJAPICalls-seed#[1A58B13484DE1995]) [    ] o.a.s.c.AbstractZkTestCase put /home/jenkins/workspace/Lucene-Solr-trunk-Linux/solr/core/src/test-files/solr/collection1/conf/old_synonyms.txt to /configs/conf1/old_synonyms.txt
   [junit4]   2> 118494 INFO  (TEST-CollectionsAPIAsyncDistributedZkTest.testSolrJAPICalls-seed#[1A58B13484DE1995]) [    ] o.a.s.c.c.SolrZkClient makePath: /configs/conf1/old_synonyms.txt
   [junit4]   2> 118495 INFO  (TEST-CollectionsAPIAsyncDistributedZkTest.testSolrJAPICalls-seed#[1A58B13484DE1995]) [    ] o.a.s.c.AbstractZkTestCase put /home/jenkins/workspace/Lucene-Solr-trunk-Linux/solr/core/src/test-files/solr/collection1/conf/synonyms.txt to /configs/conf1/synonyms.txt
   [junit4]   2> 118496 INFO  (TEST-CollectionsAPIAsyncDistributedZkTest.testSolrJAPICalls-seed#[1A58B13484DE1995]) [    ] o.a.s.c.c.SolrZkClient makePath: /configs/conf1/synonyms.txt
   [junit4]   2> 118625 INFO  (TEST-CollectionsAPIAsyncDistributedZkTest.testSolrJAPICalls-seed#[1A58B13484DE1995]) [    ] o.a.s.SolrTestCaseJ4 Writing core.properties file to /home/jenkins/workspace/Lucene-Solr-trunk-Linux/solr/build/solr-core/test/J0/temp/solr.cloud.CollectionsAPIAsyncDistributedZkTest 1A58B13484DE1995-001/control-001/cores/collection1
   [junit4]   2> 118626 INFO  (TEST-CollectionsAPIAsyncDistributedZkTest.testSolrJAPICalls-seed#[1A58B13484DE1995]) [    ] o.e.j.s.Server jetty-9.2.10.v20150310
   [junit4]   2> 118628 INFO  (TEST-CollectionsAPIAsyncDistributedZkTest.testSolrJAPICalls-seed#[1A58B13484DE1995]) [    ] o.e.j.s.h.ContextHandler Started o.e.j.s.ServletContextHandler@99c00c{/,null,AVAILABLE}
   [junit4]   2> 118631 INFO  (TEST-CollectionsAPIAsyncDistributedZkTest.testSolrJAPICalls-seed#[1A58B13484DE1995]) [    ] o.e.j.s.ServerConnector Started ServerConnector@f503bc{HTTP/1.1}{127.0.0.1:41639}
   [junit4]   2> 118632 INFO  (TEST-CollectionsAPIAsyncDistributedZkTest.testSolrJAPICalls-seed#[1A58B13484DE1995]) [    ] o.e.j.s.Server Started @119954ms
   [junit4]   2> 118632 INFO  (TEST-CollectionsAPIAsyncDistributedZkTest.testSolrJAPICalls-seed#[1A58B13484DE1995]) [    ] o.a.s.c.s.e.JettySolrRunner Jetty properties: {solr.data.dir=/home/jenkins/workspace/Lucene-Solr-trunk-Linux/solr/build/solr-core/test/J0/temp/solr.cloud.CollectionsAPIAsyncDistributedZkTest 1A58B13484DE1995-001/tempDir-001/control/data, hostContext=/, hostPort=41639, coreRootDirectory=/home/jenkins/workspace/Lucene-Solr-trunk-Linux/solr/build/solr-core/test/J0/../../../../../../../../../home/jenkins/workspace/Lucene-Solr-trunk-Linux/solr/build/solr-core/test/J0/temp/solr.cloud.CollectionsAPIAsyncDistributedZkTest 1A58B13484DE1995-001/control-001/cores}
   [junit4]   2> 118632 INFO  (TEST-CollectionsAPIAsyncDistributedZkTest.testSolrJAPICalls-seed#[1A58B13484DE1995]) [    ] o.a.s.s.SolrDispatchFilter SolrDispatchFilter.init()sun.misc.Launcher$AppClassLoader@1764bce
   [junit4]   2> 118633 INFO  (TEST-CollectionsAPIAsyncDistributedZkTest.testSolrJAPICalls-seed#[1A58B13484DE1995]) [    ] o.a.s.c.SolrResourceLoader new SolrResourceLoader for directory: '/home/jenkins/workspace/Lucene-Solr-trunk-Linux/solr/build/solr-core/test/J0/../../../../../../../../../home/jenkins/workspace/Lucene-Solr-trunk-Linux/solr/build/solr-core/test/J0/temp/solr.cloud.CollectionsAPIAsyncDistributedZkTest 1A58B13484DE1995-001/control-001/'
   [junit4]   2> 118649 INFO  (TEST-CollectionsAPIAsyncDistributedZkTest.testSolrJAPICalls-seed#[1A58B13484DE1995]) [    ] o.a.s.c.SolrXmlConfig Loading container configuration from /home/jenkins/workspace/Lucene-Solr-trunk-Linux/solr/build/solr-core/test/J0/../../../../../../../../../home/jenkins/workspace/Lucene-Solr-trunk-Linux/solr/build/solr-core/test/J0/temp/solr.cloud.CollectionsAPIAsyncDistributedZkTest 1A58B13484DE1995-001/control-001/solr.xml
   [junit4]   2> 118657 INFO  (TEST-CollectionsAPIAsyncDistributedZkTest.testSolrJAPICalls-seed#[1A58B13484DE1995]) [    ] o.a.s.c.CoresLocator Config-defined core root directory: /home/jenkins/workspace/Lucene-Solr-trunk-Linux/solr/build/solr-core/test/J0/../../../../../../../../../home/jenkins/workspace/Lucene-Solr-trunk-Linux/solr/build/solr-core/test/J0/temp/solr.cloud.CollectionsAPIAsyncDistributedZkTest 1A58B13484DE1995-001/control-001/cores
   [junit4]   2> 118657 INFO  (TEST-CollectionsAPIAsyncDistributedZkTest.testSolrJAPICalls-seed#[1A58B13484DE1995]) [    ] o.a.s.c.CoreContainer New CoreContainer 20976737
   [junit4]   2> 118657 INFO  (TEST-CollectionsAPIAsyncDistributedZkTest.testSolrJAPICalls-seed#[1A58B13484DE1995]) [    ] o.a.s.c.CoreContainer Loading cores into CoreContainer [instanceDir=/home/jenkins/workspace/Lucene-Solr-trunk-Linux/solr/build/solr-core/test/J0/../../../../../../../../../home/jenkins/workspace/Lucene-Solr-trunk-Linux/solr/build/solr-core/test/J0/temp/solr.cloud.CollectionsAPIAsyncDistributedZkTest 1A58B13484DE1995-001/control-001/]
   [junit4]   2> 118657 INFO  (TEST-CollectionsAPIAsyncDistributedZkTest.testSolrJAPICalls-seed#[1A58B13484DE1995]) [    ] o.a.s.c.CoreContainer loading shared library: /home/jenkins/workspace/Lucene-Solr-trunk-Linux/solr/build/solr-core/test/J0/../../../../../../../../../home/jenkins/workspace/Lucene-Solr-trunk-Linux/solr/build/solr-core/test/J0/temp/solr.cloud.CollectionsAPIAsyncDistributedZkTest 1A58B13484DE1995-001/control-001/lib
   [junit4]   2> 118658 WARN  (TEST-CollectionsAPIAsyncDistributedZkTest.testSolrJAPICalls-seed#[1A58B13484DE1995]) [    ] o.a.s.c.SolrResourceLoader Can't find (or read) directory to add to classloader: lib (resolved as: /home/jenkins/workspace/Lucene-Solr-trunk-Linux/solr/build/solr-core/test/J0/../../../../../../../../../home/jenkins/workspace/Lucene-Solr-trunk-Linux/solr/build/solr-core/test/J0/temp/solr.cloud.CollectionsAPIAsyncDistributedZkTest 1A58B13484DE1995-001/control-001/lib).
   [junit4]   2> 118666 INFO  (TEST-CollectionsAPIAsyncDistributedZkTest.testSolrJAPICalls-seed#[1A58B13484DE1995]) [    ] o.a.s.h.c.HttpShardHandlerFactory created with socketTimeout : 90000,urlScheme : ,connTimeout : 15000,maxConnectionsPerHost : 20,maxConnections : 10000,corePoolSize : 0,maximumPoolSize : 2147483647,maxThreadIdleTime : 5,sizeOfQueue : -1,fairnessPolicy : false,useRetries : false,
   [junit4]   2> 118667 INFO  (TEST-CollectionsAPIAsyncDistributedZkTest.testSolrJAPICalls-seed#[1A58B13484DE1995]) [    ] o.a.s.u.UpdateShardHandler Creating UpdateShardHandler HTTP client with params: socketTimeout=340000&connTimeout=45000&retry=true
   [junit4]   2> 118668 INFO  (TEST-CollectionsAPIAsyncDistributedZkTest.testSolrJAPICalls-seed#[1A58B13484DE1995]) [    ] o.a.s.l.LogWatcher SLF4J impl is org.slf4j.impl.Log4jLoggerFactory
   [junit4]   2> 118668 INFO  (TEST-CollectionsAPIAsyncDistributedZkTest.testSolrJAPICalls-seed#[1A58B13484DE1995]) [    ] o.a.s.l.LogWatcher Registering Log Listener [Log4j (org.slf4j.impl.Log4jLoggerFactory)]
   [junit4]   2> 118669 INFO  (TEST-CollectionsAPIAsyncDistributedZkTest.testSolrJAPICalls-seed#[1A58B13484DE1995]) [    ] o.a.s.c.ZkContainer Zookeeper client=127.0.0.1:33820/solr
   [junit4]   2> 118669 INFO  (TEST-CollectionsAPIAsyncDistributedZkTest.testSolrJAPICalls-seed#[1A58B13484DE1995]) [    ] o.a.s.c.ZkController zkHost includes chroot
   [junit4]   2> 118669 INFO  (TEST-CollectionsAPIAsyncDistributedZkTest.testSolrJAPICalls-seed#[1A58B13484DE1995]) [    ] o.a.s.c.c.SolrZkClient Using default ZkCredentialsProvider
   [junit4]   2> 118670 INFO  (TEST-CollectionsAPIAsyncDistributedZkTest.testSolrJAPICalls-seed#[1A58B13484DE1995]) [    ] o.a.s.c.c.ConnectionManager Waiting for client to connect to ZooKeeper
   [junit4]   2> 118671 INFO  (zkCallback-561-thread-1) [    ] o.a.s.c.c.ConnectionManager Watcher org.apache.solr.common.cloud.ConnectionManager@175dccb name:ZooKeeperConnection Watcher:127.0.0.1:33820 got event WatchedEvent state:SyncConnected type:None path:null path:null type:None
   [junit4]   2> 118671 INFO  (TEST-CollectionsAPIAsyncDistributedZkTest.testSolrJAPICalls-seed#[1A58B13484DE1995]) [    ] o.a.s.c.c.ConnectionManager Client is connected to ZooKeeper
   [junit4]   2> 118672 INFO  (TEST-CollectionsAPIAsyncDistributedZkTest.testSolrJAPICalls-seed#[1A58B13484DE1995]) [    ] o.a.s.c.c.SolrZkClient Using default ZkACLProvider
   [junit4]   2> 118673 INFO  (TEST-CollectionsAPIAsyncDistributedZkTest.testSolrJAPICalls-seed#[1A58B13484DE1995]) [n:127.0.0.1:41639_    ] o.a.s.c.c.ConnectionManager Waiting for client to connect to ZooKeeper
   [junit4]   2> 118674 INFO  (zkCallback-562-thread-1-processing-n:127.0.0.1:41639_) [n:127.0.0.1:41639_    ] o.a.s.c.c.ConnectionManager Watcher org.apache.solr.common.cloud.ConnectionManager@64c6e5 name:ZooKeeperConnection Watcher:127.0.0.1:33820/solr got event WatchedEvent state:SyncConnected type:None path:null path:null type:None
   [junit4]   2> 118674 INFO  (TEST-CollectionsAPIAsyncDistributedZkTest.testSolrJAPICalls-seed#[1A58B13484DE1995]) [n:127.0.0.1:41639_    ] o.a.s.c.c.ConnectionManager Client is connected to ZooKeeper
   [junit4]   2> 118675 INFO  (TEST-CollectionsAPIAsyncDistributedZkTest.testSolrJAPICalls-seed#[1A58B13484DE1995]) [n:127.0.0.1:41639_    ] o.a.s.c.c.SolrZkClient makePath: /overseer/queue
   [junit4]   2> 118676 INFO  (TEST-CollectionsAPIAsyncDistributedZkTest.testSolrJAPICalls-seed#[1A58B13484DE1995]) [n:127.0.0.1:41639_    ] o.a.s.c.c.SolrZkClient makePath: /overseer/collection-queue-work
   [junit4]   2> 118677 INFO  (TEST-CollectionsAPIAsyncDistributedZkTest.testSolrJAPICalls-seed#[1A58B13484DE1995]) [n:127.0.0.1:41639_    ] o.a.s.c.c.SolrZkClient makePath: /overseer/collection-map-running
   [junit4]   2> 118679 INFO  (TEST-CollectionsAPIAsyncDistributedZkTest.testSolrJAPICalls-seed#[1A58B13484DE1995]) [n:127.0.0.1:41639_    ] o.a.s.c.c.SolrZkClient makePath: /overseer/collection-map-completed
   [junit4]   2> 118680 INFO  (TEST-CollectionsAPIAsyncDistributedZkTest.testSolrJAPICalls-seed#[1A58B13484DE1995]) [n:127.0.0.1:41639_    ] o.a.s.c.c.SolrZkClient makePath: /overseer/collection-map-failure
   [junit4]   2> 118680 INFO  (TEST-CollectionsAPIAsyncDistributedZkTest.testSolrJAPICalls-seed#[1A58B13484DE1995]) [n:127.0.0.1:41639_    ] o.a.s.c.c.SolrZkClient makePath: /live_nodes
   [junit4]   2> 118681 INFO  (TEST-CollectionsAPIAsyncDistributedZkTest.testSolrJAPICalls-seed#[1A58B13484DE1995]) [n:127.0.0.1:41639_    ] o.a.s.c.c.SolrZkClient makePath: /aliases.json
   [junit4]   2> 118682 INFO  (TEST-CollectionsAPIAsyncDistributedZkTest.testSolrJAPICalls-seed#[1A58B13484DE1995]) [n:127.0.0.1:41639_    ] o.a.s.c.c.SolrZkClient makePath: /clusterstate.json
   [junit4]   2> 118682 INFO  (TEST-CollectionsAPIAsyncDistributedZkTest.testSolrJAPICalls-seed#[1A58B13484DE1995]) [n:127.0.0.1:41639_    ] o.a.s.c.ZkController Register node as live in ZooKeeper:/live_nodes/127.0.0.1:41639_
   [junit4]   2> 118683 INFO  (TEST-CollectionsAPIAsyncDistributedZkTest.testSolrJAPICalls-seed#[1A58B13484DE1995]) [n:127.0.0.1:41639_    ] o.a.s.c.c.SolrZkClient makePath: /live_nodes/127.0.0.1:41639_
   [junit4]   2> 118684 INFO  (TEST-CollectionsAPIAsyncDistributedZkTest.testSolrJAPICalls-seed#[1A58B13484DE1995]) [n:127.0.0.1:41639_    ] o.a.s.c.c.SolrZkClient makePath: /overseer_elect
   [junit4]   2> 118685 INFO  (TEST-CollectionsAPIAsyncDistributedZkTest.testSolrJAPICalls-seed#[1A58B13484DE1995]) [n:127.0.0.1:41639_    ] o.a.s.c.c.SolrZkClient makePath: /overseer_elect/election
   [junit4]   2> 118685 INFO  (TEST-CollectionsAPIAsyncDistributedZkTest.testSolrJAPICalls-seed#[1A58B13484DE1995]) [n:127.0.0.1:41639_    ] o.a.s.c.Overseer Overseer (id=null) closing
   [junit4]   2> 118686 INFO  (TEST-CollectionsAPIAsyncDistributedZkTest.testSolrJAPICalls-seed#[1A58B13484DE1995]) [n:127.0.0.1:41639_    ] o.a.s.c.OverseerElectionContext I am going to be the leader 127.0.0.1:41639_
   [junit4]   2> 118686 INFO  (TEST-CollectionsAPIAsyncDistributedZkTest.testSolrJAPICalls-seed#[1A58B13484DE1995]) [n:127.0.0.1:41639_    ] o.a.s.c.c.SolrZkClient makePath: /overseer_elect/leader
   [junit4]   2> 118687 INFO  (TEST-CollectionsAPIAsyncDistributedZkTest.testSolrJAPICalls-seed#[1A58B13484DE1995]) [n:127.0.0.1:41639_    ] o.a.s.c.Overseer Overseer (id=93955431157727235-127.0.0.1:41639_-n_0000000000) starting
   [junit4]   2> 118688 INFO  (TEST-CollectionsAPIAsyncDistributedZkTest.testSolrJAPICalls-seed#[1A58B13484DE1995]) [n:127.0.0.1:41639_    ] o.a.s.c.c.SolrZkClient makePath: /overseer/queue-work
   [junit4]   2> 118691 INFO  (TEST-CollectionsAPIAsyncDistributedZkTest.testSolrJAPICalls-seed#[1A58B13484DE1995]) [n:127.0.0.1:41639_    ] o.a.s.c.OverseerAutoReplicaFailoverThread Starting OverseerAutoReplicaFailoverThread autoReplicaFailoverWorkLoopDelay=10000 autoReplicaFailoverWaitAfterExpiration=30000 autoReplicaFailoverBadNodeExpiration=60000
   [junit4]   2> 118692 INFO  (OverseerCollectionProcessor-93955431157727235-127.0.0.1:41639_-n_0000000000) [n:127.0.0.1:41639_    ] o.a.s.c.OverseerCollectionProcessor Process current queue of collection creations
   [junit4]   2> 118692 INFO  (TEST-CollectionsAPIAsyncDistributedZkTest.testSolrJAPICalls-seed#[1A58B13484DE1995]) [n:127.0.0.1:41639_    ] o.a.s.c.c.ZkStateReader Updating cluster state from ZooKeeper... 
   [junit4]   2> 118692 INFO  (OverseerStateUpdate-93955431157727235-127.0.0.1:41639_-n_0000000000) [n:127.0.0.1:41639_    ] o.a.s.c.Overseer Starting to work on the main queue
   [junit4]   2> 118694 INFO  (TEST-CollectionsAPIAsyncDistributedZkTest.testSolrJAPICalls-seed#[1A58B13484DE1995]) [n:127.0.0.1:41639_    ] o.a.s.c.CoreContainer No authentication plugin used.
   [junit4]   2> 118694 INFO  (TEST-CollectionsAPIAsyncDistributedZkTest.testSolrJAPICalls-seed#[1A58B13484DE1995]) [n:127.0.0.1:41639_    ] o.a.s.c.CoreContainer Security conf doesn't exist. Skipping setup for authorization module.
   [junit4]   2> 118695 INFO  (TEST-CollectionsAPIAsyncDistributedZkTest.testSolrJAPICalls-seed#[1A58B13484DE1995]) [n:127.0.0.1:41639_    ] o.a.s.c.CoresLocator Looking for core definitions underneath /home/jenkins/workspace/Lucene-Solr-trunk-Linux/solr/build/solr-core/test/J0/../../../../../../../../../home/jenkins/workspace/Lucene-Solr-trunk-Linux/solr/build/solr-core/test/J0/temp/solr.cloud.CollectionsAPIAsyncDistributedZkTest 1A58B13484DE1995-001/control-001/cores
   [junit4]   2> 118696 INFO  (TEST-CollectionsAPIAsyncDistributedZkTest.testSolrJAPICalls-seed#[1A58B13484DE1995]) [n:127.0.0.1:41639_    ] o.a.s.c.SolrCore Created CoreDescriptor: {name=collection1, config=solrconfig.xml, transient=false, schema=schema.xml, loadOnStartup=true, instanceDir=/home/jenkins/workspace/Lucene-Solr-trunk-Linux/solr/build/solr-core/test/J0/../../../../../../../../../home/jenkins/workspace/Lucene-Solr-trunk-Linux/solr/build/solr-core/test/J0/temp/solr.cloud.CollectionsAPIAsyncDistributedZkTest 1A58B13484DE1995-001/control-001/cores/collection1, collection=control_collection, absoluteInstDir=/home/jenkins/workspace/Lucene-Solr-trunk-Linux/solr/build/solr-core/test/J0/../../../../../../../../../home/jenkins/workspace/Lucene-Solr-trunk-Linux/solr/build/solr-core/test/J0/temp/solr.cloud.CollectionsAPIAsyncDistributedZkTest 1A58B13484DE1995-001/control-001/cores/collection1/, coreNodeName=, dataDir=data/, shard=}
   [junit4]   2> 118696 INFO  (TEST-CollectionsAPIAsyncDistributedZkTest.testSolrJAPICalls-seed#[1A58B13484DE1995]) [n:127.0.0.1:41639_    ] o.a.s.c.CoresLocator Found core collection1 in /home/jenkins/workspace/Lucene-Solr-trunk-Linux/solr/build/solr-core/test/J0/../../../../../../../../../home/jenkins/workspace/Lucene-Solr-trunk-Linux/solr/build/solr-core/test/J0/temp/solr.cloud.CollectionsAPIAsyncDistributedZkTest 1A58B13484DE1995-001/control-001/cores/collection1/
   [junit4]   2> 118696 INFO  (TEST-CollectionsAPIAsyncDistributedZkTest.testSolrJAPICalls-seed#[1A58B13484DE1995]) [n:127.0.0.1:41639_    ] o.a.s.c.CoresLocator Found 1 core definitions
   [junit4]   2> 118697 INFO  (coreLoadExecutor-857-thread-1-processing-n:127.0.0.1:41639_) [n:127.0.0.1:41639_ c:control_collection   x:collection1] o.a.s.c.ZkController publishing state=down
   [junit4]   2> 118697 INFO  (coreLoadExecutor-857-thread-1-processing-n:127.0.0.1:41639_) [n:127.0.0.1:41639_ c:control_collection   x:collection1] o.a.s.c.ZkController numShards not found on descriptor - reading it from system property
   [junit4]   2> 118697 INFO  (TEST-CollectionsAPIAsyncDistributedZkTest.testSolrJAPICalls-seed#[1A58B13484DE1995]) [n:127.0.0.1:41639_    ] o.a.s.s.SolrDispatchFilter user.dir=/home/jenkins/workspace/Lucene-Solr-trunk-Linux/solr/build/solr-core/test/J0
   [junit4]   2> 118697 INFO  (TEST-CollectionsAPIAsyncDistributedZkTest.testSolrJAPICalls-seed#[1A58B13484DE1995]) [n:127.0.0.1:41639_    ] o.a.s.s.SolrDispatchFilter SolrDispatchFilter.init() done
   [junit4]   2> 118698 INFO  (zkCallback-562-thread-1-processing-n:127.0.0.1:41639_) [n:127.0.0.1:41639_    ] o.a.s.c.DistributedQueue NodeChildrenChanged fired on path /overseer/queue state SyncConnected
   [junit4]   2> 118698 INFO  (coreLoadExecutor-857-thread-1-processing-n:127.0.0.1:41639_) [n:127.0.0.1:41639_ c:control_collection   x:collection1] o.a.s.c.ZkController look for our core node name
   [junit4]   2> 118698 INFO  (OverseerStateUpdate-93955431157727235-127.0.0.1:41639_-n_0000000000) [n:127.0.0.1:41639_    ] o.a.s.c.Overseer processMessage: queueSize: 1, message = {
   [junit4]   2>   "core":"collection1",
   [junit4]   2>   "roles":null,
   [junit4]   2>   "base_url":"http://127.0.0.1:41639",
   [junit4]   2>   "node_name":"127.0.0.1:41639_",
   [junit4]   2>   "numShards":"1",
   [junit4]   2>   "state":"down",
   [junit4]   2>   "shard":null,
   [junit4]   2>   "collection":"control_collection",
   [junit4]   2>   "operation":"state"} current state version: 0
   [junit4]   2> 118699 INFO  (OverseerStateUpdate-93955431157727235-127.0.0.1:41639_-n_0000000000) [n:127.0.0.1:41639_    ] o.a.s.c.o.ReplicaMutator Update state numShards=1 message={
   [junit4]   2>   "core":"collection1",
   [junit4]   2>   "roles":null,
   [junit4]   2>   "base_url":"http://127.0.0.1:41639",
   [junit4]   2>   "node_name":"127.0.0.1:41639_",
   [junit4]   2>   "numShards":"1",
   [junit4]   2>   "state":"down",
   [junit4]   2>   "shard":null,
   [junit4]   2>   "collection":"control_collection",
   [junit4]   2>   "operation":"state"}
   [junit4]   2> 118699 INFO  (OverseerStateUpdate-93955431157727235-127.0.0.1:41639_-n_0000000000) [n:127.0.0.1:41639_    ] o.a.s.c.o.ClusterStateMutator building a new cName: control_collection
   [junit4]   2> 118699 INFO  (OverseerStateUpdate-93955431157727235-127.0.0.1:41639_-n_0000000000) [n:127.0.0.1:41639_    ] o.a.s.c.o.ReplicaMutator Assigning new node to shard shard=shard1
   [junit4]   2> 118700 INFO  (zkCallback-562-thread-1-processing-n:127.0.0.1:41639_) [n:127.0.0.1:41639_    ] o.a.s.c.c.ZkStateReader A cluster state change: WatchedEvent state:SyncConnected type:NodeDataChanged path:/clusterstate.json, has occurred - updating... (live nodes size: 1)
   [junit4]   2> 118701 INFO  (zkCallback-562-thread-1-processing-n:127.0.0.1:41639_) [n:127.0.0.1:41639_    ] o.a.s.c.c.ZkStateReader Updated cluster state version to 1
   [junit4]   2> 119698 INFO  (coreLoadExecutor-857-thread-1-processing-n:127.0.0.1:41639_) [n:127.0.0.1:41639_ c:control_collection   x:collection1] o.a.s.c.ZkController waiting to find shard id in clusterstate for collection1
   [junit4]   2> 119698 INFO  (coreLoadExecutor-857-thread-1-processing-n:127.0.0.1:41639_) [n:127.0.0.1:41639_ c:control_collection   x:collection1] o.a.s.c.ZkController Check for collection zkNode:control_collection
   [junit4]   2> 119699 INFO  (coreLoadExecutor-857-thread-1-processing-n:127.0.0.1:41639_) [n:127.0.0.1:41639_ c:control_collection   x:collection1] o.a.s.c.ZkController Collection zkNode exists
   [junit4]   2> 119699 INFO  (coreLoadExecutor-857-thread-1-processing-n:127.0.0.1:41639_) [n:127.0.0.1:41639_ c:control_collection   x:collection1] o.a.s.c.c.ZkStateReader Load collection config from:/collections/control_collection
   [junit4]   2> 119699 INFO  (coreLoadExecutor-857-thread-1-processing-n:127.0.0.1:41639_) [n:127.0.0.1:41639_ c:control_collection   x:collection1] o.a.s.c.c.ZkStateReader path=/collections/control_collection configName=conf1 specified config exists in ZooKeeper
   [junit4]   2> 119700 INFO  (coreLoadExecutor-857-thread-1-processing-n:127.0.0.1:41639_) [n:127.0.0.1:41639_ c:control_collection   x:collection1] o.a.s.c.SolrResourceLoader new SolrResourceLoader for directory: '/home/jenkins/workspace/Lucene-Solr-trunk-Linux/solr/build/solr-core/test/J0/../../../../../../../../../home/jenkins/workspace/Lucene-Solr-trunk-Linux/solr/build/solr-core/test/J0/temp/solr.cloud.CollectionsAPIAsyncDistributedZkTest 1A58B13484DE1995-001/control-001/cores/collection1/'
   [junit4]   2> 119712 INFO  (coreLoadExecutor-857-thread-1-processing-n:127.0.0.1:41639_) [n:127.0.0.1:41639_ c:control_collection   x:collection1] o.a.s.c.Config loaded config solrconfig.xml with version 0 
   [junit4]   2> 119716 INFO  (coreLoadExecutor-857-thread-1-processing-n:127.0.0.1:41639_) [n:127.0.0.1:41639_ c:control_collection   x:collection1] o.a.s.c.SolrConfig current version of requestparams : -1
   [junit4]   2> 119719 INFO  (coreLoadExecutor-857-thread-1-processing-n:127.0.0.1:41639_) [n:127.0.0.1:41639_ c:control_collection   x:collection1] o.a.s.c.SolrConfig Using Lucene MatchVersion: 6.0.0
   [junit4]   2> 119726 INFO  (coreLoadExecutor-857-thread-1-processing-n:127.0.0.1:41639_) [n:127.0.0.1:41639_ c:control_collection   x:collection1] o.a.s.c.Config Loaded SolrConfig: solrconfig.xml
   [junit4]   2> 119727 INFO  (coreLoadExecutor-857-thread-1-processing-n:127.0.0.1:41639_) [n:127.0.0.1:41639_ c:control_collection   x:collection1] o.a.s.s.IndexSchema Reading Solr Schema from /configs/conf1/schema.xml
   [junit4]   2> 119734 INFO  (coreLoadExecutor-857-thread-1-processing-n:127.0.0.1:41639_) [n:127.0.0.1:41639_ c:control_collection   x:collection1] o.a.s.s.IndexSchema [collection1] Schema name=test
   [junit4]   2> 119809 INFO  (coreLoadExecutor-857-thread-1-processing-n:127.0.0.1:41639_) [n:127.0.0.1:41639_ c:control_collection   x:collection1] o.a.s.s.OpenExchangeRatesOrgProvider Initialized with rates=open-exchange-rates.json, refreshInterval=1440.
   [junit4]   2> 119814 INFO  (coreLoadExecutor-857-thread-1-processing-n:127.0.0.1:41639_) [n:127.0.0.1:41639_ c:control_collection   x:collection1] o.a.s.s.IndexSchema default search field in schema is text
   [junit4]   2> 119815 INFO  (coreLoadExecutor-857-thread-1-processing-n:127.0.0.1:41639_) [n:127.0.0.1:41639_ c:control_collection   x:collection1] o.a.s.s.IndexSchema unique key field: id
   [junit4]   2> 119820 INFO  (coreLoadExecutor-857-thread-1-processing-n:127.0.0.1:41639_) [n:127.0.0.1:41639_ c:control_collection   x:collection1] o.a.s.s.FileExchangeRateProvider Reloading exchange rates from file currency.xml
   [junit4]   2> 119822 INFO  (coreLoadExecutor-857-thread-1-processing-n:127.0.0.1:41639_) [n:127.0.0.1:41639_ c:control_collection   x:collection1] o.a.s.s.FileExchangeRateProvider Reloading exchange rates from file currency.xml
   [junit4]   2> 119823 INFO  (coreLoadExecutor-857-thread-1-processing-n:127.0.0.1:41639_) [n:127.0.0.1:41639_ c:control_collection   x:collection1] o.a.s.s.OpenExchangeRatesOrgProvider Reloading exchange rates from open-exchange-rates.json
   [junit4]   2> 119823 WARN  (coreLoadExecutor-857-thread-1-processing-n:127.0.0.1:41639_) [n:127.0.0.1:41639_ c:control_collection   x:collection1] o.a.s.s.OpenExchangeRatesOrgProvider Unknown key IMPORTANT NOTE
   [junit4]   2> 119824 WARN  (coreLoadExecutor-857-thread-1-processing-n:127.0.0.1:41639_) [n:127.0.0.1:41639_ c:control_collection   x:collection1] o.a.s.s.OpenExchangeRatesOrgProvider Expected key, got STRING
   [junit4]   2> 119824 INFO  (coreLoadExecutor-857-thread-1-processing-n:127.0.0.1:41639_) [n:127.0.0.1:41639_ c:control_collection   x:collection1] o.a.s.s.OpenExchangeRatesOrgProvider Reloading exchange rates from open-exchange-rates.json
   [junit4]   2> 119824 WARN  (coreLoadExecutor-857-thread-1-processing-n:127.0.0.1:41639_) [n:127.0.0.1:41639_ c:control_collection   x:collection1] o.a.s.s.OpenExchangeRatesOrgProvider Unknown key IMPORTANT NOTE
   [junit4]   2> 119824 WARN  (coreLoadExecutor-857-thread-1-processing-n:127.0.0.1:41639_) [n:127.0.0.1:41639_ c:control_collection   x:collection1] o.a.s.s.OpenExchangeRatesOrgProvider Expected key, got STRING
   [junit4]   2> 119824 INFO  (coreLoadExecutor-857-thread-1-processing-n:127.0.0.1:41639_) [n:127.0.0.1:41639_ c:control_collection   x:collection1] o.a.s.c.CoreContainer Creating SolrCore 'collection1' using configuration from collection control_collection
   [junit4]   2> 119824 INFO  (coreLoadExecutor-857-thread-1-processing-n:127.0.0.1:41639_) [n:127.0.0.1:41639_ c:control_collection s:shard1 r:core_node1 x:collection1] o.a.s.c.SolrCore org.apache.solr.core.MockDirectoryFactory
   [junit4]   2> 119825 INFO  (coreLoadExecutor-857-thread-1-processing-n:127.0.0.1:41639_) [n:127.0.0.1:41639_ c:control_collection s:shard1 r:core_node1 x:collection1] o.a.s.c.SolrCore [[collection1] ] Opening new SolrCore at [/home/jenkins/workspace/Lucene-Solr-trunk-Linux/solr/build/solr-core/test/J0/../../../../../../../../../home/jenkins/workspace/Lucene-Solr-trunk-Linux/solr/build/solr-core/test/J0/temp/solr.cloud.CollectionsAPIAsyncDistributedZkTest 1A58B13484DE1995-001/control-001/cores/collection1/], dataDir=[null]
   [junit4]   2> 119825 INFO  (coreLoadExecutor-857-thread-1-processing-n:127.0.0.1:41639_) [n:127.0.0.1:41639_ c:control_collection s:shard1 r:core_node1 x:collection1] o.a.s.c.JmxMonitoredMap JMX monitoring is enabled. Adding Solr mbeans to JMX Server: com.sun.jmx.mbeanserver.JmxMBeanServer@18a2347
   [junit4]   2> 119825 INFO  (coreLoadExecutor-857-thread-1-processing-n:127.0.0.1:41639_) [n:127.0.0.1:41639_ c:control_collection s:shard1 r:core_node1 x:collection1] o.a.s.c.CachingDirectoryFactory return new directory for /home/jenkins/workspace/Lucene-Solr-trunk-Linux/solr/build/solr-core/test/J0/../../../../../../../../../home/jenkins/workspace/Lucene-Solr-trunk-Linux/solr/build/solr-core/test/J0/temp/solr.cloud.CollectionsAPIAsyncDistributedZkTest 1A58B13484DE1995-001/control-001/cores/collection1/data
   [junit4]   2> 119826 INFO  (coreLoadExecutor-857-thread-1-processing-n:127.0.0.1:41639_) [n:127.0.0.1:41639_ c:control_collection s:shard1 r:core_node1 x:collection1] o.a.s.c.SolrCore New index directory detected: old=null new=/home/jenkins/workspace/Lucene-Solr-trunk-Linux/solr/build/solr-core/test/J0/../../../../../../../../../home/jenkins/workspace/Lucene-Solr-trunk-Linux/solr/build/solr-core/test/J0/temp/solr.cloud.CollectionsAPIAsyncDistributedZkTest 1A58B13484DE1995-001/control-001/cores/collection1/data/index/
   [junit4]   2> 119826 WARN  (coreLoadExecutor-857-thread-1-processing-n:127.0.0.1:41639_) [n:127.0.0.1:41639_ c:control_collection s:shard1 r:core_node1 x:collection1] o.a.s.c.SolrCore [collection1] Solr index directory '/home/jenkins/workspace/Lucene-Solr-trunk-Linux/solr/build/solr-core/test/J0/../../../../../../../../../home/jenkins/workspace/Lucene-Solr-trunk-Linux/solr/build/solr-core/test/J0/temp/solr.cloud.CollectionsAPIAsyncDistributedZkTest 1A58B13484DE1995-001/control-001/cores/collection1/data/index' doesn't exist. Creating new index...
   [junit4]   2> 119826 INFO  (coreLoadExecutor-857-thread-1-processing-n:127.0.0.1:41639_) [n:127.0.0.1:41639_ c:control_collection s:shard1 r:core_node1 x:collection1] o.a.s.c.CachingDirectoryFactory return new directory for /home/jenkins/workspace/Lucene-Solr-trunk-Linux/solr/build/solr-core/test/J0/../../../../../../../../../home/jenkins/workspace/Lucene-Solr-trunk-Linux/solr/build/solr-core/test/J0/temp/solr.cloud.CollectionsAPIAsyncDistributedZkTest 1A58B13484DE1995-001/control-001/cores/collection1/data/index
   [junit4]   2> 119826 INFO  (coreLoadExecutor-857-thread-1-processing-n:127.0.0.1:41639_) [n:127.0.0.1:41639_ c:control_collection s:shard1 r:core_node1 x:collection1] o.a.s.u.RandomMergePolicy RandomMergePolicy wrapping class org.apache.lucene.index.LogDocMergePolicy: [LogDocMergePolicy: minMergeSize=1000, mergeFactor=26, maxMergeSize=9223372036854775807, maxMergeSizeForForcedMerge=9223372036854775807, calibrateSizeByDeletes=false, maxMergeDocs=2147483647, maxCFSSegmentSizeMB=8.796093022207999E12, noCFSRatio=1.0]
   [junit4]   2> 119827 INFO  (coreLoadExecutor-857-thread-1-processing-n:127.0.0.1:41639_) [n:127.0.0.1:41639_ c:control_collection s:shard1 r:core_node1 x:collection1] o.a.s.c.SolrCore SolrDeletionPolicy.onCommit: commits: num=1
   [junit4]   2> 	commit{dir=MockDirectoryWrapper(RAMDirectory@1a2d58c lockFactory=org.apache.lucene.store.SingleInstanceLockFactory@1001d65),segFN=segments_1,generation=1}
   [junit4]   2> 119827 INFO  (coreLoadExecutor-857-thread-1-processing-n:127.0.0.1:41639_) [n:127.0.0.1:41639_ c:control_collection s:shard1 r:core_node1 x:collection1] o.a.s.c.SolrCore newest commit generation = 1
   [junit4]   2> 119827 INFO  (OldIndexDirectoryCleanupThreadForCore-collection1) [n:127.0.0.1:41639_ c:control_collection s:shard1 r:core_node1 x:collection1] o.a.s.c.SolrCore Looking for old index directories to cleanup for core collection1 in /home/jenkins/workspace/Lucene-Solr-trunk-Linux/solr/build/solr-core/test/J0/../../../../../../../../../home/jenkins/workspace/Lucene-Solr-trunk-Linux/solr/build/solr-core/test/J0/temp/solr.cloud.CollectionsAPIAsyncDistributedZkTest 1A58B13484DE1995-001/control-001/cores/collection1/data/
   [junit4]   2> 119828 WARN  (OldIndexDirectoryCleanupThreadForCore-collection1) [n:127.0.0.1:41639_ c:control_collection s:shard1 r:core_node1 x:collection1] o.a.s.c.DirectoryFactory /home/jenkins/workspace/Lucene-Solr-trunk-Linux/solr/build/solr-core/test/J0/../../../../../../../../../home/jenkins/workspace/Lucene-Solr-trunk-Linux/solr/build/solr-core/test/J0/temp/solr.cloud.CollectionsAPIAsyncDistributedZkTest 1A58B13484DE1995-001/control-001/cores/collection1/data/ does not point to a valid data directory; skipping clean-up of old index directories.
   [junit4]   2> 119830 INFO  (coreLoadExecutor-857-thread-1-processing-n:127.0.0.1:41639_) [n:127.0.0.1:41639_ c:control_collection s:shard1 r:core_node1 x:collection1] o.a.s.u.p.UpdateRequestProcessorChain creating updateRequestProcessorChain "nodistrib"
   [junit4]   2> 119830 INFO  (coreLoadExecutor-857-thread-1-processing-n:127.0.0.1:41639_) [n:127.0.0.1:41639_ c:control_collection s:shard1 r:core_node1 x:collection1] o.a.s.u.p.UpdateRequestProcessorChain creating updateRequestProcessorChain "dedupe"
   [junit4]   2> 119831 INFO  (coreLoadExecutor-857-thread-1-processing-n:127.0.0.1:41639_) [n:127.0.0.1:41639_ c:control_collection s:shard1 r:core_node1 x:collection1] o.a.s.u.p.UpdateRequestProcessorChain inserting DistributedUpdateProcessorFactory into updateRequestProcessorChain "dedupe"
   [junit4]   2> 119831 INFO  (coreLoadExecutor-857-thread-1-processing-n:127.0.0.1:41639_) [n:127.0.0.1:41639_ c:control_collection s:shard1 r:core_node1 x:collection1] o.a.s.u.p.UpdateRequestProcessorChain creating updateRequestProcessorChain "stored_sig"
   [junit4]   2> 119831 INFO  (coreLoadExecutor-857-thread-1-processing-n:127.0.0.1:41639_) [n:127.0.0.1:41639_ c:control_collection s:shard1 r:core_node1 x:collection1] o.a.s.u.p.UpdateRequestProcessorChain inserting DistributedUpdateProcessorFactory into updateRequestProcessorChain "stored_sig"
   [junit4]   2> 119831 INFO  (coreLoadExecutor-857-thread-1-processing-n:127.0.0.1:41639_) [n:127.0.0.1:41639_ c:control_collection s:shard1 r:core_node1 x:collection1] o.a.s.u.p.UpdateRequestProcessorChain creating updateRequestProcessorChain "distrib-dup-test-chain-explicit"
   [junit4]   2> 119831 INFO  (coreLoadExecutor-857-thread-1-processing-n:127.0.0.1:41639_) [n:127.0.0.1:41639_ c:control_collection s:shard1 r:core_node1 x:collection1] o.a.s.u.p.UpdateRequestProcessorChain creating updateRequestProcessorChain "distrib-dup-test-chain-implicit"
   [junit4]   2> 119831 INFO  (coreLoadExecutor-857-thread-1-processing-n:127.0.0.1:41639_) [n:127.0.0.1:41639_ c:control_collection s:shard1 r:core_node1 x:collection1] o.a.s.u.p.UpdateRequestProcessorChain inserting DistributedUpdateProcessorFactory into updateRequestProcessorChain "distrib-dup-test-chain-implicit"
   [junit4]   2> 119831 INFO  (coreLoadExecutor-857-thread-1-processing-n:127.0.0.1:41639_) [n:127.0.0.1:41639_ c:control_collection s:shard1 r:core_node1 x:collection1] o.a.s.c.SolrCore no updateRequestProcessorChain defined as default, creating implicit default
   [junit4]   2> 119833 INFO  (coreLoadExecutor-857-thread-1-processing-n:127.0.0.1:41639_) [n:127.0.0.1:41639_ c:control_collection s:shard1 r:core_node1 x:collection1] o.a.s.h.l.XMLLoader xsltCacheLifetimeSeconds=60
   [junit4]   2> 119833 INFO  (coreLoadExecutor-857-thread-1-processing-n:127.0.0.1:41639_) [n:127.0.0.1:41639_ c:control_collection s:shard1 r:core_node1 x:collection1] o.a.s.h.l.XMLLoader xsltCacheLifetimeSeconds=60
   [junit4]   2> 119834 INFO  (coreLoadExecutor-857-thread-1-processing-n:127.0.0.1:41639_) [n:127.0.0.1:41639_ c:control_collection s:shard1 r:core_node1 x:collection1] o.a.s.h.l.XMLLoader xsltCacheLifetimeSeconds=60
   [junit4]   2> 119835 INFO  (coreLoadExecutor-857-thread-1-processing-n:127.0.0.1:41639_) [n:127.0.0.1:41639_ c:control_collection s:shard1 r:core_node1 x:collection1] o.a.s.h.l.XMLLoader xsltCacheLifetimeSeconds=60
   [junit4]   2> 119839 INFO  (coreLoadExecutor-857-thread-1-processing-n:127.0.0.1:41639_) [n:127.0.0.1:41639_ c:control_collection s:shard1 r:core_node1 x:collection1] o.a.s.c.RequestHandlers Registered paths: /admin/mbeans,standard,/update/csv,/update/json/docs,/admin/luke,/admin/segments,/get,/admin/system,/replication,/admin/properties,/config,/schema,/admin/plugins,/admin/logging,/update/json,/admin/threads,/admin/ping,/update,/admin/file
   [junit4]   2> 119840 INFO  (coreLoadExecutor-857-thread-1-processing-n:127.0.0.1:41639_) [n:127.0.0.1:41639_ c:control_collection s:shard1 r:core_node1 x:collection1] o.a.s.c.SolrCore Using default statsCache cache: org.apache.solr.search.stats.LocalStatsCache
   [junit4]   2> 119840 INFO  (coreLoadExecutor-857-thread-1-processing-n:127.0.0.1:41639_) [n:127.0.0.1:41639_ c:control_collection s:shard1 r:core_node1 x:collection1] o.a.s.u.UpdateHandler Using UpdateLog implementation: org.apache.solr.update.UpdateLog
   [junit4]   2> 119840 INFO  (coreLoadExecutor-857-thread-1-processing-n:127.0.0.1:41639_) [n:127.0.0.1:41639_ c:control_collection s:shard1 r:core_node1 x:collection1] o.a.s.u.UpdateLog Initializing UpdateLog: dataDir= defaultSyncLevel=FLUSH numRecordsToKeep=100 maxNumLogsToKeep=10 numVersionBuckets=65536
   [junit4]   2> 119842 INFO  (coreLoadExecutor-857-thread-1-processing-n:127.0.0.1:41639_) [n:127.0.0.1:41639_ c:control_collection s:shard1 r:core_node1 x:collection1] o.a.s.c.SolrCore Hard AutoCommit: disabled
   [junit4]   2> 119842 INFO  (coreLoadExecutor-857-thread-1-processing-n:127.0.0.1:41639_) [n:127.0.0.1:41639_ c:control_collection s:shard1 r:core_node1 x:collection1] o.a.s.c.SolrCore Soft AutoCommit: disabled
   [junit4]   2> 119842 INFO  (coreLoadExecutor-857-thread-1-processing-n:127.0.0.1:41639_) [n:127.0.0.1:41639_ c:control_collection s:shard1 r:core_node1 x:collection1] o.a.s.u.RandomMergePolicy RandomMergePolicy wrapping class org.apache.lucene.index.MockRandomMergePolicy: org.apache.lucene.index.MockRandomMergePolicy@1c7aa6e
   [junit4]   2> 119843 INFO  (coreLoadExecutor-857-thread-1-processing-n:127.0.0.1:41639_) [n:127.0.0.1:41639_ c:control_collection s:shard1 r:core_node1 x:collection1] o.a.s.c.SolrCore SolrDeletionPolicy.onInit: commits: num=1
   [junit4]   2> 	commit{dir=MockDirectoryWrapper(RAMDirectory@1a2d58c lockFactory=org.apache.lucene.store.SingleInstanceLockFactory@1001d65),segFN=segments_1,generation=1}
   [junit4]   2> 119843 INFO  (coreLoadExecutor-857-thread-1-processing-n:127.0.0.1:41639_) [n:127.0.0.1:41639_ c:control_collection s:shard1 r:core_node1 x:collection1] o.a.s.c.SolrCore newest commit generation = 1
   [junit4]   2> 119843 INFO  (coreLoadExecutor-857-thread-1-processing-n:127.0.0.1:41639_) [n:127.0.0.1:41639_ c:control_collection s:shard1 r:core_node1 x:collection1] o.a.s.s.SolrIndexSearcher Opening Searcher@11e16b1[collection1] main
   [junit4]   2> 119843 INFO  (coreLoadExecutor-857-thread-1-processing-n:127.0.0.1:41639_) [n:127.0.0.1:41639_ c:control_collection s:shard1 r:core_node1 x:collection1] o.a.s.c.c.ZkStateReader Load collection config from:/collections/control_collection
   [junit4]   2> 119844 INFO  (coreLoadExecutor-857-thread-1-processing-n:127.0.0.1:41639_) [n:127.0.0.1:41639_ c:control_collection s:shard1 r:core_node1 x:collection1] o.a.s.c.c.ZkStateReader path=/collections/control_collection configName=conf1 specified config exists in ZooKeeper
   [junit4]   2> 119844 INFO  (coreLoadExecutor-857-thread-1-processing-n:127.0.0.1:41639_) [n:127.0.0.1:41639_ c:control_collection s:shard1 r:core_node1 x:collection1] o.a.s.r.ManagedResourceStorage Setting up ZooKeeper-based storage for the RestManager with znodeBase: /configs/conf1
   [junit4]   2> 119844 INFO  (coreLoadExecutor-857-thread-1-processing-n:127.0.0.1:41639_) [n:127.0.0.1:41639_ c:control_collection s:shard1 r:core_node1 x:collection1] o.a.s.r.ManagedResourceStorage Configured ZooKeeperStorageIO with znodeBase: /configs/conf1
   [junit4]   2> 119844 INFO  (coreLoadExecutor-857-thread-1-processing-n:127.0.0.1:41639_) [n:127.0.0.1:41639_ c:control_collection s:shard1 r:core_node1 x:collection1] o.a.s.r.RestManager Initializing RestManager with initArgs: {}
   [junit4]   2> 119844 INFO  (coreLoadExecutor-857-thread-1-processing-n:127.0.0.1:41639_) [n:127.0.0.1:41639_ c:control_collection s:shard1 r:core_node1 x:collection1] o.a.s.r.ManagedResourceStorage Reading _rest_managed.json using ZooKeeperStorageIO:path=/configs/conf1
   [junit4]   2> 119845 INFO  (coreLoadExecutor-857-thread-1-processing-n:127.0.0.1:41639_) [n:127.0.0.1:41639_ c:control_collection s:shard1 r:core_node1 x:collection1] o.a.s.r.ManagedResourceStorage No data found for znode /configs/conf1/_rest_managed.json
   [junit4]   2> 119845 INFO  (coreLoadExecutor-857-thread-1-processing-n:127.0.0.1:41639_) [n:127.0.0.1:41639_ c:control_collection s:shard1 r:core_node1 x:collection1] o.a.s.r.ManagedResourceStorage Loaded null at path _rest_managed.json using ZooKeeperStorageIO:path=/configs/conf1
   [junit4]   2> 119845 INFO  (coreLoadExecutor-857-thread-1-processing-n:127.0.0.1:41639_) [n:127.0.0.1:41639_ c:control_collection s:shard1 r:core_node1 x:collection1] o.a.s.r.RestManager Initializing 0 registered ManagedResources
   [junit4]   2> 119845 INFO  (coreLoadExecutor-857-thread-1-processing-n:127.0.0.1:41639_) [n:127.0.0.1:41639_ c:control_collection s:shard1 r:core_node1 x:collection1] o.a.s.h.ReplicationHandler Commits will be reserved for  10000
   [junit4]   2> 119846 INFO  (searcherExecutor-858-thread-1-processing-n:127.0.0.1:41639_ x:collection1 s:shard1 c:control_collection r:core_node1) [n:127.0.0.1:41639_ c:control_collection s:shard1 r:core_node1 x:collection1] o.a.s.c.SolrCore [collection1] Registered new searcher Searcher@11e16b1[collection1] main{ExitableDirectoryReader(UninvertingDirectoryReader())}
   [junit4]   2> 119846 INFO  (coreLoadExecutor-857-thread-1-processing-n:127.0.0.1:41639_) [n:127.0.0.1:41639_ c:control_collection s:shard1 r:core_node1 x:collection1] o.a.s.u.UpdateLog Looking up max value of version field to seed version buckets
   [junit4]   2> 119847 INFO  (coreLoadExecutor-857-thread-1-processing-n:127.0.0.1:41639_) [n:127.0.0.1:41639_ c:control_collection s:shard1 r:core_node1 x:collection1] o.a.s.u.VersionInfo Refreshing highest value of _version_ for 65536 version buckets from index
   [junit4]   2> 119847 INFO  (coreLoadExecutor-857-thread-1-processing-n:127.0.0.1:41639_) [n:127.0.0.1:41639_ c:control_collection s:shard1 r:core_node1 x:collection1] o.a.s.u.VersionInfo No terms found for _version_, cannot seed version bucket highest value from index
   [junit4]   2> 119847 INFO  (coreLoadExecutor-857-thread-1-processing-n:127.0.0.1:41639_) [n:127.0.0.1:41639_ c:control_collection s:shard1 r:core_node1 x:collection1] o.a.s.u.UpdateLog Could not find max version in index or recent updates, using new clock 1503286900074479616
   [junit4]   2> 119849 INFO  (coreLoadExecutor-857-thread-1-processing-n:127.0.0.1:41639_) [n:127.0.0.1:41639_ c:control_collection s:shard1 r:core_node1 x:collection1] o.a.s.u.UpdateLog Took 2 ms to seed version buckets with highest version 1503286900074479616
   [junit4]   2> 119849 INFO  (coreLoadExecutor-857-thread-1-processing-n:127.0.0.1:41639_) [n:127.0.0.1:41639_ c:control_collection s:shard1 r:core_node1 x:collection1] o.a.s.c.ZkController watch zkdir /configs/conf1
   [junit4]   2> 119849 INFO  (coreLoadExecutor-857-thread-1-processing-n:127.0.0.1:41639_) [n:127.0.0.1:41639_ c:control_collection s:shard1 r:core_node1 x:collection1] o.a.s.c.CoreContainer registering core: collection1
   [junit4]   2> 119849 INFO  (coreZkRegister-851-thread-1-processing-n:127.0.0.1:41639_ x:collection1 s:shard1 c:control_collection r:core_node1) [n:127.0.0.1:41639_ c:control_collection s:shard1 r:core_node1 x:collection1] o.a.s.c.ZkController Register replica - core:collection1 address:http://127.0.0.1:41639 collection:control_collection shard:shard1
   [junit4]   2> 119850 INFO  (coreZkRegister-851-thread-1-processing-n:127.0.0.1:41639_ x:collection1 s:shard1 c:control_collection r:core_node1) [n:127.0.0.1:41639_ c:control_collection s:shard1 r:core_node1 x:collection1] o.a.s.c.c.SolrZkClient makePath: /collections/control_collection/leader_elect/shard1/election
   [junit4]   2> 119853 INFO  (coreZkRegister-851-thread-1-processing-n:127.0.0.1:41639_ x:collection1 s:shard1 c:control_collection r:core_node1) [n:127.0.0.1:41639_ c:control_collection s:shard1 r:core_node1 x:collection1] o.a.s.c.ShardLeaderElectionContext Running the leader process for shard shard1
   [junit4]   2> 119856 INFO  (zkCallback-562-thread-1-processing-n:127.0.0.1:41639_) [n:127.0.0.1:41639_    ] o.a.s.c.DistributedQueue NodeChildrenChanged fired on path /overseer/queue state SyncConnected
   [junit4]   2> 119857 INFO  (OverseerStateUpdate-93955431157727235-127.0.0.1:41639_-n_0000000000) [n:127.0.0.1:41639_    ] o.a.s.c.Overseer processMessage: queueSize: 1, message = {
   [junit4]   2>   "operation":"leader",
   [junit4]   2>   "shard":"shard1",
   [junit4]   2>   "collection":"control_collection"} current state version: 1
   [junit4]   2> 119858 INFO  (coreZkRegister-851-thread-1-processing-n:127.0.0.1:41639_ x:collection1 s:shard1 c:control_collection r:core_node1) [n:127.0.0.1:41639_ c:control_collection s:shard1 r:core_node1 x:collection1] o.a.s.c.ShardLeaderElectionContext Enough replicas found to continue.
   [junit4]   2> 119858 INFO  (coreZkRegister-851-thread-1-processing-n:127.0.0.1:41639_ x:collection1 s:shard1 c:control_collection r:core_node1) [n:127.0.0.1:41639_ c:control_collection s:shard1 r:core_node1 x:collection1] o.a.s.c.ShardLeaderElectionContext I may be the new leader - try and sync
   [junit4]   2> 119858 INFO  (coreZkRegister-851-thread-1-processing-n:127.0.0.1:41639_ x:collection1 s:shard1 c:control_collection r:core_node1) [n:127.0.0.1:41639_ c:control_collection s:shard1 r:core_node1 x:collection1] o.a.s.c.SyncStrategy Sync replicas to http://127.0.0.1:41639/collection1/
   [junit4]   2> 119859 INFO  (coreZkRegister-851-thread-1-processing-n:127.0.0.1:41639_ x:collection1 s:shard1 c:control_collection r:core_node1) [n:127.0.0.1:41639_ c:control_collection s:shard1 r:core_node1 x:collection1] o.a.s.c.SyncStrategy Sync Success - now sync replicas to me
   [junit4]   2> 119859 INFO  (coreZkRegister-851-thread-1-processing-n:127.0.0.1:41639_ x:collection1 s:shard1 c:control_collection r:core_node1) [n:127.0.0.1:41639_ c:control_collection s:shard1 r:core_node1 x:collection1] o.a.s.c.SyncStrategy http://127.0.0.1:41639/collection1/ has no replicas
   [junit4]   2> 119859 INFO  (coreZkRegister-851-thread-1-processing-n:127.0.0.1:41639_ x:collection1 s:shard1 c:control_collection r:core_node1) [n:127.0.0.1:41639_ c:control_collection s:shard1 r:core_node1 x:collection1] o.a.s.c.ShardLeaderElectionContext I am the new leader: http://127.0.0.1:41639/collection1/ shard1
   [junit4]   2> 119859 INFO  (coreZkRegister-851-thread-1-processing-n:127.0.0.1:41639_ x:collection1 s:shard1 c:control_collection r:core_node1) [n:127.0.0.1:41639_ c:control_collection s:shard1 r:core_node1 x:collection1] o.a.s.c.c.SolrZkClient makePath: /collections/control_collection/leaders/shard1
   [junit4]   2> 119864 INFO  (zkCallback-562-thread-1-processing-n:127.0.0.1:41639_) [n:127.0.0.1:41639_    ] o.a.s.c.DistributedQueue NodeChildrenChanged fired on path /overseer/queue state SyncConnected
   [junit4]   2> 119864 INFO  (OverseerStateUpdate-93955431157727235-127.0.0.1:41639_-n_0000000000) [n:127.0.0.1:41639_    ] o.a.s.c.Overseer processMessage: queueSize: 1, message = {
   [junit4]   2>   "operation":"leader",
   [junit4]   2>   "shard":"shard1",
   [junit4]   2>   "collection":"control_collection",
   [junit4]   2>   "base_url":"http://127.0.0.1:41639",
   [junit4]   2>   "core":"collection1",
   [junit4]   2>   "state":"active"} current state version: 1
   [junit4]   2> 119966 INFO  (zkCallback-562-thread-1-processing-n:127.0.0.1:41639_) [n:127.0.0.1:41639_    ] o.a.s.c.c.ZkStateReader A cluster state change: WatchedEvent state:SyncConnected type:NodeDataChanged path:/clusterstate.json, has occurred - updating... (live nodes size: 1)
   [junit4]   2> 119967 INFO  (zkCallback-562-thread-1-processing-n:127.0.0.1:41639_) [n:127.0.0.1:41639_    ] o.a.s.c.c.ZkStateReader Updated cluster state version to 2
   [junit4]   2> 120014 INFO  (coreZkRegister-851-thread-1-processing-n:127.0.0.1:41639_ x:collection1 s:shard1 c:control_collection r:core_node1) [n:127.0.0.1:41639_ c:control_collection s:shard1 r:core_node1 x:collection1] o.a.s.c.ZkController We are http://127.0.0.1:41639/collection1/ and leader is http://127.0.0.1:41639/collection1/
   [junit4]   2> 120015 INFO  (coreZkRegister-851-thread-1-processing-n:127.0.0.1:41639_ x:collection1 s:shard1 c:control_collection r:core_node1) [n:127.0.0.1:41639_ c:control_collection s:shard1 r:core_node1 x:collection1] o.a.s.c.ZkController No LogReplay needed for core=collection1 baseURL=http://127.0.0.1:41639
   [junit4]   2> 120015 INFO  (coreZkRegister-851-thread-1-processing-n:127.0.0.1:41639_ x:collection1 s:shard1 c:control_collection r:core_node1) [n:127.0.0.1:41639_ c:control_collection s:shard1 r:core_node1 x:collection1] o.a.s.c.ZkController I am the leader, no recovery necessary
   [junit4]   2> 120015 INFO  (coreZkRegister-851-thread-1-processing-n:127.0.0.1:41639_ x:collection1 s:shard1 c:control_collection r:core_node1) [n:127.0.0.1:41639_ c:control_collection s:shard1 r:core_node1 x:collection1] o.a.s.c.ZkController publishing state=active
   [junit4]   2> 120015 INFO  (coreZkRegister-851-thread-1-processing-n:127.0.0.1:41639_ x:collection1 s:shard1 c:control_collection r:core_node1) [n:127.0.0.1:41639_ c:control_collection s:shard1 r:core_node1 x:collection1] o.a.s.c.ZkController numShards not found on descriptor - reading it from system property
   [junit4]   2> 120016 INFO  (zkCallback-562-thread-1-processing-n:127.0.0.1:41639_) [n:127.0.0.1:41639_    ] o.a.s.c.DistributedQueue NodeChildrenChanged fired on path /overseer/queue state SyncConnected
   [junit4]   2> 120017 INFO  (OverseerStateUpdate-93955431157727235-127.0.0.1:41639_-n_0000000000) [n:127.0.0.1:41639_    ] o.a.s.c.Overseer processMessage: queueSize: 1, message = {
   [junit4]   2>   "core":"collection1",
   [junit4]   2>   "core_node_name":"core_node1",
   [junit4]   2>   "roles":null,
   [junit4]   2>   "base_url":"http://127.0.0.1:41639",
   [junit4]   2>   "node_name":"127.0.0.1:41639_",
   [junit4]   2>   "numShards":"1",
   [junit4]   2>   "state":"active",
   [junit4]   2>   "shard":"shard1",
   [junit4]   2>   "collection":"control_collection",
   [junit4]   2>   "operation":"state"} current state version: 2
   [junit4]   2> 120017 INFO  (OverseerStateUpdate-93955431157727235-127.0.0.1:41639_-n_0000000000) [n:127.0.0.1:41639_    ] o.a.s.c.o.ReplicaMutator Update state numShards=1 message={
   [junit4]   2>   "core":"collection1",
   [junit4]   2>   "core_node_name":"core_node1",
   [junit4]   2>   "roles":null,
   [junit4]   2>   "base_url":"http://127.0.0.1:41639",
   [junit4]   2>   "node_name":"127.0.0.1:41639_",
   [junit4]   2>   "numShards":"1",
   [junit4]   2>   "state":"active",
   [junit4]   2>   "shard":"shard1",
   [junit4]   2>   "collection":"control_collection",
   [junit4]   2>   "operation":"state"}
   [junit4]   2> 120119 INFO  (zkCallback-562-thread-1-processing-n:127.0.0.1:41639_) [n:127.0.0.1:41639_    ] o.a.s.c.c.ZkStateReader A cluster state change: WatchedEvent state:SyncConnected type:NodeDataChanged path:/clusterstate.json, has occurred - updating... (live nodes size: 1)
   [junit4]   2> 120120 INFO  (zkCallback-562-thread-1-processing-n:127.0.0.1:41639_) [n:127.0.0.1:41639_    ] o.a.s.c.c.ZkStateReader Updated cluster state version to 3
   [junit4]   2> 120199 INFO  (TEST-CollectionsAPIAsyncDistributedZkTest.testSolrJAPICalls-seed#[1A58B13484DE1995]) [    ] o.a.s.c.c.SolrZkClient Using default ZkCredentialsProvider
   [junit4]   2> 120200 INFO  (TEST-CollectionsAPIAsyncDistributedZkTest.testSolrJAPICalls-seed#[1A58B13484DE1995]) [    ] o.a.s.c.c.ConnectionManager Waiting for client to connect to ZooKeeper
   [junit4]   2> 120201 INFO  (zkCallback-564-thread-1) [    ] o.a.s.c.c.ConnectionManager Watcher org.apache.solr.common.cloud.ConnectionManager@16ca4b2 name:ZooKeeperConnection Watcher:127.0.0.1:33820/solr got event WatchedEvent state:SyncConnected type:None path:null path:null type:None
   [junit4]   2> 120201 INFO  (TEST-CollectionsAPIAsyncDistributedZkTest.testSolrJAPICalls-seed#[1A58B13484DE1995]) [    ] o.a.s.c.c.ConnectionManager Client is connected to ZooKeeper
   [junit4]   2> 120202 INFO  (TEST-CollectionsAPIAsyncDistributedZkTest.testSolrJAPICalls-seed#[1A58B13484DE1995]) [    ] o.a.s.c.c.SolrZkClient Using default ZkACLProvider
   [junit4]   2> 120202 INFO  (TEST-CollectionsAPIAsyncDistributedZkTest.testSolrJAPICalls-seed#[1A58B13484DE1995]) [    ] o.a.s.c.c.ZkStateReader Updating cluster state from ZooKeeper... 
   [junit4]   2> 120204 INFO  (TEST-CollectionsAPIAsyncDistributedZkTest.testSolrJAPICalls-seed#[1A58B13484DE1995]) [    ] o.a.s.c.ChaosMonkey monkey: init - expire sessions:false cause connection loss:false
   [junit4]   2> 120204 INFO  (TEST-CollectionsAPIAsyncDistributedZkTest.testSolrJAPICalls-seed#[1A58B13484DE1995]) [    ] o.a.s.c.AbstractFullDistribZkTestBase Creating collection1 with stateFormat=2
   [junit4]   2> 120204 INFO  (TEST-CollectionsAPIAsyncDistributedZkTest.testSolrJAPICalls-seed#[1A58B13484DE1995]) [    ] o.a.s.c.c.SolrZkClient Using default ZkCredentialsProvider
   [junit4]   2> 120204 INFO  (TEST-CollectionsAPIAsyncDistributedZkTest.testSolrJAPICalls-seed#[1A58B13484DE1995]) [    ] o.a.s.c.c.ConnectionManager Waiting for client to connect to ZooKeeper
   [junit4]   2> 120209 INFO  (zkCallback-565-thread-1) [    ] o.a.s.c.c.ConnectionManager Watcher org.apache.solr.common.cloud.ConnectionManager@22b99d name:ZooKeeperConnection Watcher:127.0.0.1:33820/solr got event WatchedEvent state:SyncConnected type:None path:null path:null type:None
   [junit4]   2> 120209 INFO  (TEST-CollectionsAPIAsyncDistributedZkTest.testSolrJAPICalls-seed#[1A58B13484DE1995]) [    ] o.a.s.c.c.ConnectionManager Client is connected to ZooKeeper
   [junit4]   2> 120210 INFO  (TEST-CollectionsAPIAsyncDistributedZkTest.testSolrJAPICalls-seed#[1A58B13484DE1995]) [    ] o.a.s.c.c.SolrZkClient Using default ZkACLProvider
   [junit4]   2> 120211 INFO  (zkCallback-562-thread-1-processing-n:127.0.0.1:41639_) [n:127.0.0.1:41639_    ] o.a.s.c.DistributedQueue NodeChildrenChanged fired on path /overseer/queue state SyncConnected
   [junit4]   2> 120215 INFO  (OverseerStateUpdate-93955431157727235-127.0.0.1:41639_-n_0000000000) [n:127.0.0.1:41639_    ] o.a.s.c.Overseer processMessage: queueSize: 1, message = {
   [junit4]   2>   "operation":"create",
   [junit4]   2>   "name":"collection1",
   [junit4]   2>   "numShards":"1",
   [junit4]   2>   "stateFormat":"2"} current state version: 3
   [junit4]   2> 120216 INFO  (OverseerStateUpdate-93955431157727235-127.0.0.1:41639_-n_0000000000) [n:127.0.0.1:41639_    ] o.a.s.c.o.ClusterStateMutator building a new cName: collection1
   [junit4]   2> 120279 INFO  (TEST-CollectionsAPIAsyncDistributedZkTest.testSolrJAPICalls-seed#[1A58B13484DE1995]) [    ] o.a.s.SolrTestCaseJ4 Writing core.properties file to /home/jenkins/workspace/Lucene-Solr-trunk-Linux/solr/build/solr-core/test/J0/temp/solr.cloud.CollectionsAPIAsyncDistributedZkTest 1A58B13484DE1995-001/shard-1-001/cores/collection1
   [junit4]   2> 120280 INFO  (TEST-CollectionsAPIAsyncDistributedZkTest.testSolrJAPICalls-seed#[1A58B13484DE1995]) [    ] o.a.s.c.AbstractFullDistribZkTestBase create jetty 1 in directory /home/jenkins/workspace/Lucene-Solr-trunk-Linux/solr/build/solr-core/test/J0/temp/solr.cloud.CollectionsAPIAsyncDistributedZkTest 1A58B13484DE1995-001/shard-1-001
   [junit4]   2> 120281 INFO  (TEST-CollectionsAPIAsyncDistributedZkTest.testSolrJAPICalls-seed#[1A58B13484DE1995]) [    ] o.e.j.s.Server jetty-9.2.10.v20150310
   [junit4]   2> 120282 INFO  (TEST-CollectionsAPIAsyncDistributedZkTest.testSolrJAPICalls-seed#[1A58B13484DE1995]) [    ] o.e.j.s.h.ContextHandler Started o.e.j.s.ServletContextHandler@119ac8e{/,null,AVAILABLE}
   [junit4]   2> 120283 INFO  (TEST-CollectionsAPIAsyncDistributedZkTest.testSolrJAPICalls-seed#[1A58B13484DE1995]) [    ] o.e.j.s.ServerConnector Started ServerConnector@aab656{HTTP/1.1}{127.0.0.1:36152}
   [junit4]   2> 120283 INFO  (TEST-CollectionsAPIAsyncDistributedZkTest.testSolrJAPICalls-seed#[1A58B13484DE1995]) [    ] o.e.j.s.Server Started @121605ms
   [junit4]   2> 120283 INFO  (TEST-CollectionsAPIAsyncDistributedZkTest.testSolrJAPICalls-seed#[1A58B13484DE1995]) [    ] o.a.s.c.s.e.JettySolrRunner Jetty properties: {solr.data.dir=/home/jenkins/workspace/Lucene-Solr-trunk-Linux/solr/build/solr-core/test/J0/temp/solr.cloud.CollectionsAPIAsyncDistributedZkTest 1A58B13484DE1995-001/tempDir-001/jetty1, solrconfig=solrconfig.xml, hostContext=/, hostPort=36152, coreRootDirectory=/home/jenkins/workspace/Lucene-Solr-trunk-Linux/solr/build/solr-core/test/J0/../../../../../../../../../home/jenkins/workspace/Lucene-Solr-trunk-Linux/solr/build/solr-core/test/J0/temp/solr.cloud.CollectionsAPIAsyncDistributedZkTest 1A58B13484DE1995-001/shard-1-001/cores}
   [junit4]   2> 120283 INFO  (TEST-CollectionsAPIAsyncDistributedZkTest.testSolrJAPICalls-seed#[1A58B13484DE1995]) [    ] o.a.s.s.SolrDispatchFilter SolrDispatchFilter.init()sun.misc.Launcher$AppClassLoader@1764bce
   [junit4]   2> 120284 INFO  (TEST-CollectionsAPIAsyncDistributedZkTest.testSolrJAPICalls-seed#[1A58B13484DE1995]) [    ] o.a.s.c.SolrResourceLoader new SolrResourceLoader for directory: '/home/jenkins/workspace/Lucene-Solr-trunk-Linux/solr/build/solr-core/test/J0/../../../../../../../../../home/jenkins/workspace/Lucene-Solr-trunk-Linux/solr/build/solr-core/test/J0/temp/solr.cloud.CollectionsAPIAsyncDistributedZkTest 1A58B13484DE1995-001/shard-1-001/'
   [junit4]   2> 120295 INFO  (TEST-CollectionsAPIAsyncDistributedZkTest.testSolrJAPICalls-seed#[1A58B13484DE1995]) [    ] o.a.s.c.SolrXmlConfig Loading container configuration from /home/jenkins/workspace/Lucene-Solr-trunk-Linux/solr/build/solr-core/test/J0/../../../../../../../../../home/jenkins/workspace/Lucene-Solr-trunk-Linux/solr/build/solr-core/test/J0/temp/solr.cloud.CollectionsAPIAsyncDistributedZkTest 1A58B13484DE1995-001/shard-1-001/solr.xml
   [junit4]   2> 120299 INFO  (TEST-CollectionsAPIAsyncDistributedZkTest.testSolrJAPICalls-seed#[1A58B13484DE1995]) [    ] o.a.s.c.CoresLocator Config-defined core root directory: /home/jenkins/workspace/Lucene-Solr-trunk-Linux/solr/build/solr-core/test/J0/../../../../../../../../../home/jenkins/workspace/Lucene-Solr-trunk-Linux/solr/build/solr-core/test/J0/temp/solr.cloud.CollectionsAPIAsyncDistributedZkTest 1A58B13484DE1995-001/shard-1-001/cores
   [junit4]   2> 120299 INFO  (TEST-CollectionsAPIAsyncDistributedZkTest.testSolrJAPICalls-seed#[1A58B13484DE1995]) [    ] o.a.s.c.CoreContainer New CoreContainer 31040585
   [junit4]   2> 120299 INFO  (TEST-CollectionsAPIAsyncDistributedZkTest.testSolrJAPICalls-seed#[1A58B13484DE1995]) [    ] o.a.s.c.CoreContainer Loading cores into CoreContainer [instanceDir=/home/jenkins/workspace/Lucene-Solr-trunk-Linux/solr/build/solr-core/test/J0/../../../../../../../../../home/jenkins/workspace/Lucene-Solr-trunk-Linux/solr/build/solr-core/test/J0/temp/solr.cloud.CollectionsAPIAsyncDistributedZkTest 1A58B13484DE1995-001/shard-1-001/]
   [junit4]   2> 120299 INFO  (TEST-CollectionsAPIAsyncDistributedZkTest.testSolrJAPICalls-seed#[1A58B13484DE1995]) [    ] o.a.s.c.CoreContainer loading shared library: /home/jenkins/workspace/Lucene-Solr-trunk-Linux/solr/build/solr-core/test/J0/../../../../../../../../../home/jenkins/workspace/Lucene-Solr-trunk-Linux/solr/build/solr-core/test/J0/temp/solr.cloud.CollectionsAPIAsyncDistributedZkTest 1A58B13484DE1995-001/shard-1-001/lib
   [junit4]   2> 120300 WARN  (TEST-CollectionsAPIAsyncDistributedZkTest.testSolrJAPICalls-seed#[1A58B13484DE1995]) [    ] o.a.s.c.SolrResourceLoader Can't find (or read) directory to add to classloader: lib (resolved as: /home/jenkins/workspace/Lucene-Solr-trunk-Linux/solr/build/solr-core/test/J0/../../../../../../../../../home/jenkins/workspace/Lucene-Solr-trunk-Linux/solr/build/solr-core/test/J0/temp/solr.cloud.CollectionsAPIAsyncDistributedZkTest 1A58B13484DE1995-001/shard-1-001/lib).
   [junit4]   2> 120304 INFO  (TEST-CollectionsAPIAsyncDistributedZkTest.testSolrJAPICalls-seed#[1A58B13484DE1995]) [    ] o.a.s.h.c.HttpShardHandlerFactory created with socketTimeout : 90000,urlScheme : ,connTimeout : 15000,maxConnectionsPerHost : 20,maxConnections : 10000,corePoolSize : 0,maximumPoolSize : 2147483647,maxThreadIdleTime : 5,sizeOfQueue : -1,fairnessPolicy : false,useRetries : false,
   [junit4]   2> 120305 INFO  (TEST-CollectionsAPIAsyncDistributedZkTest.testSolrJAPICalls-seed#[1A58B13484DE1995]) [    ] o.a.s.u.UpdateShardHandler Creating UpdateShardHandler HTTP client with params: socketTimeout=340000&connTimeout=45000&retry=true
   [junit4]   2> 120305 INFO  (TEST-CollectionsAPIAsyncDistributedZkTest.testSolrJAPICalls-seed#[1A58B13484DE1995]) [    ] o.a.s.l.LogWatcher SLF4J impl is org.slf4j.impl.Log4jLoggerFactory
   [junit4]   2> 120306 INFO  (TEST-CollectionsAPIAsyncDistributedZkTest.testSolrJAPICalls-seed#[1A58B13484DE1995]) [    ] o.a.s.l.LogWatcher Registering Log Listener [Log4j (org.slf4j.impl.Log4jLoggerFactory)]
   [junit4]   2> 120306 INFO  (TEST-CollectionsAPIAsyncDistributedZkTest.testSolrJAPICalls-seed#[1A58B13484DE1995]) [    ] o.a.s.c.ZkContainer Zookeeper client=127.0.0.1:33820/solr
   [junit4]   2> 120306 INFO  (TEST-CollectionsAPIAsyncDistributedZkTest.testSolrJAPICalls-seed#[1A58B13484DE1995]) [    ] o.a.s.c.ZkController zkHost includes chroot
   [junit4]   2> 120306 INFO  (TEST-CollectionsAPIAsyncDistributedZkTest.testSolrJAPICalls-seed#[1A58B13484DE1995]) [    ] o.a.s.c.c.SolrZkClient Using default ZkCredentialsProvider
   [junit4]   2> 120306 INFO  (TEST-CollectionsAPIAsyncDistributedZkTest.testSolrJAPICalls-seed#[1A58B13484DE1995]) [    ] o.a.s.c.c.ConnectionManager Waiting for client to connect to ZooKeeper
   [junit4]   2> 120308 INFO  (zkCallback-567-thread-1) [    ] o.a.s.c.c.ConnectionManager Watcher org.apache.solr.common.cloud.ConnectionManager@cd7212 name:ZooKeeperConnection Watcher:127.0.0.1:33820 got event WatchedEvent state:SyncConnected type:None path:null path:null type:None
   [junit4]   2> 120308 INFO  (TEST-CollectionsAPIAsyncDistributedZkTest.testSolrJAPICalls-seed#[1A58B13484DE1995]) [    ] o.a.s.c.c.ConnectionManager Client is connected to ZooKeeper
   [junit4]   2> 120308 INFO  (TEST-CollectionsAPIAsyncDistributedZkTest.testSolrJAPICalls-seed#[1A58B13484DE1995]) [    ] o.a.s.c.c.SolrZkClient Using default ZkACLProvider
   [junit4]   2> 120310 INFO  (TEST-CollectionsAPIAsyncDistributedZkTest.testSolrJAPICalls-seed#[1A58B13484DE1995]) [n:127.0.0.1:36152_    ] o.a.s.c.c.ConnectionManager Waiting for client to connect to ZooKeeper
   [junit4]   2> 120311 INFO  (zkCallback-568-thread-1-processing-n:127.0.0.1:36152_) [n:127.0.0.1:36152_    ] o.a.s.c.c.ConnectionManager Watcher org.apache.solr.common.cloud.ConnectionManager@260811 name:ZooKeeperConnection Watcher:127.0.0.1:33820/solr got event WatchedEvent state:SyncConnected type:None path:null path:null type:None
   [junit4]   2> 120311 INFO  (TEST-CollectionsAPIAsyncDistributedZkTest.testSolrJAPICalls-seed#[1A58B13484DE1995]) [n:127.0.0.1:36152_    ] o.a.s.c.c.ConnectionManager Client is connected to ZooKeeper
   [junit4]   2> 120314 INFO  (TEST-CollectionsAPIAsyncDistributedZkTest.testSolrJAPICalls-seed#[1A58B13484DE1995]) [n:127.0.0.1:36152_    ] o.a.s.c.c.ZkStateReader Updating cluster state from ZooKeeper... 
   [junit4]   2> 120318 INFO  (OverseerStateUpdate-93955431157727235-127.0.0.1:41639_-n_0000000000) [n:127.0.0.1:41639_    ] o.a.s.c.o.ZkStateWriter going to create_collection /collections/collection1/state.json
   [junit4]   2> 120319 INFO  (zkCallback-568-thread-1-processing-n:127.0.0.1:36152_) [n:127.0.0.1:36152_    ] o.a.s.c.c.ZkStateReader A cluster state change: WatchedEvent state:SyncConnected type:NodeDataChanged path:/clusterstate.json, has occurred - updating... (live nodes size: 1)
   [junit4]   2> 120319 INFO  (zkCallback-562-thread-1-processing-n:127.0.0.1:41639_) [n:127.0.0.1:41639_    ] o.a.s.c.c.ZkStateReader A cluster state change: WatchedEvent state:SyncConnected type:NodeDataChanged path:/clusterstate.json, has occurred - updating... (live nodes size: 1)
   [junit4]   2> 120320 INFO  (zkCallback-564-thread-1) [    ] o.a.s.c.c.ZkStateReader A cluster state change: WatchedEvent state:SyncConnected type:NodeDataChanged path:/clusterstate.json, has occurred - updating... (live nodes size: 1)
   [junit4]   2> 120320 INFO  (zkCallback-562-thread-1-processing-n:127.0.0.1:41639_) [n:127.0.0.1:41639_    ] o.a.s.c.c.ZkStateReader Updated cluster state version to 4
   [junit4]   2> 120321 INFO  (zkCallback-568-thread-1-processing-n:127.0.0.1:36152_) [n:127.0.0.1:36152_    ] o.a.s.c.c.ZkStateReader Updated cluster state version to 4
   [junit4]   2> 120321 INFO  (zkCallback-564-thread-1) [    ] o.a.s.c.c.ZkStateReader Updated cluster state version to 4
   [junit4]   2> 121316 INFO  (TEST-CollectionsAPIAsyncDistributedZkTest.testSolrJAPICalls-seed#[1A58B13484DE1995]) [n:127.0.0.1:36152_    ] o.a.s.c.ZkController Register node as live in ZooKeeper:/live_nodes/127.0.0.1:36152_
   [junit4]   2> 121317 INFO  (TEST-CollectionsAPIAsyncDistributedZkTest.testSolrJAPICalls-seed#[1A58B13484DE1995]) [n:127.0.0.1:36152_    ] o.a.s.c.c.SolrZkClient makePath: /live_nodes/127.0.0.1:36152_
   [junit4]   2> 121318 INFO  (TEST-CollectionsAPIAsyncDistributedZkTest.testSolrJAPICalls-seed#[1A58B13484DE1995]) [n:127.0.0.1:36152_    ] o.a.s.c.Overseer Overseer (id=null) closing
   [junit4]   2> 121319 INFO  (TEST-CollectionsAPIAsyncDistributedZkTest.testSolrJAPICalls-seed#[1A58B13484DE1995]) [n:127.0.0.1:36152_    ] o.a.s.c.CoreContainer No authentication plugin used.
   [junit4]   2> 121320 INFO  (TEST-CollectionsAPIAsyncDistributedZkTest.testSolrJAPICalls-seed#[1A58B13484DE1995]) [n:127.0.0.1:36152_    ] o.a.s.c.CoreContainer Security conf doesn't exist. Skipping setup for authorization module.
   [junit4]   2> 121320 INFO  (TEST-CollectionsAPIAsyncDistributedZkTest.testSolrJAPICalls-seed#[1A58B13484DE1995]) [n:127.0.0.1:36152_    ] o.a.s.c.CoresLocator Looking for core definitions underneath /home/jenkins/workspace/Lucene-Solr-trunk-Linux/solr/build/solr-core/test/J0/../../../../../../../../../home/jenkins/workspace/Lucene-Solr-trunk-Linux/solr/build/solr-core/test/J0/temp/solr.cloud.CollectionsAPIAsyncDistributedZkTest 1A58B13484DE1995-001/shard-1-001/cores
   [junit4]   2> 121321 INFO  (TEST-CollectionsAPIAsyncDistributedZkTest.testSolrJAPICalls-seed#[1A58B13484DE1995]) [n:127.0.0.1:36152_    ] o.a.s.c.SolrCore Created CoreDescriptor: {name=collection1, config=solrconfig.xml, transient=false, schema=schema.xml, loadOnStartup=true, instanceDir=/home/jenkins/workspace/Lucene-Solr-trunk-Linux/solr/build/solr-core/test/J0/../../../../../../../../../home/jenkins/workspace/Lucene-Solr-trunk-Linux/solr/build/solr-core/test/J0/temp/solr.cloud.CollectionsAPIAsyncDistributedZkTest 1A58B13484DE1995-001/shard-1-001/cores/collection1, collection=collection1, absoluteInstDir=/home/jenkins/workspace/Lucene-Solr-trunk-Linux/solr/build/solr-core/test/J0/../../../../../../../../../home/jenkins/workspace/Lucene-Solr-trunk-Linux/solr/build/solr-core/test/J0/temp/solr.cloud.CollectionsAPIAsyncDistributedZkTest 1A58B13484DE1995-001/shard-1-001/cores/collection1/, coreNodeName=, dataDir=data/, shard=}
   [junit4]   2> 121321 INFO  (TEST-CollectionsAPIAsyncDistributedZkTest.testSolrJAPICalls-seed#[1A58B13484DE1995]) [n:127.0.0.1:36152_    ] o.a.s.c.CoresLocator Found core collection1 in /home/jenkins/workspace/Lucene-Solr-trunk-Linux/solr/build/solr-core/test/J0/../../../../../../../../../home/jenkins/workspace/Lucene-Solr-trunk-Linux/solr/build/solr-core/test/J0/temp/solr.cloud.CollectionsAPIAsyncDistributedZkTest 1A58B13484DE1995-001/shard-1-001/cores/collection1/
   [junit4]   2> 121321 INFO  (TEST-CollectionsAPIAsyncDistributedZkTest.testSolrJAPICalls-seed#[1A58B13484DE1995]) [n:127.0.0.1:36152_    ] o.a.s.c.CoresLocator Found 1 core definitions
   [junit4]   2> 121322 INFO  (TEST-CollectionsAPIAsyncDistributedZkTest.testSolrJAPICalls-seed#[1A58B13484DE1995]) [n:127.0.0.1:36152_    ] o.a.s.s.SolrDispatchFilter user.dir=/home/jenkins/workspace/Lucene-Solr-trunk-Linux/solr/build/solr-core/test/J0
   [junit4]   2> 121322 INFO  (TEST-CollectionsAPIAsyncDistributedZkTest.testSolrJAPICalls-seed#[1A58B13484DE1995]) [n:127.0.0.1:36152_    ] o.a.s.s.SolrDispatchFilter SolrDispatchFilter.init() done
   [junit4]   2> 121323 INFO  (coreLoadExecutor-868-thread-1-processing-n:127.0.0.1:36152_) [n:127.0.0.1:36152_ c:collection1   x:collection1] o.a.s.c.ZkController publishing state=down
   [junit4]   2> 121323 INFO  (coreLoadExecutor-868-thread-1-processing-n:127.0.0.1:36152_) [n:127.0.0.1:36152_ c:collection1   x:collection1] o.a.s.c.ZkController numShards not found on descriptor - reading it from system property
   [junit4]   2> 121324 INFO  (zkCallback-562-thread-1-processing-n:127.0.0.1:41639_) [n:127.0.0.1:41639_    ] o.a.s.c.DistributedQueue NodeChildrenChanged fired on path /overseer/queue state SyncConnected
   [junit4]   2> 121325 INFO  (coreLoadExecutor-868-thread-1-processing-n:127.0.0.1:36152_) [n:127.0.0.1:36152_ c:collection1   x:collection1] o.a.s.c.ZkController Registering watch for external collection collection1
   [junit4]   2> 121325 INFO  (coreLoadExecutor-868-thread-1-processing-n:127.0.0.1:36152_) [n:127.0.0.1:36152_ c:collection1   x:collection1] o.a.s.c.c.ZkStateReader addZkWatch collection1
   [junit4]   2> 121325 INFO  (OverseerStateUpdate-93955431157727235-127.0.0.1:41639_-n_0000000000) [n:127.0.0.1:41639_    ] o.a.s.c.Overseer processMessage: queueSize: 1, message = {
   [junit4]   2>   "core":"collection1",
   [junit4]   2>   "roles":null,
   [junit4]   2>   "base_url":"http://127.0.0.1:36152",
   [junit4]   2>   "node_name":"127.0.0.1:36152_",
   [junit4]   2>   "numShards":"1",
   [junit4]   2>   "state":"down",
   [junit4]   2>   "shard":null,
   [junit4]   2>   "collection":"collection1",
   [junit4]   2>   "operation":"state"} current state version: 4
   [junit4]   2> 121325 INFO  (coreLoadExecutor-868-thread-1-processing-n:127.0.0.1:36152_) [n:127.0.0.1:36152_ c:collection1   x:collection1] o.a.s.c.c.ZkStateReader Updating collection state at /collections/collection1/state.json from ZooKeeper... 
   [junit4]   2> 121325 INFO  (OverseerStateUpdate-93955431157727235-127.0.0.1:41639_-n_0000000000) [n:127.0.0.1:41639_    ] o.a.s.c.o.ReplicaMutator Update state numShards=1 message={
   [junit4]   2>   "core":"collection1",
   [junit4]   2>   "roles":null,
   [junit4]   2>   "base_url":"http://127.0.0.1:36152",
   [junit4]   2>   "node_name":"127.0.0.1:36152_",
   [junit4]   2>   "numShards":"1",
   [junit4]   2>   "state":"down",
   [junit4]   2>   "shard":null,
   [junit4]   2>   "collection":"collection1",
   [junit4]   2>   "operation":"state"}
   [junit4]   2> 121326 INFO  (OverseerStateUpdate-93955431157727235-127.0.0.1:41639_-n_0000000000) [n:127.0.0.1:41639_    ] o.a.s.c.o.ReplicaMutator Collection already exists with numShards=1
   [junit4]   2> 121326 INFO  (OverseerStateUpdate-93955431157727235-127.0.0.1:41639_-n_0000000000) [n:127.0.0.1:41639_    ] o.a.s.c.o.ReplicaMutator Assigning new node to shard shard=shard1
   [junit4]   2> 121326 INFO  (coreLoadExecutor-868-thread-1-processing-n:127.0.0.1:36152_) [n:127.0.0.1:36152_ c:collection1   x:collection1] o.a.s.c.c.ZkStateReader Updating data for collection1 to ver 0 
   [junit4]   2> 121326 INFO  (coreLoadExecutor-868-thread-1-processing-n:127.0.0.1:36152_) [n:127.0.0.1:36152_ c:collection1   x:collection1] o.a.s.c.ZkController look for our core node name
   [junit4]   2> 121428 INFO  (OverseerStateUpdate-93955431157727235-127.0.0.1:41639_-n_0000000000) [n:127.0.0.1:41639_    ] o.a.s.c.o.ZkStateWriter going to update_collection /collections/collection1/state.json version: 0
   [junit4]   2> 121428 INFO  (zkCallback-568-thread-1-processing-n:127.0.0.1:36152_) [n:127.0.0.1:36152_    ] o.a.s.c.c.ZkStateReader A cluster state change: WatchedEvent state:SyncConnected type:NodeDataChanged path:/collections/collection1/state.json for collection collection1 has occurred - updating... (live nodes size: 2)
   [junit4]   2> 121429 INFO  (zkCallback-568-thread-1-processing-n:127.0.0.1:36152_) [n:127.0.0.1:36152_    ] o.a.s.c.c.ZkStateReader Updating data for collection1 to ver 1 
   [junit4]   2> 122326 INFO  (coreLoadExecutor-868-thread-1-processing-n:127.0.0.1:36152_) [n:127.0.0.1:36152_ c:collection1   x:collection1] o.a.s.c.ZkController waiting to find shard id in clusterstate for collection1
   [junit4]   2> 122327 INFO  (coreLoadExecutor-868-thread-1-processing-n:127.0.0.1:36152_) [n:127.0.0.1:36152_ c:collection1   x:collection1] o.a.s.c.ZkController Check for collection zkNode:collection1
   [junit4]   2> 122327 INFO  (coreLoadExecutor-868-thread-1-processing-n:127.0.0.1:36152_) [n:127.0.0.1:36152_ c:collection1   x:collection1] o.a.s.c.ZkController Collection zkNode exists
   [junit4]   2> 122327 INFO  (coreLoadExecutor-868-thread-1-processing-n:127.0.0.1:36152_) [n:127.0.0.1:36152_ c:collection1   x:collection1] o.a.s.c.c.ZkStateReader Load collection config from:/collections/collection1
   [junit4]   2> 122328 INFO  (coreLoadExecutor-868-thread-1-processing-n:127.0.0.1:36152_) [n:127.0.0.1:36152_ c:collection1   x:collection1] o.a.s.c.c.ZkStateReader path=/collections/collection1 configName=conf1 specified config exists in ZooKeeper
   [junit4]   2> 122328 INFO  (coreLoadExecutor-868-thread-1-processing-n:127.0.0.1:36152_) [n:127.0.0.1:36152_ c:collection1   x:collection1] o.a.s.c.SolrResourceLoader new SolrResourceLoader for directory: '/home/jenkins/workspace/Lucene-Solr-trunk-Linux/solr/build/solr-core/test/J0/../../../../../../../../../home/jenkins/workspace/Lucene-Solr-trunk-Linux/solr/build/solr-core/test/J0/temp/solr.cloud.CollectionsAPIAsyncDistributedZkTest 1A58B13484DE1995-001/shard-1-001/cores/collection1/'
   [junit4]   2> 122339 INFO  (coreLoadExecutor-868-thread-1-processing-n:127.0.0.1:36152_) [n:127.0.0.1:36152_ c:collection1   x:collection1] o.a.s.c.Config loaded config solrconfig.xml with version 0 
   [junit4]   2> 122343 INFO  (coreLoadExecutor-868-thread-1-processing-n:127.0.0.1:36152_) [n:127.0.0.1:36152_ c:collection1   x:collection1] o.a.s.c.SolrConfig current version of requestparams : -1
   [junit4]   2> 122347 INFO  (coreLoadExecutor-868-thread-1-processing-n:127.0.0.1:36152_) [n:127.0.0.1:36152_ c:collection1   x:collection1] o.a.s.c.SolrConfig Using Lucene MatchVersion: 6.0.0
   [junit4]   2> 122358 INFO  (coreLoadExecutor-868-thread-1-processing-n:127.0.0.1:36152_) [n:127.0.0.1:36152_ c:collection1   x:collection1] o.a.s.c.Config Loaded SolrConfig: solrconfig.xml
   [junit4]   2> 122360 INFO  (coreLoadExecutor-868-thread-1-processing-n:127.0.0.1:36152_) [n:127.0.0.1:36152_ c:collection1   x:collection1] o.a.s.s.IndexSchema Reading Solr Schema from /configs/conf1/schema.xml
   [junit4]   2> 122365 INFO  (coreLoadExecutor-868-thread-1-processing-n:127.0.0.1:36152_) [n:127.0.0.1:36152_ c:collection1   x:collection1] o.a.s.s.IndexSchema [collection1] Schema name=test
   [junit4]   2> 122436 INFO  (coreLoadExecutor-868-thread-1-processing-n:127.0.0.1:36152_) [n:127.0.0.1:36152_ c:collection1   x:collection1] o.a.s.s.OpenExchangeRatesOrgProvider Initialized with rates=open-exchange-rates.json, refreshInterval=1440.
   [junit4]   2> 122440 INFO  (coreLoadExecutor-868-thread-1-processing-n:127.0.0.1:36152_) [n:127.0.0.1:36152_ c:collection1   x:collection1] o.a.s.s.IndexSchema default search field in schema is text
   [junit4]   2> 122441 INFO  (coreLoadExecutor-868-thread-1-processing-n:127.0.0.1:36152_) [n:127.0.0.1:36152_ c:collection1   x:collection1] o.a.s.s.IndexSchema unique key field: id
   [junit4]   2> 122447 INFO  (coreLoadExecutor-868-thread-1-processing-n:127.0.0.1:36152_) [n:127.0.0.1:36152_ c:collection1   x:collection1] o.a.s.s.FileExchangeRateProvider Reloading exchange rates from file currency.xml
   [junit4]   2> 122449 INFO  (coreLoadExecutor-868-thread-1-processing-n:127.0.0.1:36152_) [n:127.0.0.1:36152_ c:collection1   x:collection1] o.a.s.s.FileExchangeRateProvider Reloading exchange rates from file currency.xml
   [junit4]   2> 122451 INFO  (coreLoadExecutor-868-thread-1-processing-n:127.0.0.1:36152_) [n:127.0.0.1:36152_ c:collection1   x:collection1] o.a.s.s.OpenExchangeRatesOrgProvider Reloading exchange rates from open-exchange-rates.json
   [junit4]   2> 122452 WARN  (coreLoadExecutor-868-thread-1-processing-n:127.0.0.1:36152_) [n:127.0.0.1:36152_ c:collection1   x:collection1] o.a.s.s.OpenExchangeRatesOrgProvider Unknown key IMPORTANT NOTE
   [junit4]   2> 122452 WARN  (coreLoadExecutor-868-thread-1-processing-n:127.0.0.1:36152_) [n:127.0.0.1:36152_ c:collection1   x:collection1] o.a.s.s.OpenExchangeRatesOrgProvider Expected key, got STRING
   [junit4]   2> 122452 INFO  (coreLoadExecutor-868-thread-1-processing-n:127.0.0.1:36152_) [n:127.0.0.1:36152_ c:collection1   x:collection1] o.a.s.s.OpenExchangeRatesOrgProvider Reloading exchange rates from open-exchange-rates.json
   [junit4]   2> 122452 WARN  (coreLoadExecutor-868-thread-1-processing-n:127.0.0.1:36152_) [n:127.0.0.1:36152_ c:collection1   x:collection1] o.a.s.s.OpenExchangeRatesOrgProvider Unknown key IMPORTANT NOTE
   [junit4]   2> 122452 WARN  (coreLoadExecutor-868-thread-1-processing-n:127.0.0.1:36152_) [n:127.0.0.1:36152_ c:collection1   x:collection1] o.a.s.s.OpenExchangeRatesOrgProvider Expected key, got STRING
   [junit4]   2> 122453 INFO  (coreLoadExecutor-868-thread-1-processing-n:127.0.0.1:36152_) [n:127.0.0.1:36152_ c:collection1   x:collection1] o.a.s.c.CoreContainer Creating SolrCore 'collection1' using configuration from collection collection1
   [junit4]   2> 122453 INFO  (coreLoadExecutor-868-thread-1-processing-n:127.0.0.1:36152_) [n:127.0.0.1:36152_ c:collection1 s:shard1 r:core_node1 x:collection1] o.a.s.c.SolrCore org.apache.solr.core.MockDirectoryFactory
   [junit4]   2> 122453 INFO  (coreLoadExecutor-868-thread-1-processing-n:127.0.0.1:36152_) [n:127.0.0.1:36152_ c:collection1 s:shard1 r:core_node1 x:collection1] o.a.s.c.SolrCore [[collection1] ] Opening new SolrCore at [/home/jenkins/workspace/Lucene-Solr-trunk-Linux/solr/build/solr-core/test/J0/../../../../../../../../../home/jenkins/workspace/Lucene-Solr-trunk-Linux

[...truncated too long message...]

te closing IndexWriter with IndexWriterCloser
   [junit4]   2> 253174 INFO  (TEST-CollectionsAPIAsyncDistributedZkTest.testSolrJAPICalls-seed#[1A58B13484DE1995]) [n:127.0.0.1:36152_ c:testasynccollectioncreation s:shard1_1 r:core_node4 x:testasynccollectioncreation_shard1_1_replica1] o.a.s.c.SolrCore [testasynccollectioncreation_shard1_1_replica1] Closing main searcher on request.
   [junit4]   2> 253188 INFO  (TEST-CollectionsAPIAsyncDistributedZkTest.testSolrJAPICalls-seed#[1A58B13484DE1995]) [n:127.0.0.1:36152_ c:testasynccollectioncreation s:shard1_1 r:core_node4 x:testasynccollectioncreation_shard1_1_replica1] o.a.s.c.CachingDirectoryFactory Closing MockDirectoryFactory - 2 directories currently being tracked
   [junit4]   2> 253188 INFO  (TEST-CollectionsAPIAsyncDistributedZkTest.testSolrJAPICalls-seed#[1A58B13484DE1995]) [n:127.0.0.1:36152_ c:testasynccollectioncreation s:shard1_1 r:core_node4 x:testasynccollectioncreation_shard1_1_replica1] o.a.s.c.CachingDirectoryFactory looking to close /home/jenkins/workspace/Lucene-Solr-trunk-Linux/solr/build/solr-core/test/J0/../../../../../../../../../home/jenkins/workspace/Lucene-Solr-trunk-Linux/solr/build/solr-core/test/J0/temp/solr.cloud.CollectionsAPIAsyncDistributedZkTest 1A58B13484DE1995-001/shard-1-001/cores/testasynccollectioncreation_shard1_1_replica1/data/index [CachedDir<<refCount=0;path=/home/jenkins/workspace/Lucene-Solr-trunk-Linux/solr/build/solr-core/test/J0/../../../../../../../../../home/jenkins/workspace/Lucene-Solr-trunk-Linux/solr/build/solr-core/test/J0/temp/solr.cloud.CollectionsAPIAsyncDistributedZkTest 1A58B13484DE1995-001/shard-1-001/cores/testasynccollectioncreation_shard1_1_replica1/data/index;done=false>>]
   [junit4]   2> 253189 INFO  (TEST-CollectionsAPIAsyncDistributedZkTest.testSolrJAPICalls-seed#[1A58B13484DE1995]) [n:127.0.0.1:36152_ c:testasynccollectioncreation s:shard1_1 r:core_node4 x:testasynccollectioncreation_shard1_1_replica1] o.a.s.c.CachingDirectoryFactory Closing directory: /home/jenkins/workspace/Lucene-Solr-trunk-Linux/solr/build/solr-core/test/J0/../../../../../../../../../home/jenkins/workspace/Lucene-Solr-trunk-Linux/solr/build/solr-core/test/J0/temp/solr.cloud.CollectionsAPIAsyncDistributedZkTest 1A58B13484DE1995-001/shard-1-001/cores/testasynccollectioncreation_shard1_1_replica1/data/index
   [junit4]   2> 253189 INFO  (TEST-CollectionsAPIAsyncDistributedZkTest.testSolrJAPICalls-seed#[1A58B13484DE1995]) [n:127.0.0.1:36152_ c:testasynccollectioncreation s:shard1_1 r:core_node4 x:testasynccollectioncreation_shard1_1_replica1] o.a.s.c.CachingDirectoryFactory looking to close /home/jenkins/workspace/Lucene-Solr-trunk-Linux/solr/build/solr-core/test/J0/../../../../../../../../../home/jenkins/workspace/Lucene-Solr-trunk-Linux/solr/build/solr-core/test/J0/temp/solr.cloud.CollectionsAPIAsyncDistributedZkTest 1A58B13484DE1995-001/shard-1-001/cores/testasynccollectioncreation_shard1_1_replica1/data [CachedDir<<refCount=0;path=/home/jenkins/workspace/Lucene-Solr-trunk-Linux/solr/build/solr-core/test/J0/../../../../../../../../../home/jenkins/workspace/Lucene-Solr-trunk-Linux/solr/build/solr-core/test/J0/temp/solr.cloud.CollectionsAPIAsyncDistributedZkTest 1A58B13484DE1995-001/shard-1-001/cores/testasynccollectioncreation_shard1_1_replica1/data;done=false>>]
   [junit4]   2> 253189 INFO  (TEST-CollectionsAPIAsyncDistributedZkTest.testSolrJAPICalls-seed#[1A58B13484DE1995]) [n:127.0.0.1:36152_ c:testasynccollectioncreation s:shard1_1 r:core_node4 x:testasynccollectioncreation_shard1_1_replica1] o.a.s.c.CachingDirectoryFactory Closing directory: /home/jenkins/workspace/Lucene-Solr-trunk-Linux/solr/build/solr-core/test/J0/../../../../../../../../../home/jenkins/workspace/Lucene-Solr-trunk-Linux/solr/build/solr-core/test/J0/temp/solr.cloud.CollectionsAPIAsyncDistributedZkTest 1A58B13484DE1995-001/shard-1-001/cores/testasynccollectioncreation_shard1_1_replica1/data
   [junit4]   2> 253189 INFO  (TEST-CollectionsAPIAsyncDistributedZkTest.testSolrJAPICalls-seed#[1A58B13484DE1995]) [n:127.0.0.1:36152_ c:testasynccollectioncreation s:shard1_1 r:core_node4 x:testasynccollectioncreation_shard1_1_replica1] o.a.s.c.Overseer Overseer (id=93955431157727239-127.0.0.1:36152_-n_0000000001) closing
   [junit4]   2> 253190 INFO  (OverseerStateUpdate-93955431157727239-127.0.0.1:36152_-n_0000000001) [n:127.0.0.1:36152_    ] o.a.s.c.Overseer Overseer Loop exiting : 127.0.0.1:36152_
   [junit4]   2> 253191 WARN  (zkCallback-568-thread-3-processing-n:127.0.0.1:36152_) [n:127.0.0.1:36152_    ] o.a.s.c.c.ZkStateReader ZooKeeper watch triggered, but Solr cannot talk to ZK
   [junit4]   2> 253192 INFO  (TEST-CollectionsAPIAsyncDistributedZkTest.testSolrJAPICalls-seed#[1A58B13484DE1995]) [    ] o.e.j.s.ServerConnector Stopped ServerConnector@aab656{HTTP/1.1}{127.0.0.1:0}
   [junit4]   2> 253193 INFO  (TEST-CollectionsAPIAsyncDistributedZkTest.testSolrJAPICalls-seed#[1A58B13484DE1995]) [    ] o.e.j.s.h.ContextHandler Stopped o.e.j.s.ServletContextHandler@119ac8e{/,null,UNAVAILABLE}
   [junit4]   2> 253193 INFO  (TEST-CollectionsAPIAsyncDistributedZkTest.testSolrJAPICalls-seed#[1A58B13484DE1995]) [n:127.0.0.1:36152_ c:testasynccollectioncreation s:shard1_1 r:core_node4 x:testasynccollectioncreation_shard1_1_replica1] o.a.s.c.ZkTestServer connecting to 127.0.0.1:33820 33820
   [junit4]   2> 253200 INFO  (Thread-465) [    ] o.a.s.c.ZkTestServer connecting to 127.0.0.1:33820 33820
   [junit4]   2> 253200 WARN  (Thread-465) [    ] o.a.s.c.ZkTestServer Watch limit violations: 
   [junit4]   2> Maximum concurrent create/delete watches above limit:
   [junit4]   2> 
   [junit4]   2> 	3	/solr/aliases.json
   [junit4]   2> 	3	/solr/clusterstate.json
   [junit4]   2> 	2	/solr/configs/conf1
   [junit4]   2> 	2	/solr/collections/testasynccollectioncreation/state.json
   [junit4]   2> 
   [junit4]   2> Maximum concurrent children watches above limit:
   [junit4]   2> 
   [junit4]   2> 	3	/solr/live_nodes
   [junit4]   2> 	2	/solr/overseer/queue
   [junit4]   2> 	2	/solr/overseer/collection-queue-work
   [junit4]   2> 
   [junit4]   2> NOTE: reproduce with: ant test  -Dtestcase=CollectionsAPIAsyncDistributedZkTest -Dtests.method=testSolrJAPICalls -Dtests.seed=1A58B13484DE1995 -Dtests.multiplier=3 -Dtests.slow=true -Dtests.locale=de_LU -Dtests.timezone=Pacific/Yap -Dtests.asserts=true -Dtests.file.encoding=ISO-8859-1
   [junit4] FAILURE  135s J0 | CollectionsAPIAsyncDistributedZkTest.testSolrJAPICalls <<<
   [junit4]    > Throwable #1: org.junit.ComparisonFailure: Shard split did not complete. Last recorded state: running expected:<[completed]> but was:<[running]>
   [junit4]    > 	at __randomizedtesting.SeedInfo.seed([1A58B13484DE1995:423C3D5582B4B141]:0)
   [junit4]    > 	at org.apache.solr.cloud.CollectionsAPIAsyncDistributedZkTest.testSolrJAPICalls(CollectionsAPIAsyncDistributedZkTest.java:90)
   [junit4]    > 	at org.apache.solr.BaseDistributedSearchTestCase$ShardsRepeatRule$ShardsFixedStatement.callStatement(BaseDistributedSearchTestCase.java:960)
   [junit4]    > 	at org.apache.solr.BaseDistributedSearchTestCase$ShardsRepeatRule$ShardsStatement.evaluate(BaseDistributedSearchTestCase.java:935)
   [junit4]    > 	at java.lang.Thread.run(Thread.java:745)
   [junit4]   2> 253211 INFO  (SUITE-CollectionsAPIAsyncDistributedZkTest-seed#[1A58B13484DE1995]-worker) [n:127.0.0.1:36152_ c:testasynccollectioncreation s:shard1_1 r:core_node4 x:testasynccollectioncreation_shard1_1_replica1] o.a.s.SolrTestCaseJ4 ###deleteCore
   [junit4]   2> NOTE: leaving temporary files on disk at: /home/jenkins/workspace/Lucene-Solr-trunk-Linux/solr/build/solr-core/test/J0/temp/solr.cloud.CollectionsAPIAsyncDistributedZkTest 1A58B13484DE1995-001
   [junit4]   2> Jun 07, 2015 3:04:00 AM com.carrotsearch.randomizedtesting.ThreadLeakControl checkThreadLeaks
   [junit4]   2> WARNING: Will linger awaiting termination of 2 leaked thread(s).
   [junit4]   2> NOTE: test params are: codec=Asserting(Lucene50): {}, docValues:{}, sim=RandomSimilarityProvider(queryNorm=true,coord=crazy): {}, locale=de_LU, timezone=Pacific/Yap
   [junit4]   2> NOTE: Linux 3.13.0-53-generic i386/Oracle Corporation 1.9.0-ea (32-bit)/cpus=12,threads=1,free=144438768,total=281018368
   [junit4]   2> NOTE: All tests run in this JVM: [TestRandomDVFaceting, SignatureUpdateProcessorFactoryTest, IndexBasedSpellCheckerTest, TestRandomFaceting, DateFieldTest, TestJmxMonitoredMap, HdfsBasicDistributedZkTest, RecoveryAfterSoftCommitTest, QueryElevationComponentTest, DistributedFacetPivotSmallAdvancedTest, HighlighterConfigTest, TestSolrConfigHandlerCloud, CollectionsAPIAsyncDistributedZkTest]
   [junit4] Completed [85/506] on J0 in 135.88s, 1 test, 1 failure <<< FAILURES!

[...truncated 1298 lines...]
BUILD FAILED
/home/jenkins/workspace/Lucene-Solr-trunk-Linux/build.xml:526: The following error occurred while executing this line:
/home/jenkins/workspace/Lucene-Solr-trunk-Linux/build.xml:474: The following error occurred while executing this line:
/home/jenkins/workspace/Lucene-Solr-trunk-Linux/build.xml:61: The following error occurred while executing this line:
/home/jenkins/workspace/Lucene-Solr-trunk-Linux/extra-targets.xml:39: The following error occurred while executing this line:
/home/jenkins/workspace/Lucene-Solr-trunk-Linux/solr/build.xml:230: The following error occurred while executing this line:
/home/jenkins/workspace/Lucene-Solr-trunk-Linux/solr/common-build.xml:512: The following error occurred while executing this line:
/home/jenkins/workspace/Lucene-Solr-trunk-Linux/lucene/common-build.xml:1418: The following error occurred while executing this line:
/home/jenkins/workspace/Lucene-Solr-trunk-Linux/lucene/common-build.xml:973: There were test failures: 506 suites, 1990 tests, 1 failure, 58 ignored (25 assumptions)

Total time: 46 minutes 29 seconds
Build step 'Invoke Ant' marked build as failure
Archiving artifacts
Recording test results
Email was triggered for: Failure - Any
Sending email for trigger: Failure - Any



Mime
View raw message