lucene-dev mailing list archives

Site index · List index
Message view « Date » · « Thread »
Top « Date » · « Thread »
From Policeman Jenkins Server <jenk...@thetaphi.de>
Subject [JENKINS] Lucene-Solr-trunk-Linux (64bit/jdk1.9.0-ea-b60) - Build # 13272 - Failure!
Date Tue, 30 Jun 2015 19:35:21 GMT
Build: http://jenkins.thetaphi.de/job/Lucene-Solr-trunk-Linux/13272/
Java: 64bit/jdk1.9.0-ea-b60 -XX:-UseCompressedOops -XX:+UseParallelGC

1 tests failed.
FAILED:  org.apache.solr.cloud.BasicDistributedZkTest.test

Error Message:
commitWithin did not work on node: http://127.0.0.1:48815/collection1 expected:<68> but was:<67>

Stack Trace:
java.lang.AssertionError: commitWithin did not work on node: http://127.0.0.1:48815/collection1 expected:<68> but was:<67>
	at __randomizedtesting.SeedInfo.seed([EB42BF33E64AC3B0:631680E948B6AE48]:0)
	at org.junit.Assert.fail(Assert.java:93)
	at org.junit.Assert.failNotEquals(Assert.java:647)
	at org.junit.Assert.assertEquals(Assert.java:128)
	at org.junit.Assert.assertEquals(Assert.java:472)
	at org.apache.solr.cloud.BasicDistributedZkTest.test(BasicDistributedZkTest.java:332)
	at sun.reflect.NativeMethodAccessorImpl.invoke0(Native Method)
	at sun.reflect.NativeMethodAccessorImpl.invoke(NativeMethodAccessorImpl.java:62)
	at sun.reflect.DelegatingMethodAccessorImpl.invoke(DelegatingMethodAccessorImpl.java:43)
	at java.lang.reflect.Method.invoke(Method.java:502)
	at com.carrotsearch.randomizedtesting.RandomizedRunner.invoke(RandomizedRunner.java:1627)
	at com.carrotsearch.randomizedtesting.RandomizedRunner$6.evaluate(RandomizedRunner.java:836)
	at com.carrotsearch.randomizedtesting.RandomizedRunner$7.evaluate(RandomizedRunner.java:872)
	at com.carrotsearch.randomizedtesting.RandomizedRunner$8.evaluate(RandomizedRunner.java:886)
	at org.apache.solr.BaseDistributedSearchTestCase$ShardsRepeatRule$ShardsFixedStatement.callStatement(BaseDistributedSearchTestCase.java:960)
	at org.apache.solr.BaseDistributedSearchTestCase$ShardsRepeatRule$ShardsStatement.evaluate(BaseDistributedSearchTestCase.java:935)
	at com.carrotsearch.randomizedtesting.rules.SystemPropertiesRestoreRule$1.evaluate(SystemPropertiesRestoreRule.java:57)
	at org.apache.lucene.util.TestRuleSetupTeardownChained$1.evaluate(TestRuleSetupTeardownChained.java:50)
	at org.apache.lucene.util.AbstractBeforeAfterRule$1.evaluate(AbstractBeforeAfterRule.java:46)
	at org.apache.lucene.util.TestRuleThreadAndTestName$1.evaluate(TestRuleThreadAndTestName.java:49)
	at org.apache.lucene.util.TestRuleIgnoreAfterMaxFailures$1.evaluate(TestRuleIgnoreAfterMaxFailures.java:65)
	at org.apache.lucene.util.TestRuleMarkFailure$1.evaluate(TestRuleMarkFailure.java:48)
	at com.carrotsearch.randomizedtesting.rules.StatementAdapter.evaluate(StatementAdapter.java:36)
	at com.carrotsearch.randomizedtesting.ThreadLeakControl$StatementRunner.run(ThreadLeakControl.java:365)
	at com.carrotsearch.randomizedtesting.ThreadLeakControl.forkTimeoutingTask(ThreadLeakControl.java:798)
	at com.carrotsearch.randomizedtesting.ThreadLeakControl$3.evaluate(ThreadLeakControl.java:458)
	at com.carrotsearch.randomizedtesting.RandomizedRunner.runSingleTest(RandomizedRunner.java:845)
	at com.carrotsearch.randomizedtesting.RandomizedRunner$3.evaluate(RandomizedRunner.java:747)
	at com.carrotsearch.randomizedtesting.RandomizedRunner$4.evaluate(RandomizedRunner.java:781)
	at com.carrotsearch.randomizedtesting.RandomizedRunner$5.evaluate(RandomizedRunner.java:792)
	at com.carrotsearch.randomizedtesting.rules.StatementAdapter.evaluate(StatementAdapter.java:36)
	at com.carrotsearch.randomizedtesting.rules.SystemPropertiesRestoreRule$1.evaluate(SystemPropertiesRestoreRule.java:57)
	at org.apache.lucene.util.AbstractBeforeAfterRule$1.evaluate(AbstractBeforeAfterRule.java:46)
	at com.carrotsearch.randomizedtesting.rules.StatementAdapter.evaluate(StatementAdapter.java:36)
	at org.apache.lucene.util.TestRuleStoreClassName$1.evaluate(TestRuleStoreClassName.java:42)
	at com.carrotsearch.randomizedtesting.rules.NoShadowingOrOverridesOnMethodsRule$1.evaluate(NoShadowingOrOverridesOnMethodsRule.java:39)
	at com.carrotsearch.randomizedtesting.rules.NoShadowingOrOverridesOnMethodsRule$1.evaluate(NoShadowingOrOverridesOnMethodsRule.java:39)
	at com.carrotsearch.randomizedtesting.rules.StatementAdapter.evaluate(StatementAdapter.java:36)
	at com.carrotsearch.randomizedtesting.rules.StatementAdapter.evaluate(StatementAdapter.java:36)
	at com.carrotsearch.randomizedtesting.rules.StatementAdapter.evaluate(StatementAdapter.java:36)
	at org.apache.lucene.util.TestRuleAssertionsRequired$1.evaluate(TestRuleAssertionsRequired.java:54)
	at org.apache.lucene.util.TestRuleMarkFailure$1.evaluate(TestRuleMarkFailure.java:48)
	at org.apache.lucene.util.TestRuleIgnoreAfterMaxFailures$1.evaluate(TestRuleIgnoreAfterMaxFailures.java:65)
	at org.apache.lucene.util.TestRuleIgnoreTestSuites$1.evaluate(TestRuleIgnoreTestSuites.java:55)
	at com.carrotsearch.randomizedtesting.rules.StatementAdapter.evaluate(StatementAdapter.java:36)
	at com.carrotsearch.randomizedtesting.ThreadLeakControl$StatementRunner.run(ThreadLeakControl.java:365)
	at java.lang.Thread.run(Thread.java:745)




Build Log:
[...truncated 9550 lines...]
   [junit4] Suite: org.apache.solr.cloud.BasicDistributedZkTest
   [junit4]   2> Creating dataDir: /home/jenkins/workspace/Lucene-Solr-trunk-Linux/solr/build/solr-core/test/J0/temp/solr.cloud.BasicDistributedZkTest_EB42BF33E64AC3B0-001/init-core-data-001
   [junit4]   2> 43737 INFO  (SUITE-BasicDistributedZkTest-seed#[EB42BF33E64AC3B0]-worker) [    ] o.a.s.BaseDistributedSearchTestCase Setting hostContext system property: /
   [junit4]   2> 43740 INFO  (TEST-BasicDistributedZkTest.test-seed#[EB42BF33E64AC3B0]) [    ] o.a.s.c.ZkTestServer STARTING ZK TEST SERVER
   [junit4]   2> 43740 INFO  (Thread-187) [    ] o.a.s.c.ZkTestServer client port:0.0.0.0/0.0.0.0:0
   [junit4]   2> 43740 INFO  (Thread-187) [    ] o.a.s.c.ZkTestServer Starting server
   [junit4]   2> 43840 INFO  (TEST-BasicDistributedZkTest.test-seed#[EB42BF33E64AC3B0]) [    ] o.a.s.c.ZkTestServer start zk server on port:59133
   [junit4]   2> 43840 INFO  (TEST-BasicDistributedZkTest.test-seed#[EB42BF33E64AC3B0]) [    ] o.a.s.c.c.SolrZkClient Using default ZkCredentialsProvider
   [junit4]   2> 43841 INFO  (TEST-BasicDistributedZkTest.test-seed#[EB42BF33E64AC3B0]) [    ] o.a.s.c.c.ConnectionManager Waiting for client to connect to ZooKeeper
   [junit4]   2> 43844 INFO  (zkCallback-34-thread-1) [    ] o.a.s.c.c.ConnectionManager Watcher org.apache.solr.common.cloud.ConnectionManager@4bea2de7 name:ZooKeeperConnection Watcher:127.0.0.1:59133 got event WatchedEvent state:SyncConnected type:None path:null path:null type:None
   [junit4]   2> 43844 INFO  (TEST-BasicDistributedZkTest.test-seed#[EB42BF33E64AC3B0]) [    ] o.a.s.c.c.ConnectionManager Client is connected to ZooKeeper
   [junit4]   2> 43844 INFO  (TEST-BasicDistributedZkTest.test-seed#[EB42BF33E64AC3B0]) [    ] o.a.s.c.c.SolrZkClient Using default ZkACLProvider
   [junit4]   2> 43844 INFO  (TEST-BasicDistributedZkTest.test-seed#[EB42BF33E64AC3B0]) [    ] o.a.s.c.c.SolrZkClient makePath: /solr
   [junit4]   2> 43846 INFO  (TEST-BasicDistributedZkTest.test-seed#[EB42BF33E64AC3B0]) [    ] o.a.s.c.c.SolrZkClient Using default ZkCredentialsProvider
   [junit4]   2> 43846 INFO  (TEST-BasicDistributedZkTest.test-seed#[EB42BF33E64AC3B0]) [    ] o.a.s.c.c.ConnectionManager Waiting for client to connect to ZooKeeper
   [junit4]   2> 43848 INFO  (zkCallback-35-thread-1) [    ] o.a.s.c.c.ConnectionManager Watcher org.apache.solr.common.cloud.ConnectionManager@a33b6f3 name:ZooKeeperConnection Watcher:127.0.0.1:59133/solr got event WatchedEvent state:SyncConnected type:None path:null path:null type:None
   [junit4]   2> 43848 INFO  (TEST-BasicDistributedZkTest.test-seed#[EB42BF33E64AC3B0]) [    ] o.a.s.c.c.ConnectionManager Client is connected to ZooKeeper
   [junit4]   2> 43848 INFO  (TEST-BasicDistributedZkTest.test-seed#[EB42BF33E64AC3B0]) [    ] o.a.s.c.c.SolrZkClient Using default ZkACLProvider
   [junit4]   2> 43848 INFO  (TEST-BasicDistributedZkTest.test-seed#[EB42BF33E64AC3B0]) [    ] o.a.s.c.c.SolrZkClient makePath: /collections/collection1
   [junit4]   2> 43851 INFO  (TEST-BasicDistributedZkTest.test-seed#[EB42BF33E64AC3B0]) [    ] o.a.s.c.c.SolrZkClient makePath: /collections/collection1/shards
   [junit4]   2> 43852 INFO  (TEST-BasicDistributedZkTest.test-seed#[EB42BF33E64AC3B0]) [    ] o.a.s.c.c.SolrZkClient makePath: /collections/control_collection
   [junit4]   2> 43853 INFO  (TEST-BasicDistributedZkTest.test-seed#[EB42BF33E64AC3B0]) [    ] o.a.s.c.c.SolrZkClient makePath: /collections/control_collection/shards
   [junit4]   2> 43854 INFO  (TEST-BasicDistributedZkTest.test-seed#[EB42BF33E64AC3B0]) [    ] o.a.s.c.AbstractZkTestCase put /home/jenkins/workspace/Lucene-Solr-trunk-Linux/solr/core/src/test-files/solr/collection1/conf/solrconfig-tlog.xml to /configs/conf1/solrconfig.xml
   [junit4]   2> 43854 INFO  (TEST-BasicDistributedZkTest.test-seed#[EB42BF33E64AC3B0]) [    ] o.a.s.c.c.SolrZkClient makePath: /configs/conf1/solrconfig.xml
   [junit4]   2> 43856 INFO  (TEST-BasicDistributedZkTest.test-seed#[EB42BF33E64AC3B0]) [    ] o.a.s.c.AbstractZkTestCase put /home/jenkins/workspace/Lucene-Solr-trunk-Linux/solr/core/src/test-files/solr/collection1/conf/schema.xml to /configs/conf1/schema.xml
   [junit4]   2> 43856 INFO  (TEST-BasicDistributedZkTest.test-seed#[EB42BF33E64AC3B0]) [    ] o.a.s.c.c.SolrZkClient makePath: /configs/conf1/schema.xml
   [junit4]   2> 43858 INFO  (TEST-BasicDistributedZkTest.test-seed#[EB42BF33E64AC3B0]) [    ] o.a.s.c.AbstractZkTestCase put /home/jenkins/workspace/Lucene-Solr-trunk-Linux/solr/core/src/test-files/solr/collection1/conf/solrconfig.snippet.randomindexconfig.xml to /configs/conf1/solrconfig.snippet.randomindexconfig.xml
   [junit4]   2> 43858 INFO  (TEST-BasicDistributedZkTest.test-seed#[EB42BF33E64AC3B0]) [    ] o.a.s.c.c.SolrZkClient makePath: /configs/conf1/solrconfig.snippet.randomindexconfig.xml
   [junit4]   2> 43860 INFO  (TEST-BasicDistributedZkTest.test-seed#[EB42BF33E64AC3B0]) [    ] o.a.s.c.AbstractZkTestCase put /home/jenkins/workspace/Lucene-Solr-trunk-Linux/solr/core/src/test-files/solr/collection1/conf/stopwords.txt to /configs/conf1/stopwords.txt
   [junit4]   2> 43860 INFO  (TEST-BasicDistributedZkTest.test-seed#[EB42BF33E64AC3B0]) [    ] o.a.s.c.c.SolrZkClient makePath: /configs/conf1/stopwords.txt
   [junit4]   2> 43861 INFO  (TEST-BasicDistributedZkTest.test-seed#[EB42BF33E64AC3B0]) [    ] o.a.s.c.AbstractZkTestCase put /home/jenkins/workspace/Lucene-Solr-trunk-Linux/solr/core/src/test-files/solr/collection1/conf/protwords.txt to /configs/conf1/protwords.txt
   [junit4]   2> 43862 INFO  (TEST-BasicDistributedZkTest.test-seed#[EB42BF33E64AC3B0]) [    ] o.a.s.c.c.SolrZkClient makePath: /configs/conf1/protwords.txt
   [junit4]   2> 43862 INFO  (TEST-BasicDistributedZkTest.test-seed#[EB42BF33E64AC3B0]) [    ] o.a.s.c.AbstractZkTestCase put /home/jenkins/workspace/Lucene-Solr-trunk-Linux/solr/core/src/test-files/solr/collection1/conf/currency.xml to /configs/conf1/currency.xml
   [junit4]   2> 43862 INFO  (TEST-BasicDistributedZkTest.test-seed#[EB42BF33E64AC3B0]) [    ] o.a.s.c.c.SolrZkClient makePath: /configs/conf1/currency.xml
   [junit4]   2> 43863 INFO  (TEST-BasicDistributedZkTest.test-seed#[EB42BF33E64AC3B0]) [    ] o.a.s.c.AbstractZkTestCase put /home/jenkins/workspace/Lucene-Solr-trunk-Linux/solr/core/src/test-files/solr/collection1/conf/enumsConfig.xml to /configs/conf1/enumsConfig.xml
   [junit4]   2> 43863 INFO  (TEST-BasicDistributedZkTest.test-seed#[EB42BF33E64AC3B0]) [    ] o.a.s.c.c.SolrZkClient makePath: /configs/conf1/enumsConfig.xml
   [junit4]   2> 43864 INFO  (TEST-BasicDistributedZkTest.test-seed#[EB42BF33E64AC3B0]) [    ] o.a.s.c.AbstractZkTestCase put /home/jenkins/workspace/Lucene-Solr-trunk-Linux/solr/core/src/test-files/solr/collection1/conf/open-exchange-rates.json to /configs/conf1/open-exchange-rates.json
   [junit4]   2> 43864 INFO  (TEST-BasicDistributedZkTest.test-seed#[EB42BF33E64AC3B0]) [    ] o.a.s.c.c.SolrZkClient makePath: /configs/conf1/open-exchange-rates.json
   [junit4]   2> 43865 INFO  (TEST-BasicDistributedZkTest.test-seed#[EB42BF33E64AC3B0]) [    ] o.a.s.c.AbstractZkTestCase put /home/jenkins/workspace/Lucene-Solr-trunk-Linux/solr/core/src/test-files/solr/collection1/conf/mapping-ISOLatin1Accent.txt to /configs/conf1/mapping-ISOLatin1Accent.txt
   [junit4]   2> 43865 INFO  (TEST-BasicDistributedZkTest.test-seed#[EB42BF33E64AC3B0]) [    ] o.a.s.c.c.SolrZkClient makePath: /configs/conf1/mapping-ISOLatin1Accent.txt
   [junit4]   2> 43866 INFO  (TEST-BasicDistributedZkTest.test-seed#[EB42BF33E64AC3B0]) [    ] o.a.s.c.AbstractZkTestCase put /home/jenkins/workspace/Lucene-Solr-trunk-Linux/solr/core/src/test-files/solr/collection1/conf/old_synonyms.txt to /configs/conf1/old_synonyms.txt
   [junit4]   2> 43866 INFO  (TEST-BasicDistributedZkTest.test-seed#[EB42BF33E64AC3B0]) [    ] o.a.s.c.c.SolrZkClient makePath: /configs/conf1/old_synonyms.txt
   [junit4]   2> 43867 INFO  (TEST-BasicDistributedZkTest.test-seed#[EB42BF33E64AC3B0]) [    ] o.a.s.c.AbstractZkTestCase put /home/jenkins/workspace/Lucene-Solr-trunk-Linux/solr/core/src/test-files/solr/collection1/conf/synonyms.txt to /configs/conf1/synonyms.txt
   [junit4]   2> 43867 INFO  (TEST-BasicDistributedZkTest.test-seed#[EB42BF33E64AC3B0]) [    ] o.a.s.c.c.SolrZkClient makePath: /configs/conf1/synonyms.txt
   [junit4]   2> 43914 INFO  (TEST-BasicDistributedZkTest.test-seed#[EB42BF33E64AC3B0]) [    ] o.a.s.SolrTestCaseJ4 Writing core.properties file to /home/jenkins/workspace/Lucene-Solr-trunk-Linux/solr/build/solr-core/test/J0/temp/solr.cloud.BasicDistributedZkTest_EB42BF33E64AC3B0-001/control-001/cores/collection1
   [junit4]   2> 43915 INFO  (TEST-BasicDistributedZkTest.test-seed#[EB42BF33E64AC3B0]) [    ] o.e.j.s.Server jetty-9.2.11.v20150529
   [junit4]   2> 43917 INFO  (TEST-BasicDistributedZkTest.test-seed#[EB42BF33E64AC3B0]) [    ] o.e.j.s.h.ContextHandler Started o.e.j.s.ServletContextHandler@6a8d3858{/,null,AVAILABLE}
   [junit4]   2> 43923 INFO  (TEST-BasicDistributedZkTest.test-seed#[EB42BF33E64AC3B0]) [    ] o.e.j.s.ServerConnector Started ServerConnector@6c330215{HTTP/1.1}{127.0.0.1:41328}
   [junit4]   2> 43923 INFO  (TEST-BasicDistributedZkTest.test-seed#[EB42BF33E64AC3B0]) [    ] o.e.j.s.Server Started @45463ms
   [junit4]   2> 43923 INFO  (TEST-BasicDistributedZkTest.test-seed#[EB42BF33E64AC3B0]) [    ] o.a.s.c.s.e.JettySolrRunner Jetty properties: {solr.data.dir=/home/jenkins/workspace/Lucene-Solr-trunk-Linux/solr/build/solr-core/test/J0/temp/solr.cloud.BasicDistributedZkTest_EB42BF33E64AC3B0-001/tempDir-001/control/data, hostContext=/, hostPort=41328, coreRootDirectory=/home/jenkins/workspace/Lucene-Solr-trunk-Linux/solr/build/solr-core/test/J0/temp/solr.cloud.BasicDistributedZkTest_EB42BF33E64AC3B0-001/control-001/cores}
   [junit4]   2> 43924 INFO  (TEST-BasicDistributedZkTest.test-seed#[EB42BF33E64AC3B0]) [    ] o.a.s.s.SolrDispatchFilter SolrDispatchFilter.init(): sun.misc.Launcher$AppClassLoader@45fe3ee3
   [junit4]   2> 43924 INFO  (TEST-BasicDistributedZkTest.test-seed#[EB42BF33E64AC3B0]) [    ] o.a.s.c.SolrResourceLoader new SolrResourceLoader for directory: '/home/jenkins/workspace/Lucene-Solr-trunk-Linux/solr/build/solr-core/test/J0/temp/solr.cloud.BasicDistributedZkTest_EB42BF33E64AC3B0-001/control-001/'
   [junit4]   2> 43937 INFO  (TEST-BasicDistributedZkTest.test-seed#[EB42BF33E64AC3B0]) [    ] o.a.s.c.SolrXmlConfig Loading container configuration from /home/jenkins/workspace/Lucene-Solr-trunk-Linux/solr/build/solr-core/test/J0/temp/solr.cloud.BasicDistributedZkTest_EB42BF33E64AC3B0-001/control-001/solr.xml
   [junit4]   2> 43944 INFO  (TEST-BasicDistributedZkTest.test-seed#[EB42BF33E64AC3B0]) [    ] o.a.s.c.CoresLocator Config-defined core root directory: /home/jenkins/workspace/Lucene-Solr-trunk-Linux/solr/build/solr-core/test/J0/temp/solr.cloud.BasicDistributedZkTest_EB42BF33E64AC3B0-001/control-001/cores
   [junit4]   2> 43945 INFO  (TEST-BasicDistributedZkTest.test-seed#[EB42BF33E64AC3B0]) [    ] o.a.s.c.CoreContainer New CoreContainer 1110918612
   [junit4]   2> 43945 INFO  (TEST-BasicDistributedZkTest.test-seed#[EB42BF33E64AC3B0]) [    ] o.a.s.c.CoreContainer Loading cores into CoreContainer [instanceDir=/home/jenkins/workspace/Lucene-Solr-trunk-Linux/solr/build/solr-core/test/J0/temp/solr.cloud.BasicDistributedZkTest_EB42BF33E64AC3B0-001/control-001/]
   [junit4]   2> 43945 INFO  (TEST-BasicDistributedZkTest.test-seed#[EB42BF33E64AC3B0]) [    ] o.a.s.c.CoreContainer loading shared library: /home/jenkins/workspace/Lucene-Solr-trunk-Linux/solr/build/solr-core/test/J0/temp/solr.cloud.BasicDistributedZkTest_EB42BF33E64AC3B0-001/control-001/lib
   [junit4]   2> 43945 WARN  (TEST-BasicDistributedZkTest.test-seed#[EB42BF33E64AC3B0]) [    ] o.a.s.c.SolrResourceLoader Can't find (or read) directory to add to classloader: lib (resolved as: /home/jenkins/workspace/Lucene-Solr-trunk-Linux/solr/build/solr-core/test/J0/temp/solr.cloud.BasicDistributedZkTest_EB42BF33E64AC3B0-001/control-001/lib).
   [junit4]   2> 43952 INFO  (TEST-BasicDistributedZkTest.test-seed#[EB42BF33E64AC3B0]) [    ] o.a.s.h.c.HttpShardHandlerFactory created with socketTimeout : 90000,urlScheme : ,connTimeout : 15000,maxConnectionsPerHost : 20,maxConnections : 10000,corePoolSize : 0,maximumPoolSize : 2147483647,maxThreadIdleTime : 5,sizeOfQueue : -1,fairnessPolicy : false,useRetries : false,
   [junit4]   2> 43954 INFO  (TEST-BasicDistributedZkTest.test-seed#[EB42BF33E64AC3B0]) [    ] o.a.s.u.UpdateShardHandler Creating UpdateShardHandler HTTP client with params: socketTimeout=340000&connTimeout=45000&retry=true
   [junit4]   2> 43955 INFO  (TEST-BasicDistributedZkTest.test-seed#[EB42BF33E64AC3B0]) [    ] o.a.s.l.LogWatcher SLF4J impl is org.slf4j.impl.Log4jLoggerFactory
   [junit4]   2> 43955 INFO  (TEST-BasicDistributedZkTest.test-seed#[EB42BF33E64AC3B0]) [    ] o.a.s.l.LogWatcher Registering Log Listener [Log4j (org.slf4j.impl.Log4jLoggerFactory)]
   [junit4]   2> 43956 INFO  (TEST-BasicDistributedZkTest.test-seed#[EB42BF33E64AC3B0]) [    ] o.a.s.c.ZkContainer Zookeeper client=127.0.0.1:59133/solr
   [junit4]   2> 43956 INFO  (TEST-BasicDistributedZkTest.test-seed#[EB42BF33E64AC3B0]) [    ] o.a.s.c.ZkController zkHost includes chroot
   [junit4]   2> 43956 INFO  (TEST-BasicDistributedZkTest.test-seed#[EB42BF33E64AC3B0]) [    ] o.a.s.c.c.SolrZkClient Using default ZkCredentialsProvider
   [junit4]   2> 43956 INFO  (TEST-BasicDistributedZkTest.test-seed#[EB42BF33E64AC3B0]) [    ] o.a.s.c.c.ConnectionManager Waiting for client to connect to ZooKeeper
   [junit4]   2> 43958 INFO  (zkCallback-37-thread-1) [    ] o.a.s.c.c.ConnectionManager Watcher org.apache.solr.common.cloud.ConnectionManager@340633f3 name:ZooKeeperConnection Watcher:127.0.0.1:59133 got event WatchedEvent state:SyncConnected type:None path:null path:null type:None
   [junit4]   2> 43958 INFO  (TEST-BasicDistributedZkTest.test-seed#[EB42BF33E64AC3B0]) [    ] o.a.s.c.c.ConnectionManager Client is connected to ZooKeeper
   [junit4]   2> 43958 INFO  (TEST-BasicDistributedZkTest.test-seed#[EB42BF33E64AC3B0]) [    ] o.a.s.c.c.SolrZkClient Using default ZkACLProvider
   [junit4]   2> 43960 INFO  (TEST-BasicDistributedZkTest.test-seed#[EB42BF33E64AC3B0]) [n:127.0.0.1:41328_    ] o.a.s.c.c.ConnectionManager Waiting for client to connect to ZooKeeper
   [junit4]   2> 43961 INFO  (zkCallback-38-thread-1-processing-n:127.0.0.1:41328_) [n:127.0.0.1:41328_    ] o.a.s.c.c.ConnectionManager Watcher org.apache.solr.common.cloud.ConnectionManager@13e017bb name:ZooKeeperConnection Watcher:127.0.0.1:59133/solr got event WatchedEvent state:SyncConnected type:None path:null path:null type:None
   [junit4]   2> 43961 INFO  (TEST-BasicDistributedZkTest.test-seed#[EB42BF33E64AC3B0]) [n:127.0.0.1:41328_    ] o.a.s.c.c.ConnectionManager Client is connected to ZooKeeper
   [junit4]   2> 43962 INFO  (TEST-BasicDistributedZkTest.test-seed#[EB42BF33E64AC3B0]) [n:127.0.0.1:41328_    ] o.a.s.c.c.SolrZkClient makePath: /overseer/queue
   [junit4]   2> 43963 INFO  (TEST-BasicDistributedZkTest.test-seed#[EB42BF33E64AC3B0]) [n:127.0.0.1:41328_    ] o.a.s.c.c.SolrZkClient makePath: /overseer/collection-queue-work
   [junit4]   2> 43964 INFO  (TEST-BasicDistributedZkTest.test-seed#[EB42BF33E64AC3B0]) [n:127.0.0.1:41328_    ] o.a.s.c.c.SolrZkClient makePath: /overseer/collection-map-running
   [junit4]   2> 43969 INFO  (TEST-BasicDistributedZkTest.test-seed#[EB42BF33E64AC3B0]) [n:127.0.0.1:41328_    ] o.a.s.c.c.SolrZkClient makePath: /overseer/collection-map-completed
   [junit4]   2> 43970 INFO  (TEST-BasicDistributedZkTest.test-seed#[EB42BF33E64AC3B0]) [n:127.0.0.1:41328_    ] o.a.s.c.c.SolrZkClient makePath: /overseer/collection-map-failure
   [junit4]   2> 43971 INFO  (TEST-BasicDistributedZkTest.test-seed#[EB42BF33E64AC3B0]) [n:127.0.0.1:41328_    ] o.a.s.c.c.SolrZkClient makePath: /live_nodes
   [junit4]   2> 43973 INFO  (TEST-BasicDistributedZkTest.test-seed#[EB42BF33E64AC3B0]) [n:127.0.0.1:41328_    ] o.a.s.c.c.SolrZkClient makePath: /aliases.json
   [junit4]   2> 43973 INFO  (TEST-BasicDistributedZkTest.test-seed#[EB42BF33E64AC3B0]) [n:127.0.0.1:41328_    ] o.a.s.c.c.SolrZkClient makePath: /clusterstate.json
   [junit4]   2> 43974 INFO  (TEST-BasicDistributedZkTest.test-seed#[EB42BF33E64AC3B0]) [n:127.0.0.1:41328_    ] o.a.s.c.ZkController Register node as live in ZooKeeper:/live_nodes/127.0.0.1:41328_
   [junit4]   2> 43975 INFO  (TEST-BasicDistributedZkTest.test-seed#[EB42BF33E64AC3B0]) [n:127.0.0.1:41328_    ] o.a.s.c.c.SolrZkClient makePath: /live_nodes/127.0.0.1:41328_
   [junit4]   2> 43976 INFO  (TEST-BasicDistributedZkTest.test-seed#[EB42BF33E64AC3B0]) [n:127.0.0.1:41328_    ] o.a.s.c.c.SolrZkClient makePath: /overseer_elect
   [junit4]   2> 43977 INFO  (TEST-BasicDistributedZkTest.test-seed#[EB42BF33E64AC3B0]) [n:127.0.0.1:41328_    ] o.a.s.c.c.SolrZkClient makePath: /overseer_elect/election
   [junit4]   2> 43978 INFO  (TEST-BasicDistributedZkTest.test-seed#[EB42BF33E64AC3B0]) [n:127.0.0.1:41328_    ] o.a.s.c.Overseer Overseer (id=null) closing
   [junit4]   2> 43978 INFO  (TEST-BasicDistributedZkTest.test-seed#[EB42BF33E64AC3B0]) [n:127.0.0.1:41328_    ] o.a.s.c.LeaderElector Joined leadership election with path: /overseer_elect/election/94089479012745219-127.0.0.1:41328_-n_0000000000
   [junit4]   2> 43980 INFO  (TEST-BasicDistributedZkTest.test-seed#[EB42BF33E64AC3B0]) [n:127.0.0.1:41328_    ] o.a.s.c.OverseerElectionContext I am going to be the leader 127.0.0.1:41328_
   [junit4]   2> 43980 INFO  (TEST-BasicDistributedZkTest.test-seed#[EB42BF33E64AC3B0]) [n:127.0.0.1:41328_    ] o.a.s.c.c.SolrZkClient makePath: /overseer_elect/leader
   [junit4]   2> 43981 INFO  (TEST-BasicDistributedZkTest.test-seed#[EB42BF33E64AC3B0]) [n:127.0.0.1:41328_    ] o.a.s.c.Overseer Overseer (id=94089479012745219-127.0.0.1:41328_-n_0000000000) starting
   [junit4]   2> 43982 INFO  (TEST-BasicDistributedZkTest.test-seed#[EB42BF33E64AC3B0]) [n:127.0.0.1:41328_    ] o.a.s.c.c.SolrZkClient makePath: /overseer/queue-work
   [junit4]   2> 43988 INFO  (TEST-BasicDistributedZkTest.test-seed#[EB42BF33E64AC3B0]) [n:127.0.0.1:41328_    ] o.a.s.c.OverseerAutoReplicaFailoverThread Starting OverseerAutoReplicaFailoverThread autoReplicaFailoverWorkLoopDelay=10000 autoReplicaFailoverWaitAfterExpiration=30000 autoReplicaFailoverBadNodeExpiration=60000
   [junit4]   2> 43989 INFO  (OverseerCollectionProcessor-94089479012745219-127.0.0.1:41328_-n_0000000000) [n:127.0.0.1:41328_    ] o.a.s.c.OverseerCollectionProcessor Process current queue of collection creations
   [junit4]   2> 43989 INFO  (TEST-BasicDistributedZkTest.test-seed#[EB42BF33E64AC3B0]) [n:127.0.0.1:41328_    ] o.a.s.c.c.ZkStateReader Updating cluster state from ZooKeeper... 
   [junit4]   2> 43989 INFO  (OverseerStateUpdate-94089479012745219-127.0.0.1:41328_-n_0000000000) [n:127.0.0.1:41328_    ] o.a.s.c.Overseer Starting to work on the main queue
   [junit4]   2> 43993 INFO  (TEST-BasicDistributedZkTest.test-seed#[EB42BF33E64AC3B0]) [n:127.0.0.1:41328_    ] o.a.s.c.CoreContainer No authentication plugin used.
   [junit4]   2> 43993 INFO  (TEST-BasicDistributedZkTest.test-seed#[EB42BF33E64AC3B0]) [n:127.0.0.1:41328_    ] o.a.s.c.CoreContainer Security conf doesn't exist. Skipping setup for authorization module.
   [junit4]   2> 43995 INFO  (TEST-BasicDistributedZkTest.test-seed#[EB42BF33E64AC3B0]) [n:127.0.0.1:41328_    ] o.a.s.c.CoresLocator Looking for core definitions underneath /home/jenkins/workspace/Lucene-Solr-trunk-Linux/solr/build/solr-core/test/J0/temp/solr.cloud.BasicDistributedZkTest_EB42BF33E64AC3B0-001/control-001/cores
   [junit4]   2> 43996 INFO  (TEST-BasicDistributedZkTest.test-seed#[EB42BF33E64AC3B0]) [n:127.0.0.1:41328_    ] o.a.s.c.SolrCore Created CoreDescriptor: {name=collection1, config=solrconfig.xml, transient=false, schema=schema.xml, loadOnStartup=true, instanceDir=/home/jenkins/workspace/Lucene-Solr-trunk-Linux/solr/build/solr-core/test/J0/temp/solr.cloud.BasicDistributedZkTest_EB42BF33E64AC3B0-001/control-001/cores/collection1, collection=control_collection, absoluteInstDir=/home/jenkins/workspace/Lucene-Solr-trunk-Linux/solr/build/solr-core/test/J0/temp/solr.cloud.BasicDistributedZkTest_EB42BF33E64AC3B0-001/control-001/cores/collection1/, coreNodeName=, dataDir=data/, shard=}
   [junit4]   2> 43996 INFO  (TEST-BasicDistributedZkTest.test-seed#[EB42BF33E64AC3B0]) [n:127.0.0.1:41328_    ] o.a.s.c.CoresLocator Found core collection1 in /home/jenkins/workspace/Lucene-Solr-trunk-Linux/solr/build/solr-core/test/J0/temp/solr.cloud.BasicDistributedZkTest_EB42BF33E64AC3B0-001/control-001/cores/collection1/
   [junit4]   2> 43996 INFO  (TEST-BasicDistributedZkTest.test-seed#[EB42BF33E64AC3B0]) [n:127.0.0.1:41328_    ] o.a.s.c.CoresLocator Found 1 core definitions
   [junit4]   2> 43999 INFO  (TEST-BasicDistributedZkTest.test-seed#[EB42BF33E64AC3B0]) [n:127.0.0.1:41328_    ] o.a.s.s.SolrDispatchFilter user.dir=/home/jenkins/workspace/Lucene-Solr-trunk-Linux/solr/build/solr-core/test/J0
   [junit4]   2> 43999 INFO  (TEST-BasicDistributedZkTest.test-seed#[EB42BF33E64AC3B0]) [n:127.0.0.1:41328_    ] o.a.s.s.SolrDispatchFilter SolrDispatchFilter.init() done
   [junit4]   2> 43999 INFO  (coreLoadExecutor-197-thread-1-processing-n:127.0.0.1:41328_) [n:127.0.0.1:41328_ c:control_collection   x:collection1] o.a.s.c.ZkController publishing state=down
   [junit4]   2> 44000 INFO  (coreLoadExecutor-197-thread-1-processing-n:127.0.0.1:41328_) [n:127.0.0.1:41328_ c:control_collection   x:collection1] o.a.s.c.ZkController numShards not found on descriptor - reading it from system property
   [junit4]   2> 44000 INFO  (zkCallback-38-thread-1-processing-n:127.0.0.1:41328_) [n:127.0.0.1:41328_    ] o.a.s.c.DistributedQueue NodeChildrenChanged fired on path /overseer/queue state SyncConnected
   [junit4]   2> 44001 INFO  (coreLoadExecutor-197-thread-1-processing-n:127.0.0.1:41328_) [n:127.0.0.1:41328_ c:control_collection   x:collection1] o.a.s.c.ZkController look for our core node name
   [junit4]   2> 44001 INFO  (OverseerStateUpdate-94089479012745219-127.0.0.1:41328_-n_0000000000) [n:127.0.0.1:41328_    ] o.a.s.c.Overseer processMessage: queueSize: 1, message = {
   [junit4]   2>   "core":"collection1",
   [junit4]   2>   "roles":null,
   [junit4]   2>   "base_url":"http://127.0.0.1:41328",
   [junit4]   2>   "node_name":"127.0.0.1:41328_",
   [junit4]   2>   "numShards":"1",
   [junit4]   2>   "state":"down",
   [junit4]   2>   "shard":null,
   [junit4]   2>   "collection":"control_collection",
   [junit4]   2>   "operation":"state"} current state version: 0
   [junit4]   2> 44001 INFO  (OverseerStateUpdate-94089479012745219-127.0.0.1:41328_-n_0000000000) [n:127.0.0.1:41328_    ] o.a.s.c.o.ReplicaMutator Update state numShards=1 message={
   [junit4]   2>   "core":"collection1",
   [junit4]   2>   "roles":null,
   [junit4]   2>   "base_url":"http://127.0.0.1:41328",
   [junit4]   2>   "node_name":"127.0.0.1:41328_",
   [junit4]   2>   "numShards":"1",
   [junit4]   2>   "state":"down",
   [junit4]   2>   "shard":null,
   [junit4]   2>   "collection":"control_collection",
   [junit4]   2>   "operation":"state"}
   [junit4]   2> 44002 INFO  (OverseerStateUpdate-94089479012745219-127.0.0.1:41328_-n_0000000000) [n:127.0.0.1:41328_    ] o.a.s.c.o.ClusterStateMutator building a new cName: control_collection
   [junit4]   2> 44002 INFO  (OverseerStateUpdate-94089479012745219-127.0.0.1:41328_-n_0000000000) [n:127.0.0.1:41328_    ] o.a.s.c.o.ReplicaMutator Assigning new node to shard shard=shard1
   [junit4]   2> 44003 INFO  (zkCallback-38-thread-1-processing-n:127.0.0.1:41328_) [n:127.0.0.1:41328_    ] o.a.s.c.c.ZkStateReader A cluster state change: WatchedEvent state:SyncConnected type:NodeDataChanged path:/clusterstate.json, has occurred - updating... (live nodes size: 1)
   [junit4]   2> 44004 INFO  (zkCallback-38-thread-1-processing-n:127.0.0.1:41328_) [n:127.0.0.1:41328_    ] o.a.s.c.c.ZkStateReader Updated cluster state version to 1
   [junit4]   2> 45001 INFO  (coreLoadExecutor-197-thread-1-processing-n:127.0.0.1:41328_) [n:127.0.0.1:41328_ c:control_collection   x:collection1] o.a.s.c.ZkController waiting to find shard id in clusterstate for collection1
   [junit4]   2> 45001 INFO  (coreLoadExecutor-197-thread-1-processing-n:127.0.0.1:41328_) [n:127.0.0.1:41328_ c:control_collection   x:collection1] o.a.s.c.ZkController Check for collection zkNode:control_collection
   [junit4]   2> 45001 INFO  (coreLoadExecutor-197-thread-1-processing-n:127.0.0.1:41328_) [n:127.0.0.1:41328_ c:control_collection   x:collection1] o.a.s.c.ZkController Collection zkNode exists
   [junit4]   2> 45001 INFO  (coreLoadExecutor-197-thread-1-processing-n:127.0.0.1:41328_) [n:127.0.0.1:41328_ c:control_collection   x:collection1] o.a.s.c.c.ZkStateReader Load collection config from:/collections/control_collection
   [junit4]   2> 45002 INFO  (coreLoadExecutor-197-thread-1-processing-n:127.0.0.1:41328_) [n:127.0.0.1:41328_ c:control_collection   x:collection1] o.a.s.c.c.ZkStateReader path=/collections/control_collection configName=conf1 specified config exists in ZooKeeper
   [junit4]   2> 45002 INFO  (coreLoadExecutor-197-thread-1-processing-n:127.0.0.1:41328_) [n:127.0.0.1:41328_ c:control_collection   x:collection1] o.a.s.c.SolrResourceLoader new SolrResourceLoader for directory: '/home/jenkins/workspace/Lucene-Solr-trunk-Linux/solr/build/solr-core/test/J0/temp/solr.cloud.BasicDistributedZkTest_EB42BF33E64AC3B0-001/control-001/cores/collection1/'
   [junit4]   2> 45012 INFO  (coreLoadExecutor-197-thread-1-processing-n:127.0.0.1:41328_) [n:127.0.0.1:41328_ c:control_collection   x:collection1] o.a.s.c.Config loaded config solrconfig.xml with version 0 
   [junit4]   2> 45015 INFO  (coreLoadExecutor-197-thread-1-processing-n:127.0.0.1:41328_) [n:127.0.0.1:41328_ c:control_collection   x:collection1] o.a.s.c.SolrConfig current version of requestparams : -1
   [junit4]   2> 45018 INFO  (coreLoadExecutor-197-thread-1-processing-n:127.0.0.1:41328_) [n:127.0.0.1:41328_ c:control_collection   x:collection1] o.a.s.c.SolrConfig Using Lucene MatchVersion: 6.0.0
   [junit4]   2> 45024 INFO  (coreLoadExecutor-197-thread-1-processing-n:127.0.0.1:41328_) [n:127.0.0.1:41328_ c:control_collection   x:collection1] o.a.s.c.Config Loaded SolrConfig: solrconfig.xml
   [junit4]   2> 45024 INFO  (coreLoadExecutor-197-thread-1-processing-n:127.0.0.1:41328_) [n:127.0.0.1:41328_ c:control_collection   x:collection1] o.a.s.s.IndexSchema Reading Solr Schema from /configs/conf1/schema.xml
   [junit4]   2> 45027 INFO  (coreLoadExecutor-197-thread-1-processing-n:127.0.0.1:41328_) [n:127.0.0.1:41328_ c:control_collection   x:collection1] o.a.s.s.IndexSchema [collection1] Schema name=test
   [junit4]   2> 45101 INFO  (coreLoadExecutor-197-thread-1-processing-n:127.0.0.1:41328_) [n:127.0.0.1:41328_ c:control_collection   x:collection1] o.a.s.s.OpenExchangeRatesOrgProvider Initialized with rates=open-exchange-rates.json, refreshInterval=1440.
   [junit4]   2> 45106 INFO  (coreLoadExecutor-197-thread-1-processing-n:127.0.0.1:41328_) [n:127.0.0.1:41328_ c:control_collection   x:collection1] o.a.s.s.IndexSchema default search field in schema is text
   [junit4]   2> 45108 INFO  (coreLoadExecutor-197-thread-1-processing-n:127.0.0.1:41328_) [n:127.0.0.1:41328_ c:control_collection   x:collection1] o.a.s.s.IndexSchema unique key field: id
   [junit4]   2> 45115 INFO  (coreLoadExecutor-197-thread-1-processing-n:127.0.0.1:41328_) [n:127.0.0.1:41328_ c:control_collection   x:collection1] o.a.s.s.FileExchangeRateProvider Reloading exchange rates from file currency.xml
   [junit4]   2> 45116 INFO  (coreLoadExecutor-197-thread-1-processing-n:127.0.0.1:41328_) [n:127.0.0.1:41328_ c:control_collection   x:collection1] o.a.s.s.FileExchangeRateProvider Reloading exchange rates from file currency.xml
   [junit4]   2> 45118 INFO  (coreLoadExecutor-197-thread-1-processing-n:127.0.0.1:41328_) [n:127.0.0.1:41328_ c:control_collection   x:collection1] o.a.s.s.OpenExchangeRatesOrgProvider Reloading exchange rates from open-exchange-rates.json
   [junit4]   2> 45119 WARN  (coreLoadExecutor-197-thread-1-processing-n:127.0.0.1:41328_) [n:127.0.0.1:41328_ c:control_collection   x:collection1] o.a.s.s.OpenExchangeRatesOrgProvider Unknown key IMPORTANT NOTE
   [junit4]   2> 45119 WARN  (coreLoadExecutor-197-thread-1-processing-n:127.0.0.1:41328_) [n:127.0.0.1:41328_ c:control_collection   x:collection1] o.a.s.s.OpenExchangeRatesOrgProvider Expected key, got STRING
   [junit4]   2> 45119 INFO  (coreLoadExecutor-197-thread-1-processing-n:127.0.0.1:41328_) [n:127.0.0.1:41328_ c:control_collection   x:collection1] o.a.s.s.OpenExchangeRatesOrgProvider Reloading exchange rates from open-exchange-rates.json
   [junit4]   2> 45119 WARN  (coreLoadExecutor-197-thread-1-processing-n:127.0.0.1:41328_) [n:127.0.0.1:41328_ c:control_collection   x:collection1] o.a.s.s.OpenExchangeRatesOrgProvider Unknown key IMPORTANT NOTE
   [junit4]   2> 45119 WARN  (coreLoadExecutor-197-thread-1-processing-n:127.0.0.1:41328_) [n:127.0.0.1:41328_ c:control_collection   x:collection1] o.a.s.s.OpenExchangeRatesOrgProvider Expected key, got STRING
   [junit4]   2> 45120 INFO  (coreLoadExecutor-197-thread-1-processing-n:127.0.0.1:41328_) [n:127.0.0.1:41328_ c:control_collection   x:collection1] o.a.s.c.CoreContainer Creating SolrCore 'collection1' using configuration from collection control_collection
   [junit4]   2> 45120 INFO  (coreLoadExecutor-197-thread-1-processing-n:127.0.0.1:41328_) [n:127.0.0.1:41328_ c:control_collection s:shard1 r:core_node1 x:collection1] o.a.s.c.SolrCore org.apache.solr.core.MockDirectoryFactory
   [junit4]   2> 45120 INFO  (coreLoadExecutor-197-thread-1-processing-n:127.0.0.1:41328_) [n:127.0.0.1:41328_ c:control_collection s:shard1 r:core_node1 x:collection1] o.a.s.c.SolrCore [[collection1] ] Opening new SolrCore at [/home/jenkins/workspace/Lucene-Solr-trunk-Linux/solr/build/solr-core/test/J0/temp/solr.cloud.BasicDistributedZkTest_EB42BF33E64AC3B0-001/control-001/cores/collection1/], dataDir=[null]
   [junit4]   2> 45120 INFO  (coreLoadExecutor-197-thread-1-processing-n:127.0.0.1:41328_) [n:127.0.0.1:41328_ c:control_collection s:shard1 r:core_node1 x:collection1] o.a.s.c.JmxMonitoredMap JMX monitoring is enabled. Adding Solr mbeans to JMX Server: com.sun.jmx.mbeanserver.JmxMBeanServer@1273c395
   [junit4]   2> 45121 INFO  (coreLoadExecutor-197-thread-1-processing-n:127.0.0.1:41328_) [n:127.0.0.1:41328_ c:control_collection s:shard1 r:core_node1 x:collection1] o.a.s.c.CachingDirectoryFactory return new directory for /home/jenkins/workspace/Lucene-Solr-trunk-Linux/solr/build/solr-core/test/J0/temp/solr.cloud.BasicDistributedZkTest_EB42BF33E64AC3B0-001/control-001/cores/collection1/data
   [junit4]   2> 45121 INFO  (coreLoadExecutor-197-thread-1-processing-n:127.0.0.1:41328_) [n:127.0.0.1:41328_ c:control_collection s:shard1 r:core_node1 x:collection1] o.a.s.c.SolrCore New index directory detected: old=null new=/home/jenkins/workspace/Lucene-Solr-trunk-Linux/solr/build/solr-core/test/J0/temp/solr.cloud.BasicDistributedZkTest_EB42BF33E64AC3B0-001/control-001/cores/collection1/data/index/
   [junit4]   2> 45121 WARN  (coreLoadExecutor-197-thread-1-processing-n:127.0.0.1:41328_) [n:127.0.0.1:41328_ c:control_collection s:shard1 r:core_node1 x:collection1] o.a.s.c.SolrCore [collection1] Solr index directory '/home/jenkins/workspace/Lucene-Solr-trunk-Linux/solr/build/solr-core/test/J0/temp/solr.cloud.BasicDistributedZkTest_EB42BF33E64AC3B0-001/control-001/cores/collection1/data/index' doesn't exist. Creating new index...
   [junit4]   2> 45121 INFO  (coreLoadExecutor-197-thread-1-processing-n:127.0.0.1:41328_) [n:127.0.0.1:41328_ c:control_collection s:shard1 r:core_node1 x:collection1] o.a.s.c.CachingDirectoryFactory return new directory for /home/jenkins/workspace/Lucene-Solr-trunk-Linux/solr/build/solr-core/test/J0/temp/solr.cloud.BasicDistributedZkTest_EB42BF33E64AC3B0-001/control-001/cores/collection1/data/index
   [junit4]   2> 45122 INFO  (coreLoadExecutor-197-thread-1-processing-n:127.0.0.1:41328_) [n:127.0.0.1:41328_ c:control_collection s:shard1 r:core_node1 x:collection1] o.a.s.u.RandomMergePolicy RandomMergePolicy wrapping class org.apache.lucene.index.AlcoholicMergePolicy: [AlcoholicMergePolicy: minMergeSize=0, mergeFactor=10, maxMergeSize=1633528340, maxMergeSizeForForcedMerge=9223372036854775807, calibrateSizeByDeletes=true, maxMergeDocs=2147483647, maxCFSSegmentSizeMB=8.796093022207999E12, noCFSRatio=0.1]
   [junit4]   2> 45122 INFO  (coreLoadExecutor-197-thread-1-processing-n:127.0.0.1:41328_) [n:127.0.0.1:41328_ c:control_collection s:shard1 r:core_node1 x:collection1] o.a.s.c.SolrCore SolrDeletionPolicy.onCommit: commits: num=1
   [junit4]   2> 	commit{dir=MockDirectoryWrapper(RAMDirectory@41932e7e lockFactory=org.apache.lucene.store.SingleInstanceLockFactory@65ec9ff8),segFN=segments_1,generation=1}
   [junit4]   2> 45123 INFO  (coreLoadExecutor-197-thread-1-processing-n:127.0.0.1:41328_) [n:127.0.0.1:41328_ c:control_collection s:shard1 r:core_node1 x:collection1] o.a.s.c.SolrCore newest commit generation = 1
   [junit4]   2> 45123 INFO  (OldIndexDirectoryCleanupThreadForCore-collection1) [n:127.0.0.1:41328_ c:control_collection s:shard1 r:core_node1 x:collection1] o.a.s.c.SolrCore Looking for old index directories to cleanup for core collection1 in /home/jenkins/workspace/Lucene-Solr-trunk-Linux/solr/build/solr-core/test/J0/temp/solr.cloud.BasicDistributedZkTest_EB42BF33E64AC3B0-001/control-001/cores/collection1/data/
   [junit4]   2> 45123 WARN  (OldIndexDirectoryCleanupThreadForCore-collection1) [n:127.0.0.1:41328_ c:control_collection s:shard1 r:core_node1 x:collection1] o.a.s.c.DirectoryFactory /home/jenkins/workspace/Lucene-Solr-trunk-Linux/solr/build/solr-core/test/J0/temp/solr.cloud.BasicDistributedZkTest_EB42BF33E64AC3B0-001/control-001/cores/collection1/data/ does not point to a valid data directory; skipping clean-up of old index directories.
   [junit4]   2> 45126 INFO  (coreLoadExecutor-197-thread-1-processing-n:127.0.0.1:41328_) [n:127.0.0.1:41328_ c:control_collection s:shard1 r:core_node1 x:collection1] o.a.s.u.p.UpdateRequestProcessorChain creating updateRequestProcessorChain "nodistrib"
   [junit4]   2> 45126 INFO  (coreLoadExecutor-197-thread-1-processing-n:127.0.0.1:41328_) [n:127.0.0.1:41328_ c:control_collection s:shard1 r:core_node1 x:collection1] o.a.s.u.p.UpdateRequestProcessorChain creating updateRequestProcessorChain "dedupe"
   [junit4]   2> 45126 INFO  (coreLoadExecutor-197-thread-1-processing-n:127.0.0.1:41328_) [n:127.0.0.1:41328_ c:control_collection s:shard1 r:core_node1 x:collection1] o.a.s.u.p.UpdateRequestProcessorChain inserting DistributedUpdateProcessorFactory into updateRequestProcessorChain "dedupe"
   [junit4]   2> 45126 INFO  (coreLoadExecutor-197-thread-1-processing-n:127.0.0.1:41328_) [n:127.0.0.1:41328_ c:control_collection s:shard1 r:core_node1 x:collection1] o.a.s.u.p.UpdateRequestProcessorChain creating updateRequestProcessorChain "stored_sig"
   [junit4]   2> 45126 INFO  (coreLoadExecutor-197-thread-1-processing-n:127.0.0.1:41328_) [n:127.0.0.1:41328_ c:control_collection s:shard1 r:core_node1 x:collection1] o.a.s.u.p.UpdateRequestProcessorChain inserting DistributedUpdateProcessorFactory into updateRequestProcessorChain "stored_sig"
   [junit4]   2> 45126 INFO  (coreLoadExecutor-197-thread-1-processing-n:127.0.0.1:41328_) [n:127.0.0.1:41328_ c:control_collection s:shard1 r:core_node1 x:collection1] o.a.s.u.p.UpdateRequestProcessorChain creating updateRequestProcessorChain "distrib-dup-test-chain-explicit"
   [junit4]   2> 45127 INFO  (coreLoadExecutor-197-thread-1-processing-n:127.0.0.1:41328_) [n:127.0.0.1:41328_ c:control_collection s:shard1 r:core_node1 x:collection1] o.a.s.u.p.UpdateRequestProcessorChain creating updateRequestProcessorChain "distrib-dup-test-chain-implicit"
   [junit4]   2> 45127 INFO  (coreLoadExecutor-197-thread-1-processing-n:127.0.0.1:41328_) [n:127.0.0.1:41328_ c:control_collection s:shard1 r:core_node1 x:collection1] o.a.s.u.p.UpdateRequestProcessorChain inserting DistributedUpdateProcessorFactory into updateRequestProcessorChain "distrib-dup-test-chain-implicit"
   [junit4]   2> 45127 INFO  (coreLoadExecutor-197-thread-1-processing-n:127.0.0.1:41328_) [n:127.0.0.1:41328_ c:control_collection s:shard1 r:core_node1 x:collection1] o.a.s.c.SolrCore no updateRequestProcessorChain defined as default, creating implicit default
   [junit4]   2> 45129 INFO  (coreLoadExecutor-197-thread-1-processing-n:127.0.0.1:41328_) [n:127.0.0.1:41328_ c:control_collection s:shard1 r:core_node1 x:collection1] o.a.s.h.l.XMLLoader xsltCacheLifetimeSeconds=60
   [junit4]   2> 45129 INFO  (coreLoadExecutor-197-thread-1-processing-n:127.0.0.1:41328_) [n:127.0.0.1:41328_ c:control_collection s:shard1 r:core_node1 x:collection1] o.a.s.h.l.XMLLoader xsltCacheLifetimeSeconds=60
   [junit4]   2> 45130 INFO  (coreLoadExecutor-197-thread-1-processing-n:127.0.0.1:41328_) [n:127.0.0.1:41328_ c:control_collection s:shard1 r:core_node1 x:collection1] o.a.s.h.l.XMLLoader xsltCacheLifetimeSeconds=60
   [junit4]   2> 45131 INFO  (coreLoadExecutor-197-thread-1-processing-n:127.0.0.1:41328_) [n:127.0.0.1:41328_ c:control_collection s:shard1 r:core_node1 x:collection1] o.a.s.h.l.XMLLoader xsltCacheLifetimeSeconds=60
   [junit4]   2> 45133 INFO  (coreLoadExecutor-197-thread-1-processing-n:127.0.0.1:41328_) [n:127.0.0.1:41328_ c:control_collection s:shard1 r:core_node1 x:collection1] o.a.s.c.RequestHandlers Registered paths: /admin/mbeans,standard,/update/csv,/update/json/docs,/admin/luke,/admin/segments,/get,/admin/system,/replication,/admin/properties,/config,/schema,/admin/plugins,/admin/logging,/update/json,/admin/threads,/admin/ping,/update,/admin/file
   [junit4]   2> 45133 INFO  (coreLoadExecutor-197-thread-1-processing-n:127.0.0.1:41328_) [n:127.0.0.1:41328_ c:control_collection s:shard1 r:core_node1 x:collection1] o.a.s.c.SolrCore Using default statsCache cache: org.apache.solr.search.stats.LocalStatsCache
   [junit4]   2> 45134 INFO  (coreLoadExecutor-197-thread-1-processing-n:127.0.0.1:41328_) [n:127.0.0.1:41328_ c:control_collection s:shard1 r:core_node1 x:collection1] o.a.s.u.UpdateHandler Using UpdateLog implementation: org.apache.solr.update.UpdateLog
   [junit4]   2> 45134 INFO  (coreLoadExecutor-197-thread-1-processing-n:127.0.0.1:41328_) [n:127.0.0.1:41328_ c:control_collection s:shard1 r:core_node1 x:collection1] o.a.s.u.UpdateLog Initializing UpdateLog: dataDir= defaultSyncLevel=FLUSH numRecordsToKeep=100 maxNumLogsToKeep=10 numVersionBuckets=65536
   [junit4]   2> 45134 INFO  (coreLoadExecutor-197-thread-1-processing-n:127.0.0.1:41328_) [n:127.0.0.1:41328_ c:control_collection s:shard1 r:core_node1 x:collection1] o.a.s.c.SolrCore Hard AutoCommit: disabled
   [junit4]   2> 45134 INFO  (coreLoadExecutor-197-thread-1-processing-n:127.0.0.1:41328_) [n:127.0.0.1:41328_ c:control_collection s:shard1 r:core_node1 x:collection1] o.a.s.c.SolrCore Soft AutoCommit: disabled
   [junit4]   2> 45135 INFO  (coreLoadExecutor-197-thread-1-processing-n:127.0.0.1:41328_) [n:127.0.0.1:41328_ c:control_collection s:shard1 r:core_node1 x:collection1] o.a.s.u.RandomMergePolicy RandomMergePolicy wrapping class org.apache.lucene.index.LogByteSizeMergePolicy: [LogByteSizeMergePolicy: minMergeSize=1677721, mergeFactor=20, maxMergeSize=2147483648, maxMergeSizeForForcedMerge=9223372036854775807, calibrateSizeByDeletes=true, maxMergeDocs=2147483647, maxCFSSegmentSizeMB=8.796093022207999E12, noCFSRatio=0.0]
   [junit4]   2> 45135 INFO  (coreLoadExecutor-197-thread-1-processing-n:127.0.0.1:41328_) [n:127.0.0.1:41328_ c:control_collection s:shard1 r:core_node1 x:collection1] o.a.s.c.SolrCore SolrDeletionPolicy.onInit: commits: num=1
   [junit4]   2> 	commit{dir=MockDirectoryWrapper(RAMDirectory@41932e7e lockFactory=org.apache.lucene.store.SingleInstanceLockFactory@65ec9ff8),segFN=segments_1,generation=1}
   [junit4]   2> 45135 INFO  (coreLoadExecutor-197-thread-1-processing-n:127.0.0.1:41328_) [n:127.0.0.1:41328_ c:control_collection s:shard1 r:core_node1 x:collection1] o.a.s.c.SolrCore newest commit generation = 1
   [junit4]   2> 45135 INFO  (coreLoadExecutor-197-thread-1-processing-n:127.0.0.1:41328_) [n:127.0.0.1:41328_ c:control_collection s:shard1 r:core_node1 x:collection1] o.a.s.s.SolrIndexSearcher Opening Searcher@2cb30c49[collection1] main
   [junit4]   2> 45136 INFO  (coreLoadExecutor-197-thread-1-processing-n:127.0.0.1:41328_) [n:127.0.0.1:41328_ c:control_collection s:shard1 r:core_node1 x:collection1] o.a.s.c.c.ZkStateReader Load collection config from:/collections/control_collection
   [junit4]   2> 45136 INFO  (coreLoadExecutor-197-thread-1-processing-n:127.0.0.1:41328_) [n:127.0.0.1:41328_ c:control_collection s:shard1 r:core_node1 x:collection1] o.a.s.c.c.ZkStateReader path=/collections/control_collection configName=conf1 specified config exists in ZooKeeper
   [junit4]   2> 45136 INFO  (coreLoadExecutor-197-thread-1-processing-n:127.0.0.1:41328_) [n:127.0.0.1:41328_ c:control_collection s:shard1 r:core_node1 x:collection1] o.a.s.r.ManagedResourceStorage Setting up ZooKeeper-based storage for the RestManager with znodeBase: /configs/conf1
   [junit4]   2> 45136 INFO  (coreLoadExecutor-197-thread-1-processing-n:127.0.0.1:41328_) [n:127.0.0.1:41328_ c:control_collection s:shard1 r:core_node1 x:collection1] o.a.s.r.ManagedResourceStorage Configured ZooKeeperStorageIO with znodeBase: /configs/conf1
   [junit4]   2> 45136 INFO  (coreLoadExecutor-197-thread-1-processing-n:127.0.0.1:41328_) [n:127.0.0.1:41328_ c:control_collection s:shard1 r:core_node1 x:collection1] o.a.s.r.RestManager Initializing RestManager with initArgs: {}
   [junit4]   2> 45136 INFO  (coreLoadExecutor-197-thread-1-processing-n:127.0.0.1:41328_) [n:127.0.0.1:41328_ c:control_collection s:shard1 r:core_node1 x:collection1] o.a.s.r.ManagedResourceStorage Reading _rest_managed.json using ZooKeeperStorageIO:path=/configs/conf1
   [junit4]   2> 45137 INFO  (coreLoadExecutor-197-thread-1-processing-n:127.0.0.1:41328_) [n:127.0.0.1:41328_ c:control_collection s:shard1 r:core_node1 x:collection1] o.a.s.r.ManagedResourceStorage No data found for znode /configs/conf1/_rest_managed.json
   [junit4]   2> 45137 INFO  (coreLoadExecutor-197-thread-1-processing-n:127.0.0.1:41328_) [n:127.0.0.1:41328_ c:control_collection s:shard1 r:core_node1 x:collection1] o.a.s.r.ManagedResourceStorage Loaded null at path _rest_managed.json using ZooKeeperStorageIO:path=/configs/conf1
   [junit4]   2> 45137 INFO  (coreLoadExecutor-197-thread-1-processing-n:127.0.0.1:41328_) [n:127.0.0.1:41328_ c:control_collection s:shard1 r:core_node1 x:collection1] o.a.s.r.RestManager Initializing 0 registered ManagedResources
   [junit4]   2> 45137 INFO  (coreLoadExecutor-197-thread-1-processing-n:127.0.0.1:41328_) [n:127.0.0.1:41328_ c:control_collection s:shard1 r:core_node1 x:collection1] o.a.s.h.ReplicationHandler Commits will be reserved for  10000
   [junit4]   2> 45137 INFO  (searcherExecutor-198-thread-1-processing-n:127.0.0.1:41328_ x:collection1 s:shard1 c:control_collection r:core_node1) [n:127.0.0.1:41328_ c:control_collection s:shard1 r:core_node1 x:collection1] o.a.s.c.SolrCore [collection1] Registered new searcher Searcher@2cb30c49[collection1] main{ExitableDirectoryReader(UninvertingDirectoryReader())}
   [junit4]   2> 45138 INFO  (coreLoadExecutor-197-thread-1-processing-n:127.0.0.1:41328_) [n:127.0.0.1:41328_ c:control_collection s:shard1 r:core_node1 x:collection1] o.a.s.u.UpdateLog Looking up max value of version field to seed version buckets
   [junit4]   2> 45138 INFO  (coreLoadExecutor-197-thread-1-processing-n:127.0.0.1:41328_) [n:127.0.0.1:41328_ c:control_collection s:shard1 r:core_node1 x:collection1] o.a.s.u.VersionInfo Refreshing highest value of _version_ for 65536 version buckets from index
   [junit4]   2> 45138 INFO  (coreLoadExecutor-197-thread-1-processing-n:127.0.0.1:41328_) [n:127.0.0.1:41328_ c:control_collection s:shard1 r:core_node1 x:collection1] o.a.s.u.VersionInfo No terms found for _version_, cannot seed version bucket highest value from index
   [junit4]   2> 45138 INFO  (coreLoadExecutor-197-thread-1-processing-n:127.0.0.1:41328_) [n:127.0.0.1:41328_ c:control_collection s:shard1 r:core_node1 x:collection1] o.a.s.u.UpdateLog Could not find max version in index or recent updates, using new clock 1505431665667735552
   [junit4]   2> 45139 INFO  (coreLoadExecutor-197-thread-1-processing-n:127.0.0.1:41328_) [n:127.0.0.1:41328_ c:control_collection s:shard1 r:core_node1 x:collection1] o.a.s.u.UpdateLog Took 1 ms to seed version buckets with highest version 1505431665667735552
   [junit4]   2> 45139 INFO  (coreLoadExecutor-197-thread-1-processing-n:127.0.0.1:41328_) [n:127.0.0.1:41328_ c:control_collection s:shard1 r:core_node1 x:collection1] o.a.s.c.ZkController watch zkdir /configs/conf1
   [junit4]   2> 45139 INFO  (coreLoadExecutor-197-thread-1-processing-n:127.0.0.1:41328_) [n:127.0.0.1:41328_ c:control_collection s:shard1 r:core_node1 x:collection1] o.a.s.c.CoreContainer registering core: collection1
   [junit4]   2> 45140 INFO  (coreZkRegister-191-thread-1-processing-n:127.0.0.1:41328_ x:collection1 s:shard1 c:control_collection r:core_node1) [n:127.0.0.1:41328_ c:control_collection s:shard1 r:core_node1 x:collection1] o.a.s.c.ZkController Register replica - core:collection1 address:http://127.0.0.1:41328 collection:control_collection shard:shard1
   [junit4]   2> 45140 INFO  (coreZkRegister-191-thread-1-processing-n:127.0.0.1:41328_ x:collection1 s:shard1 c:control_collection r:core_node1) [n:127.0.0.1:41328_ c:control_collection s:shard1 r:core_node1 x:collection1] o.a.s.c.c.SolrZkClient makePath: /collections/control_collection/leader_elect/shard1/election
   [junit4]   2> 45142 INFO  (coreZkRegister-191-thread-1-processing-n:127.0.0.1:41328_ x:collection1 s:shard1 c:control_collection r:core_node1) [n:127.0.0.1:41328_ c:control_collection s:shard1 r:core_node1 x:collection1] o.a.s.c.LeaderElector Joined leadership election with path: /collections/control_collection/leader_elect/shard1/election/94089479012745219-core_node1-n_0000000000
   [junit4]   2> 45143 INFO  (coreZkRegister-191-thread-1-processing-n:127.0.0.1:41328_ x:collection1 s:shard1 c:control_collection r:core_node1) [n:127.0.0.1:41328_ c:control_collection s:shard1 r:core_node1 x:collection1] o.a.s.c.ShardLeaderElectionContext Running the leader process for shard shard1
   [junit4]   2> 45143 INFO  (zkCallback-38-thread-1-processing-n:127.0.0.1:41328_) [n:127.0.0.1:41328_    ] o.a.s.c.DistributedQueue NodeChildrenChanged fired on path /overseer/queue state SyncConnected
   [junit4]   2> 45144 INFO  (coreZkRegister-191-thread-1-processing-n:127.0.0.1:41328_ x:collection1 s:shard1 c:control_collection r:core_node1) [n:127.0.0.1:41328_ c:control_collection s:shard1 r:core_node1 x:collection1] o.a.s.c.ShardLeaderElectionContext Enough replicas found to continue.
   [junit4]   2> 45144 INFO  (coreZkRegister-191-thread-1-processing-n:127.0.0.1:41328_ x:collection1 s:shard1 c:control_collection r:core_node1) [n:127.0.0.1:41328_ c:control_collection s:shard1 r:core_node1 x:collection1] o.a.s.c.ShardLeaderElectionContext I may be the new leader - try and sync
   [junit4]   2> 45144 INFO  (coreZkRegister-191-thread-1-processing-n:127.0.0.1:41328_ x:collection1 s:shard1 c:control_collection r:core_node1) [n:127.0.0.1:41328_ c:control_collection s:shard1 r:core_node1 x:collection1] o.a.s.c.SyncStrategy Sync replicas to http://127.0.0.1:41328/collection1/
   [junit4]   2> 45144 INFO  (coreZkRegister-191-thread-1-processing-n:127.0.0.1:41328_ x:collection1 s:shard1 c:control_collection r:core_node1) [n:127.0.0.1:41328_ c:control_collection s:shard1 r:core_node1 x:collection1] o.a.s.c.SyncStrategy Sync Success - now sync replicas to me
   [junit4]   2> 45144 INFO  (OverseerStateUpdate-94089479012745219-127.0.0.1:41328_-n_0000000000) [n:127.0.0.1:41328_    ] o.a.s.c.Overseer processMessage: queueSize: 1, message = {
   [junit4]   2>   "operation":"leader",
   [junit4]   2>   "shard":"shard1",
   [junit4]   2>   "collection":"control_collection"} current state version: 1
   [junit4]   2> 45144 INFO  (coreZkRegister-191-thread-1-processing-n:127.0.0.1:41328_ x:collection1 s:shard1 c:control_collection r:core_node1) [n:127.0.0.1:41328_ c:control_collection s:shard1 r:core_node1 x:collection1] o.a.s.c.SyncStrategy http://127.0.0.1:41328/collection1/ has no replicas
   [junit4]   2> 45144 INFO  (coreZkRegister-191-thread-1-processing-n:127.0.0.1:41328_ x:collection1 s:shard1 c:control_collection r:core_node1) [n:127.0.0.1:41328_ c:control_collection s:shard1 r:core_node1 x:collection1] o.a.s.c.ShardLeaderElectionContext I am the new leader: http://127.0.0.1:41328/collection1/ shard1
   [junit4]   2> 45144 INFO  (coreZkRegister-191-thread-1-processing-n:127.0.0.1:41328_ x:collection1 s:shard1 c:control_collection r:core_node1) [n:127.0.0.1:41328_ c:control_collection s:shard1 r:core_node1 x:collection1] o.a.s.c.c.SolrZkClient makePath: /collections/control_collection/leaders/shard1
   [junit4]   2> 45146 INFO  (zkCallback-38-thread-1-processing-n:127.0.0.1:41328_) [n:127.0.0.1:41328_    ] o.a.s.c.DistributedQueue NodeChildrenChanged fired on path /overseer/queue state SyncConnected
   [junit4]   2> 45147 INFO  (OverseerStateUpdate-94089479012745219-127.0.0.1:41328_-n_0000000000) [n:127.0.0.1:41328_    ] o.a.s.c.Overseer processMessage: queueSize: 1, message = {
   [junit4]   2>   "operation":"leader",
   [junit4]   2>   "shard":"shard1",
   [junit4]   2>   "collection":"control_collection",
   [junit4]   2>   "base_url":"http://127.0.0.1:41328",
   [junit4]   2>   "core":"collection1",
   [junit4]   2>   "state":"active"} current state version: 1
   [junit4]   2> 45248 INFO  (zkCallback-38-thread-1-processing-n:127.0.0.1:41328_) [n:127.0.0.1:41328_    ] o.a.s.c.c.ZkStateReader A cluster state change: WatchedEvent state:SyncConnected type:NodeDataChanged path:/clusterstate.json, has occurred - updating... (live nodes size: 1)
   [junit4]   2> 45249 INFO  (zkCallback-38-thread-1-processing-n:127.0.0.1:41328_) [n:127.0.0.1:41328_    ] o.a.s.c.c.ZkStateReader Updated cluster state version to 2
   [junit4]   2> 45297 INFO  (coreZkRegister-191-thread-1-processing-n:127.0.0.1:41328_ x:collection1 s:shard1 c:control_collection r:core_node1) [n:127.0.0.1:41328_ c:control_collection s:shard1 r:core_node1 x:collection1] o.a.s.c.ZkController We are http://127.0.0.1:41328/collection1/ and leader is http://127.0.0.1:41328/collection1/
   [junit4]   2> 45297 INFO  (coreZkRegister-191-thread-1-processing-n:127.0.0.1:41328_ x:collection1 s:shard1 c:control_collection r:core_node1) [n:127.0.0.1:41328_ c:control_collection s:shard1 r:core_node1 x:collection1] o.a.s.c.ZkController No LogReplay needed for core=collection1 baseURL=http://127.0.0.1:41328
   [junit4]   2> 45297 INFO  (coreZkRegister-191-thread-1-processing-n:127.0.0.1:41328_ x:collection1 s:shard1 c:control_collection r:core_node1) [n:127.0.0.1:41328_ c:control_collection s:shard1 r:core_node1 x:collection1] o.a.s.c.ZkController I am the leader, no recovery necessary
   [junit4]   2> 45297 INFO  (coreZkRegister-191-thread-1-processing-n:127.0.0.1:41328_ x:collection1 s:shard1 c:control_collection r:core_node1) [n:127.0.0.1:41328_ c:control_collection s:shard1 r:core_node1 x:collection1] o.a.s.c.ZkController publishing state=active
   [junit4]   2> 45297 INFO  (coreZkRegister-191-thread-1-processing-n:127.0.0.1:41328_ x:collection1 s:shard1 c:control_collection r:core_node1) [n:127.0.0.1:41328_ c:control_collection s:shard1 r:core_node1 x:collection1] o.a.s.c.ZkController numShards not found on descriptor - reading it from system property
   [junit4]   2> 45298 INFO  (zkCallback-38-thread-1-processing-n:127.0.0.1:41328_) [n:127.0.0.1:41328_    ] o.a.s.c.DistributedQueue NodeChildrenChanged fired on path /overseer/queue state SyncConnected
   [junit4]   2> 45299 INFO  (OverseerStateUpdate-94089479012745219-127.0.0.1:41328_-n_0000000000) [n:127.0.0.1:41328_    ] o.a.s.c.Overseer processMessage: queueSize: 1, message = {
   [junit4]   2>   "core":"collection1",
   [junit4]   2>   "core_node_name":"core_node1",
   [junit4]   2>   "roles":null,
   [junit4]   2>   "base_url":"http://127.0.0.1:41328",
   [junit4]   2>   "node_name":"127.0.0.1:41328_",
   [junit4]   2>   "numShards":"1",
   [junit4]   2>   "state":"active",
   [junit4]   2>   "shard":"shard1",
   [junit4]   2>   "collection":"control_collection",
   [junit4]   2>   "operation":"state"} current state version: 2
   [junit4]   2> 45299 INFO  (OverseerStateUpdate-94089479012745219-127.0.0.1:41328_-n_0000000000) [n:127.0.0.1:41328_    ] o.a.s.c.o.ReplicaMutator Update state numShards=1 message={
   [junit4]   2>   "core":"collection1",
   [junit4]   2>   "core_node_name":"core_node1",
   [junit4]   2>   "roles":null,
   [junit4]   2>   "base_url":"http://127.0.0.1:41328",
   [junit4]   2>   "node_name":"127.0.0.1:41328_",
   [junit4]   2>   "numShards":"1",
   [junit4]   2>   "state":"active",
   [junit4]   2>   "shard":"shard1",
   [junit4]   2>   "collection":"control_collection",
   [junit4]   2>   "operation":"state"}
   [junit4]   2> 45401 INFO  (zkCallback-38-thread-1-processing-n:127.0.0.1:41328_) [n:127.0.0.1:41328_    ] o.a.s.c.c.ZkStateReader A cluster state change: WatchedEvent state:SyncConnected type:NodeDataChanged path:/clusterstate.json, has occurred - updating... (live nodes size: 1)
   [junit4]   2> 45402 INFO  (zkCallback-38-thread-1-processing-n:127.0.0.1:41328_) [n:127.0.0.1:41328_    ] o.a.s.c.c.ZkStateReader Updated cluster state version to 3
   [junit4]   2> 45501 INFO  (TEST-BasicDistributedZkTest.test-seed#[EB42BF33E64AC3B0]) [    ] o.a.s.c.c.SolrZkClient Using default ZkCredentialsProvider
   [junit4]   2> 45501 INFO  (TEST-BasicDistributedZkTest.test-seed#[EB42BF33E64AC3B0]) [    ] o.a.s.c.c.ConnectionManager Waiting for client to connect to ZooKeeper
   [junit4]   2> 45502 INFO  (zkCallback-40-thread-1) [    ] o.a.s.c.c.ConnectionManager Watcher org.apache.solr.common.cloud.ConnectionManager@3f33c83c name:ZooKeeperConnection Watcher:127.0.0.1:59133/solr got event WatchedEvent state:SyncConnected type:None path:null path:null type:None
   [junit4]   2> 45503 INFO  (TEST-BasicDistributedZkTest.test-seed#[EB42BF33E64AC3B0]) [    ] o.a.s.c.c.ConnectionManager Client is connected to ZooKeeper
   [junit4]   2> 45503 INFO  (TEST-BasicDistributedZkTest.test-seed#[EB42BF33E64AC3B0]) [    ] o.a.s.c.c.SolrZkClient Using default ZkACLProvider
   [junit4]   2> 45503 INFO  (TEST-BasicDistributedZkTest.test-seed#[EB42BF33E64AC3B0]) [    ] o.a.s.c.c.ZkStateReader Updating cluster state from ZooKeeper... 
   [junit4]   2> 45505 INFO  (TEST-BasicDistributedZkTest.test-seed#[EB42BF33E64AC3B0]) [    ] o.a.s.c.ChaosMonkey monkey: init - expire sessions:false cause connection loss:false
   [junit4]   2> 45505 INFO  (TEST-BasicDistributedZkTest.test-seed#[EB42BF33E64AC3B0]) [    ] o.a.s.c.AbstractFullDistribZkTestBase Creating collection1 with stateFormat=2
   [junit4]   2> 45505 INFO  (TEST-BasicDistributedZkTest.test-seed#[EB42BF33E64AC3B0]) [    ] o.a.s.c.c.SolrZkClient Using default ZkCredentialsProvider
   [junit4]   2> 45505 INFO  (TEST-BasicDistributedZkTest.test-seed#[EB42BF33E64AC3B0]) [    ] o.a.s.c.c.ConnectionManager Waiting for client to connect to ZooKeeper
   [junit4]   2> 45506 INFO  (zkCallback-41-thread-1) [    ] o.a.s.c.c.ConnectionManager Watcher org.apache.solr.common.cloud.ConnectionManager@161592fc name:ZooKeeperConnection Watcher:127.0.0.1:59133/solr got event WatchedEvent state:SyncConnected type:None path:null path:null type:None
   [junit4]   2> 45506 INFO  (TEST-BasicDistributedZkTest.test-seed#[EB42BF33E64AC3B0]) [    ] o.a.s.c.c.ConnectionManager Client is connected to ZooKeeper
   [junit4]   2> 45507 INFO  (TEST-BasicDistributedZkTest.test-seed#[EB42BF33E64AC3B0]) [    ] o.a.s.c.c.SolrZkClient Using default ZkACLProvider
   [junit4]   2> 45508 INFO  (zkCallback-38-thread-1-processing-n:127.0.0.1:41328_) [n:127.0.0.1:41328_    ] o.a.s.c.DistributedQueue NodeChildrenChanged fired on path /overseer/queue state SyncConnected
   [junit4]   2> 45508 INFO  (OverseerStateUpdate-94089479012745219-127.0.0.1:41328_-n_0000000000) [n:127.0.0.1:41328_    ] o.a.s.c.Overseer processMessage: queueSize: 1, message = {
   [junit4]   2>   "operation":"create",
   [junit4]   2>   "name":"collection1",
   [junit4]   2>   "numShards":"2",
   [junit4]   2>   "stateFormat":"2"} current state version: 3
   [junit4]   2> 45508 INFO  (OverseerStateUpdate-94089479012745219-127.0.0.1:41328_-n_0000000000) [n:127.0.0.1:41328_    ] o.a.s.c.o.ClusterStateMutator building a new cName: collection1
   [junit4]   2> 45550 INFO  (TEST-BasicDistributedZkTest.test-seed#[EB42BF33E64AC3B0]) [    ] o.a.s.SolrTestCaseJ4 Writing core.properties file to /home/jenkins/workspace/Lucene-Solr-trunk-Linux/solr/build/solr-core/test/J0/temp/solr.cloud.BasicDistributedZkTest_EB42BF33E64AC3B0-001/shard-1-001/cores/collection1
   [junit4]   2> 45551 INFO  (TEST-BasicDistributedZkTest.test-seed#[EB42BF33E64AC3B0]) [    ] o.a.s.c.AbstractFullDistribZkTestBase create jetty 1 in directory /home/jenkins/workspace/Lucene-Solr-trunk-Linux/solr/build/solr-core/test/J0/temp/solr.cloud.BasicDistributedZkTest_EB42BF33E64AC3B0-001/shard-1-001
   [junit4]   2> 45552 INFO  (TEST-BasicDistributedZkTest.test-seed#[EB42BF33E64AC3B0]) [    ] o.e.j.s.Server jetty-9.2.11.v20150529
   [junit4]   2> 45553 INFO  (TEST-BasicDistributedZkTest.test-seed#[EB42BF33E64AC3B0]) [    ] o.e.j.s.h.ContextHandler Started o.e.j.s.ServletContextHandler@4ac2d8ad{/,null,AVAILABLE}
   [junit4]   2> 45553 INFO  (TEST-BasicDistributedZkTest.test-seed#[EB42BF33E64AC3B0]) [    ] o.e.j.s.ServerConnector Started ServerConnector@2ce17bc9{HTTP/1.1}{127.0.0.1:48815}
   [junit4]   2> 45553 INFO  (TEST-BasicDistributedZkTest.test-seed#[EB42BF33E64AC3B0]) [    ] o.e.j.s.Server Started @47093ms
   [junit4]   2> 45553 INFO  (TEST-BasicDistributedZkTest.test-seed#[EB42BF33E64AC3B0]) [    ] o.a.s.c.s.e.JettySolrRunner Jetty properties: {solr.data.dir=/home/jenkins/workspace/Lucene-Solr-trunk-Linux/solr/build/solr-core/test/J0/temp/solr.cloud.BasicDistributedZkTest_EB42BF33E64AC3B0-001/tempDir-001/jetty1, solrconfig=solrconfig.xml, hostContext=/, hostPort=48815, coreRootDirectory=/home/jenkins/workspace/Lucene-Solr-trunk-Linux/solr/build/solr-core/test/J0/../../../../../../../../../home/jenkins/workspace/Lucene-Solr-trunk-Linux/solr/build/solr-core/test/J0/temp/solr.cloud.BasicDistributedZkTest_EB42BF33E64AC3B0-001/shard-1-001/cores}
   [junit4]   2> 45554 INFO  (TEST-BasicDistributedZkTest.test-seed#[EB42BF33E64AC3B0]) [    ] o.a.s.s.SolrDispatchFilter SolrDispatchFilter.init(): sun.misc.Launcher$AppClassLoader@45fe3ee3
   [junit4]   2> 45554 INFO  (TEST-BasicDistributedZkTest.test-seed#[EB42BF33E64AC3B0]) [    ] o.a.s.c.SolrResourceLoader new SolrResourceLoader for directory: '/home/jenkins/workspace/Lucene-Solr-trunk-Linux/solr/build/solr-core/test/J0/../../../../../../../../../home/jenkins/workspace/Lucene-Solr-trunk-Linux/solr/build/solr-core/test/J0/temp/solr.cloud.BasicDistributedZkTest_EB42BF33E64AC3B0-001/shard-1-001/'
   [junit4]   2> 45561 INFO  (TEST-BasicDistributedZkTest.test-seed#[EB42BF33E64AC3B0]) [    ] o.a.s.c.SolrXmlConfig Loading container configuration from /home/jenkins/workspace/Lucene-Solr-trunk-Linux/solr/build/solr-core/test/J0/../../../../../../../../../home/jenkins/workspace/Lucene-Solr-trunk-Linux/solr/build/solr-core/test/J0/temp/solr.cloud.BasicDistributedZkTest_EB42BF33E64AC3B0-001/shard-1-001/solr.xml
   [junit4]   2> 45564 INFO  (TEST-BasicDistributedZkTest.test-seed#[EB42BF33E64AC3B0]) [    ] o.a.s.c.CoresLocator Config-defined core root directory: /home/jenkins/workspace/Lucene-Solr-trunk-Linux/solr/build/solr-core/test/J0/../../../../../../../../../home/jenkins/workspace/Lucene-Solr-trunk-Linux/solr/build/solr-core/test/J0/temp/solr.cloud.BasicDistributedZkTest_EB42BF33E64AC3B0-001/shard-1-001/cores
   [junit4]   2> 45564 INFO  (TEST-BasicDistributedZkTest.test-seed#[EB42BF33E64AC3B0]) [    ] o.a.s.c.CoreContainer New CoreContainer 1443858369
   [junit4]   2> 45564 INFO  (TEST-BasicDistributedZkTest.test-seed#[EB42BF33E64AC3B0]) [    ] o.a.s.c.CoreContainer Loading cores into CoreContainer [instanceDir=/home/jenkins/workspace/Lucene-Solr-trunk-Linux/solr/build/solr-core/test/J0/../../../../../../../../../home/jenkins/workspace/Lucene-Solr-trunk-Linux/solr/build/solr-core/test/J0/temp/solr.cloud.BasicDistributedZkTest_EB42BF33E64AC3B0-001/shard-1-001/]
   [junit4]   2> 45564 INFO  (TEST-BasicDistributedZkTest.test-seed#[EB42BF33E64AC3B0]) [    ] o.a.s.c.CoreContainer loading shared library: /home/jenkins/workspace/Lucene-Solr-trunk-Linux/solr/build/solr-core/test/J0/../../../../../../../../../home/jenkins/workspace/Lucene-Solr-trunk-Linux/solr/build/solr-core/test/J0/temp/solr.cloud.BasicDistributedZkTest_EB42BF33E64AC3B0-001/shard-1-001/lib
   [junit4]   2> 45564 WARN  (TEST-BasicDistributedZkTest.test-seed#[EB42BF33E64AC3B0]) [    ] o.a.s.c.SolrResourceLoader Can't find (or read) directory to add to classloader: lib (resolved as: /home/jenkins/workspace/Lucene-Solr-trunk-Linux/solr/build/solr-core/test/J0/../../../../../../../../../home/jenkins/workspace/Lucene-Solr-trunk-Linux/solr/build/solr-core/test/J0/temp/solr.cloud.BasicDistributedZkTest_EB42BF33E64AC3B0-001/shard-1-001/lib).
   [junit4]   2> 45568 INFO  (TEST-BasicDistributedZkTest.test-seed#[EB42BF33E64AC3B0]) [    ] o.a.s.h.c.HttpShardHandlerFactory created with socketTimeout : 90000,urlScheme : ,connTimeout : 15000,maxConnectionsPerHost : 20,maxConnections : 10000,corePoolSize : 0,maximumPoolSize : 2147483647,maxThreadIdleTime : 5,sizeOfQueue : -1,fairnessPolicy : false,useRetries : false,
   [junit4]   2> 45569 INFO  (TEST-BasicDistributedZkTest.test-seed#[EB42BF33E64AC3B0]) [    ] o.a.s.u.UpdateShardHandler Creating UpdateShardHandler HTTP client with params: socketTimeout=340000&connTimeout=45000&retry=true
   [junit4]   2> 45569 INFO  (TEST-BasicDistributedZkTest.test-seed#[EB42BF33E64AC3B0]) [    ] o.a.s.l.LogWatcher SLF4J impl is org.slf4j.impl.Log4jLoggerFactory
   [junit4]   2> 45569 INFO  (TEST-BasicDistributedZkTest.test-seed#[EB42BF33E64AC3B0]) [    ] o.a.s.l.LogWatcher Registering Log Listener [Log4j (org.slf4j.impl.Log4jLoggerFactory)]
   [junit4]   2> 45569 INFO  (TEST-BasicDistributedZkTest.test-seed#[EB42BF33E64AC3B0]) [    ] o.a.s.c.ZkContainer Zookeeper client=127.0.0.1:59133/solr
   [junit4]   2> 45569 INFO  (TEST-BasicDistributedZkTest.test-seed#[EB42BF33E64AC3B0]) [    ] o.a.s.c.ZkController zkHost includes chroot
   [junit4]   2> 45569 INFO  (TEST-BasicDistributedZkTest.test-seed#[EB42BF33E64AC3B0]) [    ] o.a.s.c.c.SolrZkClient Using default ZkCredentialsProvider
   [junit4]   2> 45570 INFO  (TEST-BasicDistributedZkTest.test-seed#[EB42BF33E64AC3B0]) [    ] o.a.s.c.c.ConnectionManager Waiting for client to connect to ZooKeeper
   [junit4]   2> 45571 INFO  (zkCallback-43-thread-1) [    ] o.a.s.c.c.ConnectionManager Watcher org.apache.solr.common.cloud.ConnectionManager@6c538d2a name:ZooKeeperConnection Watcher:127.0.0.1:59133 got event WatchedEvent state:SyncConnected type:None path:null path:null type:None
   [junit4]   2> 45571 INFO  (TEST-BasicDistributedZkTest.test-seed#[EB42BF33E64AC3B0]) [    ] o.a.s.c.c.ConnectionManager Client is connected to ZooKeeper
   [junit4]   2> 45571 INFO  (TEST-BasicDistributedZkTest.test-seed#[EB42BF33E64AC3B0]) [    ] o.a.s.c.c.SolrZkClient Using default ZkACLProvider
   [junit4]   2> 45573 INFO  (TEST-BasicDistributedZkTest.test-seed#[EB42BF33E64AC3B0]) [n:127.0.0.1:48815_    ] o.a.s.c.c.ConnectionManager Waiting for client to connect to ZooKeeper
   [junit4]   2> 45574 INFO  (zkCallback-44-thread-1-processing-n:127.0.0.1:48815_) [n:127.0.0.1:48815_    ] o.a.s.c.c.ConnectionManager Watcher org.apache.solr.common.cloud.ConnectionManager@2930324e name:ZooKeeperConnection Watcher:127.0.0.1:59133/solr got event WatchedEvent state:SyncConnected type:None path:null path:null type:None
   [junit4]   2> 45574 INFO  (TEST-BasicDistributedZkTest.test-seed#[EB42BF33E64AC3B0]) [n:127.0.0.1:48815_    ] o.a.s.c.c.ConnectionManager Client is connected to ZooKeeper
   [junit4]   2> 45576 INFO  (TEST-BasicDistributedZkTest.test-seed#[EB42BF33E64AC3B0]) [n:127.0.0.1:48815_    ] o.a.s.c.c.ZkStateReader Updating cluster state from ZooKeeper... 
   [junit4]   2> 45610 INFO  (OverseerStateUpdate-94089479012745219-127.0.0.1:41328_-n_0000000000) [n:127.0.0.1:41328_    ] o.a.s.c.o.ZkStateWriter going to create_collection /collections/collection1/state.json
   [junit4]   2> 45611 INFO  (zkCallback-40-thread-1) [    ] o.a.s.c.c.ZkStateReader A cluster state change: WatchedEvent state:SyncConnected type:NodeDataChanged path:/clusterstate.json, has occurred - updating... (live nodes size: 1)
   [junit4]   2> 45611 INFO  (zkCallback-38-thread-1-processing-n:127.0.0.1:41328_) [n:127.0.0.1:41328_    ] o.a.s.c.c.ZkStateReader A cluster state change: WatchedEvent state:SyncConnected type:NodeDataChanged path:/clusterstate.json, has occurred - updating... (live nodes size: 1)
   [junit4]   2> 45611 INFO  (zkCallback-44-thread-1-processing-n:127.0.0.1:48815_) [n:127.0.0.1:48815_    ] o.a.s.c.c.ZkStateReader A cluster state change: WatchedEvent state:SyncConnected type:NodeDataChanged path:/clusterstate.json, has occurred - updating... (live nodes size: 1)
   [junit4]   2> 45612 INFO  (zkCallback-40-thread-1) [    ] o.a.s.c.c.ZkStateReader Updated cluster state version to 4
   [junit4]   2> 45612 INFO  (zkCallback-38-thread-1-processing-n:127.0.0.1:41328_) [n:127.0.0.1:41328_    ] o.a.s.c.c.ZkStateReader Updated cluster state version to 4
   [junit4]   2> 45612 INFO  (zkCallback-44-thread-1-processing-n:127.0.0.1:48815_) [n:127.0.0.1:48815_    ] o.a.s.c.c.ZkStateReader Updated cluster state version to 4
   [junit4]   2> 46578 INFO  (TEST-BasicDistributedZkTest.test-seed#[EB42BF33E64AC3B0]) [n:127.0.0.1:48815_    ] o.a.s.c.ZkController Register node as live in ZooKeeper:/live_nodes/127.0.0.1:48815_
   [junit4]   2> 46578 INFO  (TEST-BasicDistributedZkTest.test-seed#[EB42BF33E64AC3B0]) [n:127.0.0.1:48815_    ] o.a.s.c.c.SolrZkClient makePath: /live_nodes/127.0.0.1:48815_
   [junit4]   2> 46579 INFO  (TEST-BasicDistributedZkTest.test-seed#[EB42BF33E64AC3B0]) [n:127.0.0.1:48815_    ] o.a.s.c.Overseer Overseer (id=null) closing
   [junit4]   2> 46580 INFO  (TEST-BasicDistributedZkTest.test-seed#[EB42BF33E64AC3B0]) [n:127.0.0.1:48815_    ] o.a.s.c.LeaderElector Joined leadership election with path: /overseer_elect/election/94089479012745223-127.0.0.1:48815_-n_0000000001
   [junit4]   2> 46580 INFO  (TEST-BasicDistributedZkTest.test-seed#[EB42BF33E64AC3B0]) [n:127.0.0.1:48815_    ] o.a.s.c.LeaderElector Watching path /overseer_elect/election/94089479012745219-127.0.0.1:41328_-n_0000000000 to know if I could be the leader
   [junit4]   2> 46580 INFO  (TEST-BasicDistributedZkTest.test-seed#[EB42BF33E64AC3B0]) [n:127.0.0.1:48815_    ] o.a.s.c.CoreContainer No authentication plugin used.
   [junit4]   2> 46580 INFO  (TEST-BasicDistributedZkTest.test-seed#[EB42BF33E64AC3B0]) [n:127.0.0.1:48815_    ] o.a.s.c.CoreContainer Security conf doesn't exist. Skipping setup for authorization module.
   [junit4]   2> 46581 INFO  (TEST-BasicDistributedZkTest.test-seed#[EB42BF33E64AC3B0]) [n:127.0.0.1:48815_    ] o.a.s.c.CoresLocator Looking for core definitions underneath /home/jenkins/workspace/Lucene-Solr-trunk-Linux/solr/build/solr-core/test/J0/../../../../../../../../../home/jenkins/workspace/Lucene-Solr-trunk-Linux/solr/build/solr-core/test/J0/temp/solr.cloud.BasicDistributedZkTest_EB42BF33E64AC3B0-001/shard-1-001/cores
   [junit4]   2> 46581 INFO  (TEST-BasicDistributedZkTest.test-seed#[EB42BF33E64AC3B0]) [n:127.0.0.1:48815_    ] o.a.s.c.SolrCore Created CoreDescriptor: {name=collection1, config=solrconfig.xml, transient=false, schema=schema.xml, loadOnStartup=true, instanceDir=/home/jenkins/workspace/Lucene-Solr-trunk-Linux/solr/build/solr-core/test/J0/../../../../../../../../../home/jenkins/workspace/Lucene-Solr-trunk-Linux/solr/build/solr-core/test/J0/temp/solr.cloud.BasicDistributedZkTest_EB42BF33E64AC3B0-001/shard-1-001/cores/collection1, collection=collection1, absoluteInstDir=/home/jenkins/workspace/Lucene-Solr-trunk-Linux/solr/build/solr-core/test/J0/../../../../../../../../../home/jenkins/workspace/Lucene-Solr-trunk-Linux/solr/build/solr-core/test/J0/temp/solr.cloud.BasicDistributedZkTest_EB42BF33E64AC3B0-001/shard-1-001/cores/collection1/, coreNodeName=, dataDir=data/, shard=}
   [junit4]   2> 46581 INFO  (TEST-BasicDistributedZkTest.test-seed#[EB42BF33E64AC3B0]) [n:127.0.0.1:48815_    ] o.a.s.c.CoresLocator Found core collection1 in /home/jenkins/workspace/Lucene-Solr-trunk-Linux/solr/build/solr-core/test/J0/../../../../../../../../../home/jenkins/workspace/Lucene-Solr-trunk-Linux/solr/build/solr-core/test/J0/temp/solr.cloud.BasicDistributedZkTest_EB42BF33E64AC3B0-001/shard-1-001/cores/collection1/
   [junit4]   2> 46581 INFO  (TEST-BasicDistributedZkTest.test-seed#[EB42BF33E64AC3B0]) [n:127.0.0.1:48815_    ] o.a.s.c.CoresLocator Found 1 core definitions
   [junit4]   2> 46582 INFO  (TEST-BasicDistributedZkTest.test-seed#[EB42BF33E64AC3B0]) [n:127.0.0.1:48815_    ] o.a.s.s.SolrDispatchFilter user.dir=/home/jenkins/workspace/Lucene-Solr-trunk-Linux/solr/build/solr-core/test/J0
   [junit4]   2> 46582 INFO  (TEST-BasicDistributedZkTest.test-seed#[EB42BF33E64AC3B0]) [n:127.0.0.1:48815_    ] o.a.s.s.SolrDispatchFilter SolrDispatchFilter.init() done
   [junit4]   2> 46582 INFO  (coreLoadExecutor-208-thread-1-processing-n:127.0.0.1:48815_) [n:127.0.0.1:48815_ c:collection1   x:collection1] o.a.s.c.ZkController publishing state=down
   [junit4]   2> 46582 INFO  (coreLoadExecutor-208-thread-1-processing-n:127.0.0.1:48815_) [n:127.0.0.1:48815_ c:collection1   x:collection1] o.a.s.c.ZkController numShards not found on descriptor - reading it from system property
   [junit4]   2> 46583 INFO  (zkCallback-38-thread-1-processing-n:127.0.0.1:41328_) [n:127.0.0.1:41328_    ] o.a.s.c.DistributedQueue NodeChildrenChanged fired on path /overseer/queue state SyncConnected
   [junit4]   2> 46583 INFO  (coreLoadExecutor-208-thread-1-processing-n:127.0.0.1:48815_) [n:127.0.0.1:48815_ c:collection1   x:collection1] o.a.s.c.ZkController Registering watch for external collection collection1
   [junit4]   2> 46583 INFO  (coreLoadExecutor-208-thread-1-processing-n:127.0.0.1:48815_) [n:127.0.0.1:48815_ c:collection1   x:collection1] o.a.s.c.c.ZkStateReader addZkWatch collection1
   [junit4]   2> 46583 INFO  (coreLoadExecutor-208-thread-1-processing-n:127.0.0.1:48815_) [n:127.0.0.1:48815_ c:collection1   x:collection1] o.a.s.c.c.ZkStateReader Updating collection state at /collections/collection1/state.json from ZooKeeper... 
   [junit4]   2> 46583 INFO  (OverseerStateUpdate-94089479012745219-127.0.0.1:41328_-n_0000000000) [n:127.0.0.1:41328_    ] o.a.s.c.Overseer processMessage: queueSize: 1, message = {
   [junit4]   2>   "core":"collection1",
   [junit4]   2>   "roles":null,
   [junit4]   2>   "base_url":"http://127.0.0.1:48815",
   [junit4]   2>   "node_name":"127.0.0.1:48815_",
   [junit4]   2>   "numShards":"2",
   [junit4]   2>   "state":"down",
   [junit4]   2>   "shard":null,
   [junit4]   2>   "collection":"collection1",
   [junit4]   2>   "operation":"state"} current state version: 4
   [junit4]   2> 46584 INFO  (coreLoadExecutor-208-thread-1-processing-n:127.0.0.1:48815_) [n:127.0.0.1:48815_ c:collection1   x:collection1] o.a.s.c.c.ZkStateReader Updating data for collection1 to ver 0 
   [junit4]   2> 46584 INFO  (OverseerStateUpdate-94089479012745219-127.0.0.1:41328_-n_0000000000) [n:127.0.0.1:41328_    ] o.a.s.c.o.ReplicaMutator Update state numShards=2 message={
   [junit4]   2>   "core":"collection1",
   [junit4]   2>   "roles":null,
   [junit4]   2>   "base_url":"http://127.0.0.1:48815",
   [junit4]   2>   "node_name":"127.0.0.1:48815_",
   [junit4]   2>   "numShards":"2",
   [junit4]   2>   "state":"down",
   [junit4]   2>   "shard":null,
   [junit4]   2>   "collection":"collection1",
   [junit4]   2>   "operation":"state"}
   [junit4]   2> 46584 INFO  (coreLoadExecutor-208-thread-1-processing-n:127.0.0.1:48815_) [n:127.0.0.1:48815_ c:collection1   x:collection1] o.a.s.c.ZkController look for our core node name
   [junit4]   2> 46584 INFO  (OverseerStateUpdate-94089479012745219-127.0.0.1:41328_-n_0000000000) [n:127.0.0.1:41328_    ] o.a.s.c.o.ReplicaMutator Collection already exists with numShards=2
   [junit4]   2> 46584 INFO  (OverseerStateUpdate-94089479012745219-127.0.0.1:41328_-n_0000000000) [n:127.0.0.1:41328_    ] o.a.s.c.o.ReplicaMutator Assigning new node to shard shard=shard2
   [junit4]   2> 46685 INFO  (OverseerStateUpdate-94089479012745219-127.0.0.1:41328_-n_0000000000) [n:127.0.0.1:41328_    ] o.a.s.c.o.ZkStateWriter going to update_collection /collections/collection1/state.json version: 0
   [junit4]   2> 46686 INFO  (zkCallback-44-thread-1-processing-n:127.0.0.1:48815_) [n:127.0.0.1:48815_    ] o.a.s.c.c.ZkStateReader A cluster state change: WatchedEvent state:SyncConnected type:NodeDataChanged path:/collections/collection1/state.json for collection collection1 has occurred - updating... (live nodes size: 2)
   [junit4]   2> 46686 INFO  (zkCallback-44-thread-1-processing-n:127.0.0.1:48815_) [n:127.0.0.1:48815_    ] o.a.s.c.c.ZkStateReader Updating data for collection1 to ver 1 
   [junit4]   2> 47584 INFO  (coreLoadExecutor-208-thread-1-processing-n:127.0.0.1:48815_) [n:127.0.0.1:48815_ c:collection1   x:collection1] o.a.s.c.ZkController waiting to find shard id in clusterstate for collection1
   [junit4]   2> 47584 INFO  (coreLoadExecutor-208-thread-1-processing-n:127.0.0.1:48815_) [n:127.0.0.1:48815_ c:collection1   x:collection1] o.a.s.c.ZkController Check for collection zkNode:collection1
   [junit4]   2> 47584 INFO  (coreLoadExecutor-208-thread-1-processing-n:127.0.0.1:48815_) [n:127.0.0.1:48815_ c:collection1   x:collection1] o.a.s.c.ZkController Collection zkNode exists
   [junit4]   2> 47585 INFO  (coreLoadExecutor-208-thread-1-processing-n:127.0.0.1:48815_) [n:127.0.0.1:48815_ c:collection1   x:collection1] o.a.s.c.c.ZkStateReader Load collection config from:/collections/collection1
   [junit4]   2> 47585 INFO  (coreLoadExecutor-208-thread-1-processing-n:127.0.0.1:48815_) [n:127.0.0.1:48815_ c:collection1   x:collection1] o.a.s.c.c.ZkStateReader path=/collections/collection1 configName=conf1 specified config exists in ZooKeeper
   [junit4]   2> 47585 INFO  (coreLoadExecutor-208-thread-1-processing-n:127.0.0.1:48815_) [n:127.0.0.1:48815_ c:collection1   x:collection1] o.a.s.c.SolrResourceLoader new SolrResourceLoader for directory: '/home/jenkins/workspace/Lucene-Solr-trunk-Linux/solr/build/solr-core/test/J0/../../../../../../../../../home/jenkins/workspace/Lucene-Solr-trunk-Linux/solr/build/solr-core/test/J0/temp/solr.cloud.BasicDistributedZkTest_EB42BF33E64AC3B0-001/shard-1-001/cores/collection1/'
   [junit4]   2> 47592 INFO  (coreLoadExecutor-208-thread-1-processing-n:127.0.0.1:48815_) [n:127.0.0.1:48815_ c:collection1   x:collection1] o.a.s.c.Config loaded config solrconfig.xml with version 0 
   [junit4]   2> 47595 INFO  (coreLoadExecutor-208-thread-1-processing-n:127.0.0.1:48815_) [n:127.0.0.1:48815_ c:collection1   x:collection1] o.a.s.c.SolrConfig current version of requestparams : -1
   [junit4]   2> 47597 INFO  (coreLoadExecutor-208-thread-1-processing-n:127.0.0.1:48815_) [n:127.0.0.1:48815_ c:collection1   x:collection1] o.a.s.c.SolrConfig Using Lucene MatchVersion: 6.0.0
   [junit4]   2> 47603 INFO  (coreLoadExecutor-208-thread-1-processing-n:127.0.0.1:48815_) [n:127.0.0.1:48815_ c:collection1   x:collection1] o.a.s.c.Config Loaded SolrConfig: solrconfig.xml
   [junit4]   2> 47603 INFO  (coreLoadExecutor-208-thread-1-processing-n:127.0.0.1:48815_) [n:127.0.0.1:48815_ c:collection1   x:collection1] o.a.s.s.IndexSchema Reading Solr Schema from /configs/conf1/schema.xml
   [junit4]   2> 47606 INFO  (coreLoadExecutor-208-thread-1-processing-n:127.0.0.1:48815_) [n:127.0.0.1:48815_ c:collection1   x:collection1] o.a.s.s.IndexSchema [collection1] Schema name=test
   [junit4]   2> 47669 INFO  (coreLoadExecutor-208-thread-1-processing-n:127.0.0.1:48815_) [n:127.0.0.1:48815_ c:collection1   x:collection1] o.a.s.s.OpenExchangeRatesOrgProvider Initialized with rates=open-exchange-rates.json, refreshInterval=1440.
   [junit4]   2> 47674 INFO  (coreLoadExecutor-208-thread-1-processing-n:127.0.0.1:48815_) [n:127.0.0.1:48815_ c:collection1   x:collection1] o.a.s.s.IndexSchema default search field in schema is text
   [junit4]   2> 47674 INFO  (coreLoadExecutor-208-thread-1-processing-n:127.0.0.1:48815_) [n:127.0.0.1:48815_ c:collection1   x:collection1] o.a.s.s.IndexSchema unique key field: id
   [junit4]   2> 47680 INFO  (coreLoadExecutor-208-thread-1-processing-n:127.0.0.1:48815_) [n:127.0.0.1:48815_ c:collection1   x:collection1] o.a.s.s.FileExchangeRateProvider Reloading exchange rates from file currency.xml
   [junit4]   2> 47681 INFO  (coreLoadExecutor-208-thread-1-processing-n:127.0.0.1:48815_) [n:127.0.0.1:48815_ c:collection1   x:collection1] o.a.s.s.FileExchangeRateProvider Reloading exchange rates from file currency.xml
   [junit4]   2> 47682 INFO  (coreLoadExecutor-208-thread-1-processing-n:127.0.0.1:48815_) [n:127.0.0.1:48815_ c:collection1   x:collection1] o.a.s.s.OpenExchangeRatesOrgProvider Reloading exchange rates from open-exchange-rates.json
   [junit4]   2> 47683 WARN  (coreLoadExecutor-208-thread-1-processing-n:127.0.0.1:48815_) [n:127.0.0.1:48815_ c:collection1   x:collection1] o.a.s.s.OpenExchangeRatesOrgProvider Unknown key IMPORTANT NOTE
   [junit4]   2> 47683 WARN  (coreLoadExecutor-208-thread-1-processing-n:127.0.0.1:48815_) [n:127.0.0.1:48815_ c:collection1   x:collection1] o.a.s.s.OpenExchangeRatesOrgProvider Expected key, got STRING
   [junit4]   2> 47683 INFO  (coreLoadExecutor-208-thread-1-processing-n:127.0.0.1:48815_) [n:127.0.0.1:48815_ c:collection1   x:collection1] o.a.s.s.OpenExchangeRatesOrgProvider Reloading exchange rates from open-exchange-rates.json
   [junit4]   2> 47683 WARN  (coreLoadExecutor-208-thread-1-processing-n:127.0.0.1:48815_) [n:127.0.0.1:48815_ c:collection1   x:collection1] o.a.s.s.OpenExchangeRatesOrgProvider Unknown key IMPORTANT NOTE
   [junit4]   2> 47683 WARN  (coreLoadExecutor-208-thread-1-processing-n:127.0.0.1:48815_) [n:127.0.0.1:48815_ c:collection1   x:collection1] o.a.s.s.OpenExchangeRatesOrgProvider Expected key, got STRING
   [junit4]   2> 47683 INFO  (coreLoadExecutor-208-thread-1-processing-n:127.0.0.1:48815_) [n:127.0.0.1:48815_ c:collection1   x:collection1] o.a.s.c.CoreContainer Creating SolrCore 'collection1' using configuration from collection collection1
   [junit4]   2> 47683 INFO  (coreLoadExecutor-208-thread-1-processing-n:127.0.0.1:48815_) [n:127.0.0.1:48815_ c:collection1 s:shard2 r:core_node1 x:collection1] o.a.s.c.SolrCore org.apache.solr.core.MockDirectoryFactory
   [junit4]   2> 47684 INFO  (coreLoadExecutor-208-thread-1-processing-n:127.0.0.1:48815_) [n:127.0.0.1:48815_ c:collection1 s:shard2 r:core_node1 x:collection1] o.a.s.c.SolrCore [[collection1] ] Opening new SolrCore at [/home/jenkins/workspace/Lucene-Solr-trunk-Linux/solr/build/solr-core/test/J0/../../../../../../../../../home/jenkins/workspace/Lucene-Solr-trunk-Linux/solr/build/solr-core/test/J0/temp/solr.cloud.BasicDistributedZkTest_EB42BF33E64AC3B0-001/shard-1-001/cores/collection1/], dataDir=[null]
   [junit4]   2> 47684 INFO  (coreLoadExecutor-208-thread-1-processing-n:127.0.0.1:48815_) [n:127.0.0.1:48815_ c:collection1 s:shard2 r:core_node1 x:collection1] o.a.s.c.JmxMonitoredMap JMX monitoring is enabled. Adding Solr mbeans to JMX Server: com.sun.jmx.mbeanserver.JmxMBeanServer@1273c395
   [junit4]   2> 47684 INFO  (coreLoadExecutor-208-thread-1-processing-n:127.0.0.1:48815_) [n:127.0.0.1:48815_ c:collection1 s:shard2 r:core_node1 x:collection1] o.a.s.c.CachingDirectoryFactory return new directory for /home/jenkins/workspace/Lucene-Solr-trunk-Linux/solr/build/solr-core/test/J0/../../../../../../../../../home/jenkins/workspace/Lucene-Solr-trunk-Linux/solr/build/solr-core/test/J0/temp/solr.cloud.BasicDistributedZkTest_EB42BF33E64AC3B0-001/shard-1-001/cores/collection1/data
   [junit4]   2> 47684 INFO  (coreLoadExecutor-208-thread-1-processing-n:127.0.0.1:48815_) [n:127.0.0.1:48815_ c:collection1 s:shard2 r:core_node1 x:collection1] o.a.s.c.SolrCore New index directory detected: old=null new=/home/jenkins/workspace/Lucene-Solr-trunk-Linux/solr/build/solr-core/test/J0/../../../../../../../../../home/jenkins/workspace/Lucene-Solr-trunk-Linux/solr/build/solr-core/test/J0/temp/solr.cloud.BasicDistributedZkTest_EB42BF33E64AC3B0-001/shard-1-001/cores/collection1/data/index/
   [junit4]   2> 47684 WARN  (coreLoadExecutor-208-thread-1-processing-n:127.0.0.1:48815_) [n:127.0.0.1:48815_ c:collection1 s:shard2 r:core_node1 x:collection1] o.a.s.c.SolrCore [collection1] Solr index directory '/home/jenkins/workspace/Lucene-Solr-trunk-Linux/solr/build/solr-core/test/J0/../../../../../../../../../home/jenkins/workspace/Lucene-Solr-trunk-Linux/solr/build/solr-core/test/J0/temp/solr.cloud.BasicDistributedZkTest_EB42BF33E64AC3B0-001/shard-1-001/cores/collection1/data/index' doesn't exist. Creating new index...
   [junit4]   2> 47685 INFO  (coreLoadExecutor-208-thread-1-processing-n:127.0.0.1:48815_) [n:127.0.0.1:48815_ c:collection1 s:shard2 r:core_node1 x:collection1] o.a.s.c.CachingDirectoryFactory return new directory for /home/jenkins/workspace/Lucene-Solr-trunk-Linux/solr/build/solr-core/test/J0/../../../../../../../../../home/jenkins/workspace/Lucene-Solr-trunk-Linux/solr/build/solr-core/test/J0/temp/solr.cloud.BasicDistributedZkTest_EB42BF33E64AC3B0-001/shard-1-001/cores/collection1/data/index
   [junit4]   2> 47685 INFO  (coreLoadExecutor-208-thread-1-processing-n:127.0.0.1:48815_) [n:127.0.0.1:48815_ c:collection1 s:shard2 r:core_node1 x:collection1] o.a.s.u.RandomMergePolicy RandomMergePolicy wrapping class org.apache.lucene.index.AlcoholicMergePolicy: [AlcoholicMergePolicy: minMergeSize=0, mergeFactor=10, maxMergeSize=1633528340, maxMergeSizeForForcedMerge=9223372036854775807, calibrateSizeByDeletes=true, maxMergeDocs=2147483647, maxCFSSegmentSizeMB=8.796093022207999E12, noCFSRatio=0.1]
   [junit4]   2> 47685 INFO  (coreLoadExecutor-208-thread-1-processing-n:127.0.0.1:48815_) [n:127.0.0.1:48815_ c:collection1 s:shard2 r:core_node1 x:collection1] o.a.s.c.SolrCore SolrDeletionPolicy.onCommit: commits: num=1
   [junit4]   2> 	commit{dir=MockDirectoryWrapper(RAMDirectory@6c47b362 lockFactory=org.apache.lucene.store.SingleInstanceLockFactory@1c867d92),segFN=segments_1,generation=1}
   [junit4]   2> 47686 INFO  (coreLoadExecutor-208-thread-1-processing-n:127.0.0.1:48815_) [n:127.0.0.1:48815_ c:collection1 s:shard2 r:core_node1 x:collection1] o.a.s.c.SolrCore newest commit generation = 1
   [junit4]   2> 47686 INFO  (OldIndexDirectoryCleanupThreadForCore-collection1) [n:127.0.0.1:48815_ c:collection1 s:shard2 r:core_node1 x:collection1] o.a.s.c.SolrCore Looking for old index directories to cleanup for core collection1 in /home/jenkins/workspace/Lucene-Solr-trunk-Linux/solr/build/solr-core/test/J0/../../../../../../../../../home/jenkins/workspace/Lucene-Solr-trunk-Linux/solr/build/solr-core/test/J0/temp/solr.cloud.BasicDistributedZkTest_EB42BF33E64AC3B0-001/shard-1-001/cores/collection1/data/
   [junit4]   2> 47686 WARN  (OldIndexDirectoryCleanupThreadForCore-collection1) [n:127.0.0.1:48815_ c:collection1 s:shard2 r:core_node1 x:collection1] o.a.s.c.DirectoryFactory /home/jenkins/workspace/Lucene-Solr-trunk-Linux/solr/build/solr-core/test/J0/../../../../../../../../../home/jenkins/workspace/Lucene-Solr-trunk-Linux/solr/build/solr-core/test/J0/temp/solr.cloud.BasicDistributedZkTest_EB42BF33E64AC3B0-001/shard-1-001/cores/collection1/data/ does not point to a valid data directory; skipping clean-up of old index directories.
   [junit4]   2> 47689 INFO  (coreLoadExecutor-208-thread-1-processing-n:127.0.0.1:48815_) [n:127.0.0.1:48815_ c:collection1 s:shard2 r:core_node1 x:collection1] o.a.s.u.p.UpdateRequestProcessorChain creating updateRequestProcessorChain "nodistrib"
   [junit4]   2> 47689 INFO  (coreLoadExecutor-208-thread-1-processing-n:127.0.0.1:48815_) [n:127.0.0.1:48815_ c:collection1 s:shard2 r:core_node1 x:collection1] o.a.s.u.p.UpdateRequestProcessorChain creating updateRequestProcessorChain "dedupe"
   [junit4]   2> 47689 INFO  (coreLoadExecutor-208-thread-1-processing-n:127.0.0.1:48815_) [n:127.0.0.1:48815_ c:collection1 s:shard2 r:core_node1 x:collection1] o.a.s.u.p.UpdateRequestProcessorChain inserting DistributedUpdateProcessorFactory in

[...truncated too long message...]

_) [n:127.0.0.1:46423_    ] o.a.s.c.c.ZkStateReader A cluster state change: WatchedEvent state:SyncConnected type:NodeDataChanged path:/collections/collection1/state.json for collection collection1 has occurred - updating... (live nodes size: 1)
   [junit4]   2> 70030 INFO  (TEST-BasicDistributedZkTest.test-seed#[EB42BF33E64AC3B0]) [n:127.0.0.1:46423_ c:collection1 s:shard1 r:core_node4 x:collection1] o.a.s.c.SolrCore SolrDeletionPolicy.onCommit: commits: num=2
   [junit4]   2> 	commit{dir=MockDirectoryWrapper(RAMDirectory@74ec7789 lockFactory=org.apache.lucene.store.SingleInstanceLockFactory@33a007b),segFN=segments_7,generation=7}
   [junit4]   2> 	commit{dir=MockDirectoryWrapper(RAMDirectory@74ec7789 lockFactory=org.apache.lucene.store.SingleInstanceLockFactory@33a007b),segFN=segments_8,generation=8}
   [junit4]   2> 70030 INFO  (TEST-BasicDistributedZkTest.test-seed#[EB42BF33E64AC3B0]) [n:127.0.0.1:46423_ c:collection1 s:shard1 r:core_node4 x:collection1] o.a.s.c.SolrCore newest commit generation = 8
   [junit4]   2> 70030 INFO  (zkCallback-54-thread-2-processing-n:127.0.0.1:46423_) [n:127.0.0.1:46423_    ] o.a.s.c.c.ZkStateReader Updating data for collection1 to ver 22 
   [junit4]   2> 70030 INFO  (TEST-BasicDistributedZkTest.test-seed#[EB42BF33E64AC3B0]) [n:127.0.0.1:46423_ c:collection1 s:shard1 r:core_node4 x:collection1] o.a.s.c.SolrCore [collection1] Closing main searcher on request.
   [junit4]   2> 70038 INFO  (TEST-BasicDistributedZkTest.test-seed#[EB42BF33E64AC3B0]) [n:127.0.0.1:46423_ c:collection1 s:shard1 r:core_node4 x:collection1] o.a.s.c.CachingDirectoryFactory Closing MockDirectoryFactory - 2 directories currently being tracked
   [junit4]   2> 70038 INFO  (TEST-BasicDistributedZkTest.test-seed#[EB42BF33E64AC3B0]) [n:127.0.0.1:46423_ c:collection1 s:shard1 r:core_node4 x:collection1] o.a.s.c.CachingDirectoryFactory looking to close /home/jenkins/workspace/Lucene-Solr-trunk-Linux/solr/build/solr-core/test/J0/../../../../../../../../../home/jenkins/workspace/Lucene-Solr-trunk-Linux/solr/build/solr-core/test/J0/temp/solr.cloud.BasicDistributedZkTest_EB42BF33E64AC3B0-001/shard-4-001/cores/collection1/data/index [CachedDir<<refCount=0;path=/home/jenkins/workspace/Lucene-Solr-trunk-Linux/solr/build/solr-core/test/J0/../../../../../../../../../home/jenkins/workspace/Lucene-Solr-trunk-Linux/solr/build/solr-core/test/J0/temp/solr.cloud.BasicDistributedZkTest_EB42BF33E64AC3B0-001/shard-4-001/cores/collection1/data/index;done=false>>]
   [junit4]   2> 70038 INFO  (TEST-BasicDistributedZkTest.test-seed#[EB42BF33E64AC3B0]) [n:127.0.0.1:46423_ c:collection1 s:shard1 r:core_node4 x:collection1] o.a.s.c.CachingDirectoryFactory Closing directory: /home/jenkins/workspace/Lucene-Solr-trunk-Linux/solr/build/solr-core/test/J0/../../../../../../../../../home/jenkins/workspace/Lucene-Solr-trunk-Linux/solr/build/solr-core/test/J0/temp/solr.cloud.BasicDistributedZkTest_EB42BF33E64AC3B0-001/shard-4-001/cores/collection1/data/index
   [junit4]   2> 70039 INFO  (TEST-BasicDistributedZkTest.test-seed#[EB42BF33E64AC3B0]) [n:127.0.0.1:46423_ c:collection1 s:shard1 r:core_node4 x:collection1] o.a.s.c.CachingDirectoryFactory looking to close /home/jenkins/workspace/Lucene-Solr-trunk-Linux/solr/build/solr-core/test/J0/../../../../../../../../../home/jenkins/workspace/Lucene-Solr-trunk-Linux/solr/build/solr-core/test/J0/temp/solr.cloud.BasicDistributedZkTest_EB42BF33E64AC3B0-001/shard-4-001/cores/collection1/data [CachedDir<<refCount=0;path=/home/jenkins/workspace/Lucene-Solr-trunk-Linux/solr/build/solr-core/test/J0/../../../../../../../../../home/jenkins/workspace/Lucene-Solr-trunk-Linux/solr/build/solr-core/test/J0/temp/solr.cloud.BasicDistributedZkTest_EB42BF33E64AC3B0-001/shard-4-001/cores/collection1/data;done=false>>]
   [junit4]   2> 70039 INFO  (TEST-BasicDistributedZkTest.test-seed#[EB42BF33E64AC3B0]) [n:127.0.0.1:46423_ c:collection1 s:shard1 r:core_node4 x:collection1] o.a.s.c.CachingDirectoryFactory Closing directory: /home/jenkins/workspace/Lucene-Solr-trunk-Linux/solr/build/solr-core/test/J0/../../../../../../../../../home/jenkins/workspace/Lucene-Solr-trunk-Linux/solr/build/solr-core/test/J0/temp/solr.cloud.BasicDistributedZkTest_EB42BF33E64AC3B0-001/shard-4-001/cores/collection1/data
   [junit4]   2> 70039 INFO  (TEST-BasicDistributedZkTest.test-seed#[EB42BF33E64AC3B0]) [n:127.0.0.1:46423_ c:collection1 s:shard1 r:core_node4 x:collection1] o.a.s.c.Overseer Overseer (id=94089479012745229-127.0.0.1:46423_-n_0000000004) closing
   [junit4]   2> 70040 INFO  (OverseerStateUpdate-94089479012745229-127.0.0.1:46423_-n_0000000004) [n:127.0.0.1:46423_    ] o.a.s.c.Overseer Overseer Loop exiting : 127.0.0.1:46423_
   [junit4]   2> 70041 WARN  (zkCallback-54-thread-2-processing-n:127.0.0.1:46423_) [n:127.0.0.1:46423_    ] o.a.s.c.c.ZkStateReader ZooKeeper watch triggered, but Solr cannot talk to ZK
   [junit4]   2> 70041 INFO  (TEST-BasicDistributedZkTest.test-seed#[EB42BF33E64AC3B0]) [    ] o.e.j.s.ServerConnector Stopped ServerConnector@455640c9{HTTP/1.1}{127.0.0.1:0}
   [junit4]   2> 70042 INFO  (TEST-BasicDistributedZkTest.test-seed#[EB42BF33E64AC3B0]) [    ] o.e.j.s.h.ContextHandler Stopped o.e.j.s.ServletContextHandler@77d46aeb{/,null,UNAVAILABLE}
   [junit4]   2> 70042 INFO  (TEST-BasicDistributedZkTest.test-seed#[EB42BF33E64AC3B0]) [n:127.0.0.1:46423_ c:collection1 s:shard1 r:core_node4 x:collection1] o.a.s.c.ZkTestServer connecting to 127.0.0.1:59133 59133
   [junit4]   2> 70144 INFO  (Thread-187) [    ] o.a.s.c.ZkTestServer connecting to 127.0.0.1:59133 59133
   [junit4]   2> 70144 WARN  (Thread-187) [    ] o.a.s.c.ZkTestServer Watch limit violations: 
   [junit4]   2> Maximum concurrent create/delete watches above limit:
   [junit4]   2> 
   [junit4]   2> 	7	/solr/aliases.json
   [junit4]   2> 	7	/solr/clusterstate.json
   [junit4]   2> 	5	/solr/configs/conf1
   [junit4]   2> 	4	/solr/collections/collection1/state.json
   [junit4]   2> 
   [junit4]   2> Maximum concurrent children watches above limit:
   [junit4]   2> 
   [junit4]   2> 	7	/solr/live_nodes
   [junit4]   2> 	4	/solr/overseer/queue
   [junit4]   2> 	4	/solr/overseer/collection-queue-work
   [junit4]   2> 
   [junit4]   2> NOTE: reproduce with: ant test  -Dtestcase=BasicDistributedZkTest -Dtests.method=test -Dtests.seed=EB42BF33E64AC3B0 -Dtests.multiplier=3 -Dtests.slow=true -Dtests.locale=iw_IL -Dtests.timezone=Pacific/Tarawa -Dtests.asserts=true -Dtests.file.encoding=US-ASCII
   [junit4] FAILURE 26.4s J0 | BasicDistributedZkTest.test <<<
   [junit4]    > Throwable #1: java.lang.AssertionError: commitWithin did not work on node: http://127.0.0.1:48815/collection1 expected:<68> but was:<67>
   [junit4]    > 	at __randomizedtesting.SeedInfo.seed([EB42BF33E64AC3B0:631680E948B6AE48]:0)
   [junit4]    > 	at org.apache.solr.cloud.BasicDistributedZkTest.test(BasicDistributedZkTest.java:332)
   [junit4]    > 	at org.apache.solr.BaseDistributedSearchTestCase$ShardsRepeatRule$ShardsFixedStatement.callStatement(BaseDistributedSearchTestCase.java:960)
   [junit4]    > 	at org.apache.solr.BaseDistributedSearchTestCase$ShardsRepeatRule$ShardsStatement.evaluate(BaseDistributedSearchTestCase.java:935)
   [junit4]    > 	at java.lang.Thread.run(Thread.java:745)
   [junit4]   2> 70164 INFO  (SUITE-BasicDistributedZkTest-seed#[EB42BF33E64AC3B0]-worker) [n:127.0.0.1:46423_ c:collection1 s:shard1 r:core_node4 x:collection1] o.a.s.SolrTestCaseJ4 ###deleteCore
   [junit4]   2> NOTE: leaving temporary files on disk at: /home/jenkins/workspace/Lucene-Solr-trunk-Linux/solr/build/solr-core/test/J0/temp/solr.cloud.BasicDistributedZkTest_EB42BF33E64AC3B0-001
   [junit4]   2> Jun 30, 2015 7:12:19 PM com.carrotsearch.randomizedtesting.ThreadLeakControl checkThreadLeaks
   [junit4]   2> WARNING: Will linger awaiting termination of 1 leaked thread(s).
   [junit4]   2> NOTE: test params are: codec=FastDecompressionCompressingStoredFields(storedFieldsFormat=CompressingStoredFieldsFormat(compressionMode=FAST_DECOMPRESSION, chunkSize=15825, maxDocsPerChunk=243, blockSize=6), termVectorsFormat=CompressingTermVectorsFormat(compressionMode=FAST_DECOMPRESSION, chunkSize=15825, blockSize=6)), sim=DefaultSimilarity, locale=iw_IL, timezone=Pacific/Tarawa
   [junit4]   2> NOTE: Linux 3.13.0-54-generic amd64/Oracle Corporation 1.9.0-ea (64-bit)/cpus=12,threads=1,free=298664152,total=482869248
   [junit4]   2> NOTE: All tests run in this JVM: [DistributedFacetPivotWhiteBoxTest, TestConfig, IndexBasedSpellCheckerTest, CachingDirectoryFactoryTest, TestJmxIntegration, CursorMarkTest, TestPostingsSolrHighlighter, TestConfigReload, BasicDistributedZkTest]
   [junit4] Completed [15/514] on J0 in 26.95s, 1 test, 1 failure <<< FAILURES!

[...truncated 1530 lines...]
BUILD FAILED
/home/jenkins/workspace/Lucene-Solr-trunk-Linux/build.xml:526: The following error occurred while executing this line:
/home/jenkins/workspace/Lucene-Solr-trunk-Linux/build.xml:474: The following error occurred while executing this line:
/home/jenkins/workspace/Lucene-Solr-trunk-Linux/build.xml:61: The following error occurred while executing this line:
/home/jenkins/workspace/Lucene-Solr-trunk-Linux/extra-targets.xml:39: The following error occurred while executing this line:
/home/jenkins/workspace/Lucene-Solr-trunk-Linux/solr/build.xml:230: The following error occurred while executing this line:
/home/jenkins/workspace/Lucene-Solr-trunk-Linux/solr/common-build.xml:513: The following error occurred while executing this line:
/home/jenkins/workspace/Lucene-Solr-trunk-Linux/lucene/common-build.xml:1426: The following error occurred while executing this line:
/home/jenkins/workspace/Lucene-Solr-trunk-Linux/lucene/common-build.xml:981: There were test failures: 514 suites, 2021 tests, 1 failure, 59 ignored (25 assumptions)

Total time: 40 minutes 16 seconds
Build step 'Invoke Ant' marked build as failure
Archiving artifacts
Recording test results
Email was triggered for: Failure - Any
Sending email for trigger: Failure - Any



Mime
View raw message