lucene-dev mailing list archives

Site index · List index
Message view « Date » · « Thread »
Top « Date » · « Thread »
From Apache Jenkins Server <jenk...@builds.apache.org>
Subject [JENKINS] Lucene-Solr-Tests-5.x-Java7 - Build # 3259 - Still Failing
Date Thu, 25 Jun 2015 14:25:47 GMT
Build: https://builds.apache.org/job/Lucene-Solr-Tests-5.x-Java7/3259/

2 tests failed.
REGRESSION:  org.apache.solr.search.TestHashQParserPlugin.testHashPartition

Error Message:
Query  does not implement createWeight

Stack Trace:
java.lang.UnsupportedOperationException: Query  does not implement createWeight
	at __randomizedtesting.SeedInfo.seed([2C733FFCE6B60D35:FDCE1E19DDDCB45E]:0)
	at org.apache.lucene.search.Query.createWeight(Query.java:79)
	at org.apache.lucene.search.IndexSearcher.createWeight(IndexSearcher.java:851)
	at org.apache.lucene.search.ConstantScoreQuery.createWeight(ConstantScoreQuery.java:117)
	at org.apache.solr.search.HashQParserPlugin$HashQuery.createWeight(HashQParserPlugin.java:151)
	at org.apache.lucene.search.IndexSearcher.createWeight(IndexSearcher.java:851)
	at org.apache.lucene.search.IndexSearcher.createNormalizedWeight(IndexSearcher.java:834)
	at org.apache.solr.search.SolrIndexSearcher.getProcessedFilter(SolrIndexSearcher.java:1146)
	at org.apache.solr.search.SolrIndexSearcher.getDocListNC(SolrIndexSearcher.java:1628)
	at org.apache.solr.search.SolrIndexSearcher.getDocListC(SolrIndexSearcher.java:1504)
	at org.apache.solr.search.SolrIndexSearcher.search(SolrIndexSearcher.java:561)
	at org.apache.solr.handler.component.QueryComponent.process(QueryComponent.java:518)
	at org.apache.solr.handler.component.SearchHandler.handleRequestBody(SearchHandler.java:277)
	at org.apache.solr.handler.RequestHandlerBase.handleRequest(RequestHandlerBase.java:143)
	at org.apache.solr.core.SolrCore.execute(SolrCore.java:2058)
	at org.apache.solr.util.TestHarness.query(TestHarness.java:320)
	at org.apache.solr.util.TestHarness.query(TestHarness.java:302)
	at org.apache.solr.search.TestHashQParserPlugin.testHashPartition(TestHashQParserPlugin.java:94)
	at sun.reflect.NativeMethodAccessorImpl.invoke0(Native Method)
	at sun.reflect.NativeMethodAccessorImpl.invoke(NativeMethodAccessorImpl.java:57)
	at sun.reflect.DelegatingMethodAccessorImpl.invoke(DelegatingMethodAccessorImpl.java:43)
	at java.lang.reflect.Method.invoke(Method.java:606)
	at com.carrotsearch.randomizedtesting.RandomizedRunner.invoke(RandomizedRunner.java:1627)
	at com.carrotsearch.randomizedtesting.RandomizedRunner$6.evaluate(RandomizedRunner.java:836)
	at com.carrotsearch.randomizedtesting.RandomizedRunner$7.evaluate(RandomizedRunner.java:872)
	at com.carrotsearch.randomizedtesting.RandomizedRunner$8.evaluate(RandomizedRunner.java:886)
	at com.carrotsearch.randomizedtesting.rules.SystemPropertiesRestoreRule$1.evaluate(SystemPropertiesRestoreRule.java:57)
	at org.apache.lucene.util.TestRuleSetupTeardownChained$1.evaluate(TestRuleSetupTeardownChained.java:50)
	at org.apache.lucene.util.AbstractBeforeAfterRule$1.evaluate(AbstractBeforeAfterRule.java:46)
	at org.apache.lucene.util.TestRuleThreadAndTestName$1.evaluate(TestRuleThreadAndTestName.java:49)
	at org.apache.lucene.util.TestRuleIgnoreAfterMaxFailures$1.evaluate(TestRuleIgnoreAfterMaxFailures.java:65)
	at org.apache.lucene.util.TestRuleMarkFailure$1.evaluate(TestRuleMarkFailure.java:48)
	at com.carrotsearch.randomizedtesting.rules.StatementAdapter.evaluate(StatementAdapter.java:36)
	at com.carrotsearch.randomizedtesting.ThreadLeakControl$StatementRunner.run(ThreadLeakControl.java:365)
	at com.carrotsearch.randomizedtesting.ThreadLeakControl.forkTimeoutingTask(ThreadLeakControl.java:798)
	at com.carrotsearch.randomizedtesting.ThreadLeakControl$3.evaluate(ThreadLeakControl.java:458)
	at com.carrotsearch.randomizedtesting.RandomizedRunner.runSingleTest(RandomizedRunner.java:845)
	at com.carrotsearch.randomizedtesting.RandomizedRunner$3.evaluate(RandomizedRunner.java:747)
	at com.carrotsearch.randomizedtesting.RandomizedRunner$4.evaluate(RandomizedRunner.java:781)
	at com.carrotsearch.randomizedtesting.RandomizedRunner$5.evaluate(RandomizedRunner.java:792)
	at com.carrotsearch.randomizedtesting.rules.StatementAdapter.evaluate(StatementAdapter.java:36)
	at com.carrotsearch.randomizedtesting.rules.SystemPropertiesRestoreRule$1.evaluate(SystemPropertiesRestoreRule.java:57)
	at org.apache.lucene.util.AbstractBeforeAfterRule$1.evaluate(AbstractBeforeAfterRule.java:46)
	at com.carrotsearch.randomizedtesting.rules.StatementAdapter.evaluate(StatementAdapter.java:36)
	at org.apache.lucene.util.TestRuleStoreClassName$1.evaluate(TestRuleStoreClassName.java:42)
	at com.carrotsearch.randomizedtesting.rules.NoShadowingOrOverridesOnMethodsRule$1.evaluate(NoShadowingOrOverridesOnMethodsRule.java:39)
	at com.carrotsearch.randomizedtesting.rules.NoShadowingOrOverridesOnMethodsRule$1.evaluate(NoShadowingOrOverridesOnMethodsRule.java:39)
	at com.carrotsearch.randomizedtesting.rules.StatementAdapter.evaluate(StatementAdapter.java:36)
	at com.carrotsearch.randomizedtesting.rules.StatementAdapter.evaluate(StatementAdapter.java:36)
	at com.carrotsearch.randomizedtesting.rules.StatementAdapter.evaluate(StatementAdapter.java:36)
	at org.apache.lucene.util.TestRuleAssertionsRequired$1.evaluate(TestRuleAssertionsRequired.java:54)
	at org.apache.lucene.util.TestRuleMarkFailure$1.evaluate(TestRuleMarkFailure.java:48)
	at org.apache.lucene.util.TestRuleIgnoreAfterMaxFailures$1.evaluate(TestRuleIgnoreAfterMaxFailures.java:65)
	at org.apache.lucene.util.TestRuleIgnoreTestSuites$1.evaluate(TestRuleIgnoreTestSuites.java:55)
	at com.carrotsearch.randomizedtesting.rules.StatementAdapter.evaluate(StatementAdapter.java:36)
	at com.carrotsearch.randomizedtesting.ThreadLeakControl$StatementRunner.run(ThreadLeakControl.java:365)
	at java.lang.Thread.run(Thread.java:745)


FAILED:  org.apache.solr.response.TestCustomDocTransformer.testCustomTransformer

Error Message:
Exception during query

Stack Trace:
java.lang.RuntimeException: Exception during query
	at __randomizedtesting.SeedInfo.seed([2C733FFCE6B60D35:7B1145D5CF675CBF]:0)
	at org.apache.solr.SolrTestCaseJ4.assertQ(SolrTestCaseJ4.java:770)
	at org.apache.solr.SolrTestCaseJ4.assertQ(SolrTestCaseJ4.java:737)
	at org.apache.solr.response.TestCustomDocTransformer.testCustomTransformer(TestCustomDocTransformer.java:67)
	at sun.reflect.NativeMethodAccessorImpl.invoke0(Native Method)
	at sun.reflect.NativeMethodAccessorImpl.invoke(NativeMethodAccessorImpl.java:57)
	at sun.reflect.DelegatingMethodAccessorImpl.invoke(DelegatingMethodAccessorImpl.java:43)
	at java.lang.reflect.Method.invoke(Method.java:606)
	at com.carrotsearch.randomizedtesting.RandomizedRunner.invoke(RandomizedRunner.java:1627)
	at com.carrotsearch.randomizedtesting.RandomizedRunner$6.evaluate(RandomizedRunner.java:836)
	at com.carrotsearch.randomizedtesting.RandomizedRunner$7.evaluate(RandomizedRunner.java:872)
	at com.carrotsearch.randomizedtesting.RandomizedRunner$8.evaluate(RandomizedRunner.java:886)
	at com.carrotsearch.randomizedtesting.rules.SystemPropertiesRestoreRule$1.evaluate(SystemPropertiesRestoreRule.java:57)
	at org.apache.lucene.util.TestRuleSetupTeardownChained$1.evaluate(TestRuleSetupTeardownChained.java:50)
	at org.apache.lucene.util.AbstractBeforeAfterRule$1.evaluate(AbstractBeforeAfterRule.java:46)
	at org.apache.lucene.util.TestRuleThreadAndTestName$1.evaluate(TestRuleThreadAndTestName.java:49)
	at org.apache.lucene.util.TestRuleIgnoreAfterMaxFailures$1.evaluate(TestRuleIgnoreAfterMaxFailures.java:65)
	at org.apache.lucene.util.TestRuleMarkFailure$1.evaluate(TestRuleMarkFailure.java:48)
	at com.carrotsearch.randomizedtesting.rules.StatementAdapter.evaluate(StatementAdapter.java:36)
	at com.carrotsearch.randomizedtesting.ThreadLeakControl$StatementRunner.run(ThreadLeakControl.java:365)
	at com.carrotsearch.randomizedtesting.ThreadLeakControl.forkTimeoutingTask(ThreadLeakControl.java:798)
	at com.carrotsearch.randomizedtesting.ThreadLeakControl$3.evaluate(ThreadLeakControl.java:458)
	at com.carrotsearch.randomizedtesting.RandomizedRunner.runSingleTest(RandomizedRunner.java:845)
	at com.carrotsearch.randomizedtesting.RandomizedRunner$3.evaluate(RandomizedRunner.java:747)
	at com.carrotsearch.randomizedtesting.RandomizedRunner$4.evaluate(RandomizedRunner.java:781)
	at com.carrotsearch.randomizedtesting.RandomizedRunner$5.evaluate(RandomizedRunner.java:792)
	at com.carrotsearch.randomizedtesting.rules.StatementAdapter.evaluate(StatementAdapter.java:36)
	at com.carrotsearch.randomizedtesting.rules.SystemPropertiesRestoreRule$1.evaluate(SystemPropertiesRestoreRule.java:57)
	at org.apache.lucene.util.AbstractBeforeAfterRule$1.evaluate(AbstractBeforeAfterRule.java:46)
	at com.carrotsearch.randomizedtesting.rules.StatementAdapter.evaluate(StatementAdapter.java:36)
	at org.apache.lucene.util.TestRuleStoreClassName$1.evaluate(TestRuleStoreClassName.java:42)
	at com.carrotsearch.randomizedtesting.rules.NoShadowingOrOverridesOnMethodsRule$1.evaluate(NoShadowingOrOverridesOnMethodsRule.java:39)
	at com.carrotsearch.randomizedtesting.rules.NoShadowingOrOverridesOnMethodsRule$1.evaluate(NoShadowingOrOverridesOnMethodsRule.java:39)
	at com.carrotsearch.randomizedtesting.rules.StatementAdapter.evaluate(StatementAdapter.java:36)
	at com.carrotsearch.randomizedtesting.rules.StatementAdapter.evaluate(StatementAdapter.java:36)
	at com.carrotsearch.randomizedtesting.rules.StatementAdapter.evaluate(StatementAdapter.java:36)
	at org.apache.lucene.util.TestRuleAssertionsRequired$1.evaluate(TestRuleAssertionsRequired.java:54)
	at org.apache.lucene.util.TestRuleMarkFailure$1.evaluate(TestRuleMarkFailure.java:48)
	at org.apache.lucene.util.TestRuleIgnoreAfterMaxFailures$1.evaluate(TestRuleIgnoreAfterMaxFailures.java:65)
	at org.apache.lucene.util.TestRuleIgnoreTestSuites$1.evaluate(TestRuleIgnoreTestSuites.java:55)
	at com.carrotsearch.randomizedtesting.rules.StatementAdapter.evaluate(StatementAdapter.java:36)
	at com.carrotsearch.randomizedtesting.ThreadLeakControl$StatementRunner.run(ThreadLeakControl.java:365)
	at java.lang.Thread.run(Thread.java:745)
Caused by: java.lang.RuntimeException: REQUEST FAILED: xpath=//str[.='xx#title_0#']
	xml response was: <?xml version="1.0" encoding="UTF-8"?>
<response>
<lst name="responseHeader"><int name="status">0</int><int name="QTime">0</int></lst><result name="response" numFound="10" start="0"><doc><int name="id">0</int><arr name="subject"><str>xx</str></arr><arr name="title"><str>title_0</str></arr><str name="out">title_0#xx#</str></doc><doc><int name="id">1</int><arr name="subject"><str>xx</str></arr><arr name="title"><str>title_1</str></arr><str name="out">title_1#xx#</str></doc><doc><int name="id">2</int><arr name="subject"><str>xx</str></arr><arr name="title"><str>title_2</str></arr><str name="out">title_2#xx#</str></doc><doc><int name="id">3</int><arr name="subject"><str>xx</str></arr><arr name="title"><str>title_3</str></arr><str name="out">title_3#xx#</str></doc><doc><int name="id">4</int><arr name="subject"><str>xx</str></arr><arr name="title"><str>title_4</str></arr><str name="out">title_4#xx#</str></doc><doc><int name="id">5</int><arr name="subject"><str>xx</str></arr><arr name="title"><str>title_5</str></arr><str name="out">title_5#xx#</str></doc><doc><int name="id">6</int><arr name="subject"><str>xx</str></arr><arr name="title"><str>title_6</str></arr><str name="out">title_6#xx#</str></doc><doc><int name="id">7</int><arr name="subject"><str>xx</str></arr><arr name="title"><str>title_7</str></arr><str name="out">title_7#xx#</str></doc><doc><int name="id">8</int><arr name="subject"><str>xx</str></arr><arr name="title"><str>title_8</str></arr><str name="out">title_8#xx#</str></doc><doc><int name="id">9</int><arr name="subject"><str>xx</str></arr><arr name="title"><str>title_9</str></arr><str name="out">title_9#xx#</str></doc></result>
</response>

	request was:fl=id,out:[custom+extra%3Dsubject,title]&wt=xml&q=*:*
	at org.apache.solr.SolrTestCaseJ4.assertQ(SolrTestCaseJ4.java:763)
	... 41 more




Build Log:
[...truncated 9856 lines...]
   [junit4] Suite: org.apache.solr.search.TestHashQParserPlugin
   [junit4]   2> Creating dataDir: /x1/jenkins/jenkins-slave/workspace/Lucene-Solr-Tests-5.x-Java7/solr/build/solr-core/test/J2/temp/solr.search.TestHashQParserPlugin_2C733FFCE6B60D35-001/init-core-data-001
   [junit4]   2> 303497 INFO  (SUITE-TestHashQParserPlugin-seed#[2C733FFCE6B60D35]-worker) [    ] o.a.s.SolrTestCaseJ4 Randomized ssl (false) and clientAuth (false)
   [junit4]   2> 303498 INFO  (SUITE-TestHashQParserPlugin-seed#[2C733FFCE6B60D35]-worker) [    ] o.a.s.SolrTestCaseJ4 ####initCore
   [junit4]   2> 303498 INFO  (SUITE-TestHashQParserPlugin-seed#[2C733FFCE6B60D35]-worker) [    ] o.a.s.c.SolrResourceLoader new SolrResourceLoader for directory: '/x1/jenkins/jenkins-slave/workspace/Lucene-Solr-Tests-5.x-Java7/solr/core/src/test-files/solr/collection1/'
   [junit4]   2> 303498 INFO  (SUITE-TestHashQParserPlugin-seed#[2C733FFCE6B60D35]-worker) [    ] o.a.s.c.SolrResourceLoader Adding 'file:/x1/jenkins/jenkins-slave/workspace/Lucene-Solr-Tests-5.x-Java7/solr/core/src/test-files/solr/collection1/lib/.svn/' to classloader
   [junit4]   2> 303498 INFO  (SUITE-TestHashQParserPlugin-seed#[2C733FFCE6B60D35]-worker) [    ] o.a.s.c.SolrResourceLoader Adding 'file:/x1/jenkins/jenkins-slave/workspace/Lucene-Solr-Tests-5.x-Java7/solr/core/src/test-files/solr/collection1/lib/classes/' to classloader
   [junit4]   2> 303499 INFO  (SUITE-TestHashQParserPlugin-seed#[2C733FFCE6B60D35]-worker) [    ] o.a.s.c.SolrResourceLoader Adding 'file:/x1/jenkins/jenkins-slave/workspace/Lucene-Solr-Tests-5.x-Java7/solr/core/src/test-files/solr/collection1/lib/README' to classloader
   [junit4]   2> 303523 INFO  (SUITE-TestHashQParserPlugin-seed#[2C733FFCE6B60D35]-worker) [    ] o.a.s.c.SolrConfig current version of requestparams : -1
   [junit4]   2> 303535 INFO  (SUITE-TestHashQParserPlugin-seed#[2C733FFCE6B60D35]-worker) [    ] o.a.s.c.SolrConfig Using Lucene MatchVersion: 5.3.0
   [junit4]   2> 303562 INFO  (SUITE-TestHashQParserPlugin-seed#[2C733FFCE6B60D35]-worker) [    ] o.a.s.c.Config Loaded SolrConfig: solrconfig-hash.xml
   [junit4]   2> 303562 INFO  (SUITE-TestHashQParserPlugin-seed#[2C733FFCE6B60D35]-worker) [    ] o.a.s.s.IndexSchema Reading Solr Schema from /x1/jenkins/jenkins-slave/workspace/Lucene-Solr-Tests-5.x-Java7/solr/core/src/test-files/solr/collection1/conf/schema-hash.xml
   [junit4]   2> 303569 INFO  (SUITE-TestHashQParserPlugin-seed#[2C733FFCE6B60D35]-worker) [    ] o.a.s.s.IndexSchema [null] Schema name=test
   [junit4]   2> 303760 INFO  (SUITE-TestHashQParserPlugin-seed#[2C733FFCE6B60D35]-worker) [    ] o.a.s.s.IndexSchema default search field in schema is text
   [junit4]   2> 303761 INFO  (SUITE-TestHashQParserPlugin-seed#[2C733FFCE6B60D35]-worker) [    ] o.a.s.s.IndexSchema unique key field: id
   [junit4]   2> 303762 WARN  (SUITE-TestHashQParserPlugin-seed#[2C733FFCE6B60D35]-worker) [    ] o.a.s.s.IndexSchema Field text is not multivalued and destination for multiple copyFields (3)
   [junit4]   2> 303762 WARN  (SUITE-TestHashQParserPlugin-seed#[2C733FFCE6B60D35]-worker) [    ] o.a.s.s.IndexSchema Field lowerfilt1and2 is not multivalued and destination for multiple copyFields (2)
   [junit4]   2> 303763 INFO  (SUITE-TestHashQParserPlugin-seed#[2C733FFCE6B60D35]-worker) [    ] o.a.s.c.SolrResourceLoader JNDI not configured for solr (NoInitialContextEx)
   [junit4]   2> 303763 INFO  (SUITE-TestHashQParserPlugin-seed#[2C733FFCE6B60D35]-worker) [    ] o.a.s.c.SolrResourceLoader using system property solr.solr.home: /x1/jenkins/jenkins-slave/workspace/Lucene-Solr-Tests-5.x-Java7/solr/core/src/test-files/solr
   [junit4]   2> 303763 INFO  (SUITE-TestHashQParserPlugin-seed#[2C733FFCE6B60D35]-worker) [    ] o.a.s.c.SolrResourceLoader new SolrResourceLoader for directory: '/x1/jenkins/jenkins-slave/workspace/Lucene-Solr-Tests-5.x-Java7/solr/core/src/test-files/solr/'
   [junit4]   2> 303776 INFO  (SUITE-TestHashQParserPlugin-seed#[2C733FFCE6B60D35]-worker) [    ] o.a.s.c.CoreContainer New CoreContainer 1005097399
   [junit4]   2> 303776 INFO  (SUITE-TestHashQParserPlugin-seed#[2C733FFCE6B60D35]-worker) [    ] o.a.s.c.CoreContainer Loading cores into CoreContainer [instanceDir=/x1/jenkins/jenkins-slave/workspace/Lucene-Solr-Tests-5.x-Java7/solr/core/src/test-files/solr/]
   [junit4]   2> 303776 INFO  (SUITE-TestHashQParserPlugin-seed#[2C733FFCE6B60D35]-worker) [    ] o.a.s.c.CoreContainer loading shared library: /x1/jenkins/jenkins-slave/workspace/Lucene-Solr-Tests-5.x-Java7/solr/core/src/test-files/solr/lib
   [junit4]   2> 303776 WARN  (SUITE-TestHashQParserPlugin-seed#[2C733FFCE6B60D35]-worker) [    ] o.a.s.c.SolrResourceLoader Can't find (or read) directory to add to classloader: lib (resolved as: /x1/jenkins/jenkins-slave/workspace/Lucene-Solr-Tests-5.x-Java7/solr/core/src/test-files/solr/lib).
   [junit4]   2> 303783 INFO  (SUITE-TestHashQParserPlugin-seed#[2C733FFCE6B60D35]-worker) [    ] o.a.s.h.c.HttpShardHandlerFactory created with socketTimeout : 600000,connTimeout : 60000,maxConnectionsPerHost : 20,maxConnections : 10000,corePoolSize : 0,maximumPoolSize : 2147483647,maxThreadIdleTime : 5,sizeOfQueue : -1,fairnessPolicy : false,useRetries : false,
   [junit4]   2> 303784 INFO  (SUITE-TestHashQParserPlugin-seed#[2C733FFCE6B60D35]-worker) [    ] o.a.s.u.UpdateShardHandler Creating UpdateShardHandler HTTP client with params: socketTimeout=30000&connTimeout=30000&retry=true
   [junit4]   2> 303785 INFO  (SUITE-TestHashQParserPlugin-seed#[2C733FFCE6B60D35]-worker) [    ] o.a.s.l.LogWatcher SLF4J impl is org.slf4j.impl.Log4jLoggerFactory
   [junit4]   2> 303785 INFO  (SUITE-TestHashQParserPlugin-seed#[2C733FFCE6B60D35]-worker) [    ] o.a.s.l.LogWatcher Registering Log Listener [Log4j (org.slf4j.impl.Log4jLoggerFactory)]
   [junit4]   2> 303785 INFO  (SUITE-TestHashQParserPlugin-seed#[2C733FFCE6B60D35]-worker) [    ] o.a.s.c.CoreContainer No authentication plugin used.
   [junit4]   2> 303786 INFO  (SUITE-TestHashQParserPlugin-seed#[2C733FFCE6B60D35]-worker) [    ] o.a.s.c.SolrCore Created CoreDescriptor: {instanceDir=collection1, schema=schema-hash.xml, config=solrconfig-hash.xml, dataDir=/x1/jenkins/jenkins-slave/workspace/Lucene-Solr-Tests-5.x-Java7/solr/build/solr-core/test/J2/temp/solr.search.TestHashQParserPlugin_2C733FFCE6B60D35-001/init-core-data-001, shard=shard1, loadOnStartup=true, collection=collection1, absoluteInstDir=/x1/jenkins/jenkins-slave/workspace/Lucene-Solr-Tests-5.x-Java7/solr/core/src/test-files/solr/collection1/, name=collection1, transient=false}
   [junit4]   2> 303787 INFO  (coreLoadExecutor-1199-thread-1) [    ] o.a.s.c.SolrResourceLoader new SolrResourceLoader for directory: '/x1/jenkins/jenkins-slave/workspace/Lucene-Solr-Tests-5.x-Java7/solr/core/src/test-files/solr/collection1/'
   [junit4]   2> 303787 INFO  (coreLoadExecutor-1199-thread-1) [    ] o.a.s.c.SolrResourceLoader Adding 'file:/x1/jenkins/jenkins-slave/workspace/Lucene-Solr-Tests-5.x-Java7/solr/core/src/test-files/solr/collection1/lib/.svn/' to classloader
   [junit4]   2> 303787 INFO  (coreLoadExecutor-1199-thread-1) [    ] o.a.s.c.SolrResourceLoader Adding 'file:/x1/jenkins/jenkins-slave/workspace/Lucene-Solr-Tests-5.x-Java7/solr/core/src/test-files/solr/collection1/lib/classes/' to classloader
   [junit4]   2> 303788 INFO  (coreLoadExecutor-1199-thread-1) [    ] o.a.s.c.SolrResourceLoader Adding 'file:/x1/jenkins/jenkins-slave/workspace/Lucene-Solr-Tests-5.x-Java7/solr/core/src/test-files/solr/collection1/lib/README' to classloader
   [junit4]   2> 303806 INFO  (coreLoadExecutor-1199-thread-1) [    ] o.a.s.c.SolrConfig current version of requestparams : -1
   [junit4]   2> 303817 INFO  (coreLoadExecutor-1199-thread-1) [    ] o.a.s.c.SolrConfig Using Lucene MatchVersion: 5.3.0
   [junit4]   2> 303841 INFO  (coreLoadExecutor-1199-thread-1) [    ] o.a.s.c.Config Loaded SolrConfig: solrconfig-hash.xml
   [junit4]   2> 303842 INFO  (coreLoadExecutor-1199-thread-1) [    ] o.a.s.s.IndexSchema Reading Solr Schema from /x1/jenkins/jenkins-slave/workspace/Lucene-Solr-Tests-5.x-Java7/solr/core/src/test-files/solr/collection1/conf/schema-hash.xml
   [junit4]   2> 303860 INFO  (coreLoadExecutor-1199-thread-1) [    ] o.a.s.s.IndexSchema [collection1] Schema name=test
   [junit4]   2> 304033 INFO  (coreLoadExecutor-1199-thread-1) [    ] o.a.s.s.IndexSchema default search field in schema is text
   [junit4]   2> 304034 INFO  (coreLoadExecutor-1199-thread-1) [    ] o.a.s.s.IndexSchema unique key field: id
   [junit4]   2> 304035 WARN  (coreLoadExecutor-1199-thread-1) [    ] o.a.s.s.IndexSchema Field lowerfilt1and2 is not multivalued and destination for multiple copyFields (2)
   [junit4]   2> 304035 WARN  (coreLoadExecutor-1199-thread-1) [    ] o.a.s.s.IndexSchema Field text is not multivalued and destination for multiple copyFields (3)
   [junit4]   2> 304036 INFO  (coreLoadExecutor-1199-thread-1) [    ] o.a.s.c.CoreContainer Creating SolrCore 'collection1' using configuration from instancedir /x1/jenkins/jenkins-slave/workspace/Lucene-Solr-Tests-5.x-Java7/solr/core/src/test-files/solr/collection1/
   [junit4]   2> 304036 INFO  (coreLoadExecutor-1199-thread-1) [    x:collection1] o.a.s.c.SolrCore org.apache.solr.core.MockDirectoryFactory
   [junit4]   2> 304036 INFO  (coreLoadExecutor-1199-thread-1) [    x:collection1] o.a.s.c.SolrCore [[collection1] ] Opening new SolrCore at [/x1/jenkins/jenkins-slave/workspace/Lucene-Solr-Tests-5.x-Java7/solr/core/src/test-files/solr/collection1/], dataDir=[null]
   [junit4]   2> 304036 INFO  (coreLoadExecutor-1199-thread-1) [    x:collection1] o.a.s.c.SolrCore JMX monitoring not detected for core: collection1
   [junit4]   2> 304037 INFO  (coreLoadExecutor-1199-thread-1) [    x:collection1] o.a.s.c.CachingDirectoryFactory return new directory for /x1/jenkins/jenkins-slave/workspace/Lucene-Solr-Tests-5.x-Java7/solr/build/solr-core/test/J2/temp/solr.search.TestHashQParserPlugin_2C733FFCE6B60D35-001/init-core-data-001
   [junit4]   2> 304037 INFO  (coreLoadExecutor-1199-thread-1) [    x:collection1] o.a.s.c.SolrCore New index directory detected: old=null new=/x1/jenkins/jenkins-slave/workspace/Lucene-Solr-Tests-5.x-Java7/solr/build/solr-core/test/J2/temp/solr.search.TestHashQParserPlugin_2C733FFCE6B60D35-001/init-core-data-001/index/
   [junit4]   2> 304037 WARN  (coreLoadExecutor-1199-thread-1) [    x:collection1] o.a.s.c.SolrCore [collection1] Solr index directory '/x1/jenkins/jenkins-slave/workspace/Lucene-Solr-Tests-5.x-Java7/solr/build/solr-core/test/J2/temp/solr.search.TestHashQParserPlugin_2C733FFCE6B60D35-001/init-core-data-001/index' doesn't exist. Creating new index...
   [junit4]   2> 304037 INFO  (coreLoadExecutor-1199-thread-1) [    x:collection1] o.a.s.c.CachingDirectoryFactory return new directory for /x1/jenkins/jenkins-slave/workspace/Lucene-Solr-Tests-5.x-Java7/solr/build/solr-core/test/J2/temp/solr.search.TestHashQParserPlugin_2C733FFCE6B60D35-001/init-core-data-001/index
   [junit4]   2> 304038 INFO  (coreLoadExecutor-1199-thread-1) [    x:collection1] o.a.s.c.SolrCore SolrDeletionPolicy.onCommit: commits: num=1
   [junit4]   2> 	commit{dir=MockDirectoryWrapper(RAMDirectory@6b5fac73 lockFactory=org.apache.lucene.store.SingleInstanceLockFactory@5632e917),segFN=segments_1,generation=1}
   [junit4]   2> 304038 INFO  (coreLoadExecutor-1199-thread-1) [    x:collection1] o.a.s.c.SolrCore newest commit generation = 1
   [junit4]   2> 304038 INFO  (OldIndexDirectoryCleanupThreadForCore-collection1) [    x:collection1] o.a.s.c.SolrCore Looking for old index directories to cleanup for core collection1 in /x1/jenkins/jenkins-slave/workspace/Lucene-Solr-Tests-5.x-Java7/solr/build/solr-core/test/J2/temp/solr.search.TestHashQParserPlugin_2C733FFCE6B60D35-001/init-core-data-001/
   [junit4]   2> 304040 INFO  (coreLoadExecutor-1199-thread-1) [    x:collection1] o.a.s.c.SolrCore no updateRequestProcessorChain defined as default, creating implicit default
   [junit4]   2> 304043 INFO  (coreLoadExecutor-1199-thread-1) [    x:collection1] o.a.s.h.l.XMLLoader xsltCacheLifetimeSeconds=60
   [junit4]   2> 304044 INFO  (coreLoadExecutor-1199-thread-1) [    x:collection1] o.a.s.h.l.XMLLoader xsltCacheLifetimeSeconds=60
   [junit4]   2> 304045 INFO  (coreLoadExecutor-1199-thread-1) [    x:collection1] o.a.s.h.l.XMLLoader xsltCacheLifetimeSeconds=60
   [junit4]   2> 304046 INFO  (coreLoadExecutor-1199-thread-1) [    x:collection1] o.a.s.h.l.XMLLoader xsltCacheLifetimeSeconds=60
   [junit4]   2> 304057 INFO  (coreLoadExecutor-1199-thread-1) [    x:collection1] o.a.s.c.RequestHandlers Registered paths: /update/json,/config,/update/json/docs,/admin/file,/update,standard,/admin/segments,/admin/system,/admin/ping,/replication,/get,/admin/mbeans,/update/csv,/schema,/admin/logging,/stream,/admin/properties,/admin/plugins,,/admin/threads,/admin/luke
   [junit4]   2> 304057 WARN  (coreLoadExecutor-1199-thread-1) [    x:collection1] o.a.s.c.RequestHandlers no default request handler is registered (either '/select' or 'standard')
   [junit4]   2> 304058 INFO  (coreLoadExecutor-1199-thread-1) [    x:collection1] o.a.s.c.SolrCore Using default statsCache cache: org.apache.solr.search.stats.LocalStatsCache
   [junit4]   2> 304059 INFO  (coreLoadExecutor-1199-thread-1) [    x:collection1] o.a.s.u.UpdateHandler Using UpdateLog implementation: org.apache.solr.update.UpdateLog
   [junit4]   2> 304059 INFO  (coreLoadExecutor-1199-thread-1) [    x:collection1] o.a.s.u.UpdateLog Initializing UpdateLog: dataDir= defaultSyncLevel=FLUSH numRecordsToKeep=100 maxNumLogsToKeep=10 numVersionBuckets=65536
   [junit4]   2> 304060 INFO  (coreLoadExecutor-1199-thread-1) [    x:collection1] o.a.s.c.SolrCore Hard AutoCommit: disabled
   [junit4]   2> 304060 INFO  (coreLoadExecutor-1199-thread-1) [    x:collection1] o.a.s.c.SolrCore Soft AutoCommit: disabled
   [junit4]   2> 304060 INFO  (coreLoadExecutor-1199-thread-1) [    x:collection1] o.a.s.c.SolrCore SolrDeletionPolicy.onInit: commits: num=1
   [junit4]   2> 	commit{dir=MockDirectoryWrapper(RAMDirectory@6b5fac73 lockFactory=org.apache.lucene.store.SingleInstanceLockFactory@5632e917),segFN=segments_1,generation=1}
   [junit4]   2> 304060 INFO  (coreLoadExecutor-1199-thread-1) [    x:collection1] o.a.s.c.SolrCore newest commit generation = 1
   [junit4]   2> 304061 INFO  (coreLoadExecutor-1199-thread-1) [    x:collection1] o.a.s.s.SolrIndexSearcher Opening Searcher@3fd5f8da[collection1] main
   [junit4]   2> 304061 WARN  (coreLoadExecutor-1199-thread-1) [    x:collection1] o.a.s.r.ManagedResourceStorage Cannot write to config directory /x1/jenkins/jenkins-slave/workspace/Lucene-Solr-Tests-5.x-Java7/solr/core/src/test-files/solr/collection1/conf; switching to use InMemory storage instead.
   [junit4]   2> 304061 INFO  (coreLoadExecutor-1199-thread-1) [    x:collection1] o.a.s.r.RestManager Initializing RestManager with initArgs: {}
   [junit4]   2> 304061 INFO  (coreLoadExecutor-1199-thread-1) [    x:collection1] o.a.s.r.ManagedResourceStorage Reading _rest_managed.json using InMemoryStorage
   [junit4]   2> 304061 INFO  (coreLoadExecutor-1199-thread-1) [    x:collection1] o.a.s.r.RestManager Initializing 0 registered ManagedResources
   [junit4]   2> 304061 INFO  (coreLoadExecutor-1199-thread-1) [    x:collection1] o.a.s.h.ReplicationHandler Commits will be reserved for  10000
   [junit4]   2> 304069 INFO  (coreLoadExecutor-1199-thread-1) [    x:collection1] o.a.s.u.UpdateLog Looking up max value of version field to seed version buckets
   [junit4]   2> 304069 INFO  (searcherExecutor-1200-thread-1-processing-x:collection1) [    x:collection1] o.a.s.c.SolrCore [collection1] Registered new searcher Searcher@3fd5f8da[collection1] main{ExitableDirectoryReader(UninvertingDirectoryReader())}
   [junit4]   2> 304069 INFO  (coreLoadExecutor-1199-thread-1) [    x:collection1] o.a.s.u.VersionInfo Refreshing highest value of _version_ for 65536 version buckets from index
   [junit4]   2> 304069 INFO  (coreLoadExecutor-1199-thread-1) [    x:collection1] o.a.s.u.VersionInfo No terms found for _version_, cannot seed version bucket highest value from index
   [junit4]   2> 304069 INFO  (coreLoadExecutor-1199-thread-1) [    x:collection1] o.a.s.u.UpdateLog Could not find max version in index or recent updates, using new clock 1504958995984547840
   [junit4]   2> 304071 INFO  (coreLoadExecutor-1199-thread-1) [    x:collection1] o.a.s.u.UpdateLog Took 2 ms to seed version buckets with highest version 1504958995984547840
   [junit4]   2> 304071 INFO  (coreLoadExecutor-1199-thread-1) [    x:collection1] o.a.s.c.CoreContainer registering core: collection1
   [junit4]   2> 304073 INFO  (SUITE-TestHashQParserPlugin-seed#[2C733FFCE6B60D35]-worker) [    ] o.a.s.SolrTestCaseJ4 ####initCore end
   [junit4]   2> 304077 INFO  (TEST-TestHashQParserPlugin.testHashPartition-seed#[2C733FFCE6B60D35]) [    ] o.a.s.SolrTestCaseJ4 ###Starting testHashPartition
   [junit4]   2> 304080 INFO  (TEST-TestHashQParserPlugin.testHashPartition-seed#[2C733FFCE6B60D35]) [    ] o.a.s.u.p.LogUpdateProcessor [collection1] webapp=null path=null params={} {deleteByQuery=*:* (-1504958995992936448)} 0 2
   [junit4]   2> 304083 INFO  (TEST-TestHashQParserPlugin.testHashPartition-seed#[2C733FFCE6B60D35]) [    ] o.a.s.u.UpdateHandler start commit{,optimize=false,openSearcher=true,waitSearcher=true,expungeDeletes=false,softCommit=false,prepareCommit=false}
   [junit4]   2> 304084 INFO  (TEST-TestHashQParserPlugin.testHashPartition-seed#[2C733FFCE6B60D35]) [    ] o.a.s.u.UpdateHandler No uncommitted changes. Skipping IW.commit.
   [junit4]   2> 304084 INFO  (TEST-TestHashQParserPlugin.testHashPartition-seed#[2C733FFCE6B60D35]) [    ] o.a.s.c.SolrCore SolrIndexSearcher has not changed - not re-opening: org.apache.solr.search.SolrIndexSearcher
   [junit4]   2> 304084 INFO  (TEST-TestHashQParserPlugin.testHashPartition-seed#[2C733FFCE6B60D35]) [    ] o.a.s.u.UpdateHandler end_commit_flush
   [junit4]   2> 304085 INFO  (TEST-TestHashQParserPlugin.testHashPartition-seed#[2C733FFCE6B60D35]) [    ] o.a.s.u.p.LogUpdateProcessor [collection1] webapp=null path=null params={} {commit=} 0 1
   [junit4]   2> 304087 INFO  (TEST-TestHashQParserPlugin.testHashPartition-seed#[2C733FFCE6B60D35]) [    ] o.a.s.u.p.LogUpdateProcessor [collection1] webapp=null path=null params={} {add=[305464 (1504958996002373632)]} 0 1
   [junit4]   2> 304088 INFO  (TEST-TestHashQParserPlugin.testHashPartition-seed#[2C733FFCE6B60D35]) [    ] o.a.s.u.UpdateHandler start commit{,optimize=false,openSearcher=true,waitSearcher=true,expungeDeletes=false,softCommit=false,prepareCommit=false}
   [junit4]   2> 304090 INFO  (TEST-TestHashQParserPlugin.testHashPartition-seed#[2C733FFCE6B60D35]) [    ] o.a.s.c.SolrCore SolrDeletionPolicy.onCommit: commits: num=2
   [junit4]   2> 	commit{dir=MockDirectoryWrapper(RAMDirectory@6b5fac73 lockFactory=org.apache.lucene.store.SingleInstanceLockFactory@5632e917),segFN=segments_1,generation=1}
   [junit4]   2> 	commit{dir=MockDirectoryWrapper(RAMDirectory@6b5fac73 lockFactory=org.apache.lucene.store.SingleInstanceLockFactory@5632e917),segFN=segments_2,generation=2}
   [junit4]   2> 304091 INFO  (TEST-TestHashQParserPlugin.testHashPartition-seed#[2C733FFCE6B60D35]) [    ] o.a.s.c.SolrCore newest commit generation = 2
   [junit4]   2> 304092 INFO  (TEST-TestHashQParserPlugin.testHashPartition-seed#[2C733FFCE6B60D35]) [    ] o.a.s.s.SolrIndexSearcher Opening Searcher@1779b16d[collection1] main
   [junit4]   2> 304092 INFO  (TEST-TestHashQParserPlugin.testHashPartition-seed#[2C733FFCE6B60D35]) [    ] o.a.s.u.UpdateHandler end_commit_flush
   [junit4]   2> 304092 INFO  (searcherExecutor-1200-thread-1) [    ] o.a.s.c.SolrCore [collection1] Registered new searcher Searcher@1779b16d[collection1] main{ExitableDirectoryReader(UninvertingDirectoryReader(Uninverting(_0(5.3.0):C1)))}
   [junit4]   2> 304092 INFO  (TEST-TestHashQParserPlugin.testHashPartition-seed#[2C733FFCE6B60D35]) [    ] o.a.s.u.p.LogUpdateProcessor [collection1] webapp=null path=null params={} {commit=} 0 4
   [junit4]   2> 304095 INFO  (TEST-TestHashQParserPlugin.testHashPartition-seed#[2C733FFCE6B60D35]) [    ] o.a.s.u.p.LogUpdateProcessor [collection1] webapp=null path=null params={} {add=[704234 (1504958996009713664)]} 0 1
   [junit4]   2> 304096 INFO  (TEST-TestHashQParserPlugin.testHashPartition-seed#[2C733FFCE6B60D35]) [    ] o.a.s.u.p.LogUpdateProcessor [collection1] webapp=null path=null params={} {add=[382962 (1504958996012859392)]} 0 0
   [junit4]   2> 304097 INFO  (TEST-TestHashQParserPlugin.testHashPartition-seed#[2C733FFCE6B60D35]) [    ] o.a.s.u.p.LogUpdateProcessor [collection1] webapp=null path=null params={} {add=[89887 (1504958996013907968)]} 0 0
   [junit4]   2> 304099 INFO  (TEST-TestHashQParserPlugin.testHashPartition-seed#[2C733FFCE6B60D35]) [    ] o.a.s.u.p.LogUpdateProcessor [collection1] webapp=null path=null params={} {add=[502136 (1504958996014956544)]} 0 0
   [junit4]   2> 304100 INFO  (TEST-TestHashQParserPlugin.testHashPartition-seed#[2C733FFCE6B60D35]) [    ] o.a.s.u.p.LogUpdateProcessor [collection1] webapp=null path=null params={} {add=[711049 (1504958996017053696)]} 0 0
   [junit4]   2> 304101 INFO  (TEST-TestHashQParserPlugin.testHashPartition-seed#[2C733FFCE6B60D35]) [    ] o.a.s.u.p.LogUpdateProcessor [collection1] webapp=null path=null params={} {add=[956965 (1504958996018102272)]} 0 0
   [junit4]   2> 304102 INFO  (TEST-TestHashQParserPlugin.testHashPartition-seed#[2C733FFCE6B60D35]) [    ] o.a.s.u.p.LogUpdateProcessor [collection1] webapp=null path=null params={} {add=[936929 (1504958996019150848)]} 0 0
   [junit4]   2> 304103 INFO  (TEST-TestHashQParserPlugin.testHashPartition-seed#[2C733FFCE6B60D35]) [    ] o.a.s.u.p.LogUpdateProcessor [collection1] webapp=null path=null params={} {add=[481659 (1504958996020199424)]} 0 0
   [junit4]   2> 304104 INFO  (TEST-TestHashQParserPlugin.testHashPartition-seed#[2C733FFCE6B60D35]) [    ] o.a.s.u.p.LogUpdateProcessor [collection1] webapp=null path=null params={} {add=[749780 (1504958996021248000)]} 0 0
   [junit4]   2> 304106 INFO  (TEST-TestHashQParserPlugin.testHashPartition-seed#[2C733FFCE6B60D35]) [    ] o.a.s.u.p.LogUpdateProcessor [collection1] webapp=null path=null params={} {add=[247260 (1504958996022296576)]} 0 0
   [junit4]   2> 304107 INFO  (TEST-TestHashQParserPlugin.testHashPartition-seed#[2C733FFCE6B60D35]) [    ] o.a.s.u.UpdateHandler start commit{,optimize=false,openSearcher=true,waitSearcher=true,expungeDeletes=false,softCommit=false,prepareCommit=false}
   [junit4]   2> 304111 INFO  (TEST-TestHashQParserPlugin.testHashPartition-seed#[2C733FFCE6B60D35]) [    ] o.a.s.c.SolrCore SolrDeletionPolicy.onCommit: commits: num=2
   [junit4]   2> 	commit{dir=MockDirectoryWrapper(RAMDirectory@6b5fac73 lockFactory=org.apache.lucene.store.SingleInstanceLockFactory@5632e917),segFN=segments_2,generation=2}
   [junit4]   2> 	commit{dir=MockDirectoryWrapper(RAMDirectory@6b5fac73 lockFactory=org.apache.lucene.store.SingleInstanceLockFactory@5632e917),segFN=segments_3,generation=3}
   [junit4]   2> 304111 INFO  (TEST-TestHashQParserPlugin.testHashPartition-seed#[2C733FFCE6B60D35]) [    ] o.a.s.c.SolrCore newest commit generation = 3
   [junit4]   2> 304111 INFO  (TEST-TestHashQParserPlugin.testHashPartition-seed#[2C733FFCE6B60D35]) [    ] o.a.s.s.SolrIndexSearcher Opening Searcher@778cbf11[collection1] main
   [junit4]   2> 304112 INFO  (searcherExecutor-1200-thread-1) [    ] o.a.s.c.SolrCore [collection1] Registered new searcher Searcher@778cbf11[collection1] main{ExitableDirectoryReader(UninvertingDirectoryReader(Uninverting(_0(5.3.0):C1) Uninverting(_1(5.3.0):C10)))}
   [junit4]   2> 304112 INFO  (TEST-TestHashQParserPlugin.testHashPartition-seed#[2C733FFCE6B60D35]) [    ] o.a.s.u.UpdateHandler end_commit_flush
   [junit4]   2> 304113 INFO  (TEST-TestHashQParserPlugin.testHashPartition-seed#[2C733FFCE6B60D35]) [    ] o.a.s.u.p.LogUpdateProcessor [collection1] webapp=null path=null params={} {commit=} 0 6
   [junit4]   2> 304124 INFO  (TEST-TestHashQParserPlugin.testHashPartition-seed#[2C733FFCE6B60D35]) [    ] o.a.s.u.p.LogUpdateProcessor [collection1] webapp=null path=null params={} {add=[78345 (1504958996031733760)]} 0 10
   [junit4]   2> 304126 INFO  (TEST-TestHashQParserPlugin.testHashPartition-seed#[2C733FFCE6B60D35]) [    ] o.a.s.u.p.LogUpdateProcessor [collection1] webapp=null path=null params={} {add=[306988 (1504958996043268096)]} 0 0
   [junit4]   2> 304127 INFO  (TEST-TestHashQParserPlugin.testHashPartition-seed#[2C733FFCE6B60D35]) [    ] o.a.s.u.p.LogUpdateProcessor [collection1] webapp=null path=null params={} {add=[469609 (1504958996045365248)]} 0 0
   [junit4]   2> 304129 INFO  (TEST-TestHashQParserPlugin.testHashPartition-seed#[2C733FFCE6B60D35]) [    ] o.a.s.u.p.LogUpdateProcessor [collection1] webapp=null path=null params={} {add=[455887 (1504958996046413824)]} 0 0
   [junit4]   2> 304130 INFO  (TEST-TestHashQParserPlugin.testHashPartition-seed#[2C733FFCE6B60D35]) [    ] o.a.s.u.p.LogUpdateProcessor [collection1] webapp=null path=null params={} {add=[541571 (1504958996048510976)]} 0 0
   [junit4]   2> 304131 INFO  (TEST-TestHashQParserPlugin.testHashPartition-seed#[2C733FFCE6B60D35]) [    ] o.a.s.u.p.LogUpdateProcessor [collection1] webapp=null path=null params={} {add=[933977 (1504958996049559552)]} 0 0
   [junit4]   2> 304133 INFO  (TEST-TestHashQParserPlugin.testHashPartition-seed#[2C733FFCE6B60D35]) [    ] o.a.s.u.p.LogUpdateProcessor [collection1] webapp=null path=null params={} {add=[550876 (1504958996050608128)]} 0 0
   [junit4]   2> 304134 INFO  (TEST-TestHashQParserPlugin.testHashPartition-seed#[2C733FFCE6B60D35]) [    ] o.a.s.u.p.LogUpdateProcessor [collection1] webapp=null path=null params={} {add=[693215 (1504958996052705280)]} 0 0
   [junit4]   2> 304135 INFO  (TEST-TestHashQParserPlugin.testHashPartition-seed#[2C733FFCE6B60D35]) [    ] o.a.s.u.p.LogUpdateProcessor [collection1] webapp=null path=null params={} {add=[672907 (1504958996053753856)]} 0 0
   [junit4]   2> 304136 INFO  (TEST-TestHashQParserPlugin.testHashPartition-seed#[2C733FFCE6B60D35]) [    ] o.a.s.u.p.LogUpdateProcessor [collection1] webapp=null path=null params={} {add=[484741 (1504958996054802432)]} 0 0
   [junit4]   2> 304137 INFO  (TEST-TestHashQParserPlugin.testHashPartition-seed#[2C733FFCE6B60D35]) [    ] o.a.s.u.UpdateHandler start commit{,optimize=false,openSearcher=true,waitSearcher=true,expungeDeletes=false,softCommit=false,prepareCommit=false}
   [junit4]   2> 304142 INFO  (TEST-TestHashQParserPlugin.testHashPartition-seed#[2C733FFCE6B60D35]) [    ] o.a.s.c.SolrCore SolrDeletionPolicy.onCommit: commits: num=2
   [junit4]   2> 	commit{dir=MockDirectoryWrapper(RAMDirectory@6b5fac73 lockFactory=org.apache.lucene.store.SingleInstanceLockFactory@5632e917),segFN=segments_3,generation=3}
   [junit4]   2> 	commit{dir=MockDirectoryWrapper(RAMDirectory@6b5fac73 lockFactory=org.apache.lucene.store.SingleInstanceLockFactory@5632e917),segFN=segments_4,generation=4}
   [junit4]   2> 304142 INFO  (TEST-TestHashQParserPlugin.testHashPartition-seed#[2C733FFCE6B60D35]) [    ] o.a.s.c.SolrCore newest commit generation = 4
   [junit4]   2> 304142 INFO  (TEST-TestHashQParserPlugin.testHashPartition-seed#[2C733FFCE6B60D35]) [    ] o.a.s.s.SolrIndexSearcher Opening Searcher@3f187277[collection1] main
   [junit4]   2> 304143 INFO  (searcherExecutor-1200-thread-1) [    ] o.a.s.c.SolrCore [collection1] Registered new searcher Searcher@3f187277[collection1] main{ExitableDirectoryReader(UninvertingDirectoryReader(Uninverting(_0(5.3.0):C1) Uninverting(_1(5.3.0):C10) Uninverting(_2(5.3.0):C10)))}
   [junit4]   2> 304143 INFO  (TEST-TestHashQParserPlugin.testHashPartition-seed#[2C733FFCE6B60D35]) [    ] o.a.s.u.UpdateHandler end_commit_flush
   [junit4]   2> 304143 INFO  (TEST-TestHashQParserPlugin.testHashPartition-seed#[2C733FFCE6B60D35]) [    ] o.a.s.u.p.LogUpdateProcessor [collection1] webapp=null path=null params={} {commit=} 0 5
   [junit4]   2> 304147 INFO  (TEST-TestHashQParserPlugin.testHashPartition-seed#[2C733FFCE6B60D35]) [    ] o.a.s.u.p.LogUpdateProcessor [collection1] webapp=null path=null params={} {add=[244061 (1504958996063191040)]} 0 3
   [junit4]   2> 304149 INFO  (TEST-TestHashQParserPlugin.testHashPartition-seed#[2C733FFCE6B60D35]) [    ] o.a.s.u.p.LogUpdateProcessor [collection1] webapp=null path=null params={} {add=[358582 (1504958996068433920)]} 0 0
   [junit4]   2> 304150 INFO  (TEST-TestHashQParserPlugin.testHashPartition-seed#[2C733FFCE6B60D35]) [    ] o.a.s.u.p.LogUpdateProcessor [collection1] webapp=null path=null params={} {add=[49969 (1504958996069482496)]} 0 0
   [junit4]   2> 304152 INFO  (TEST-TestHashQParserPlugin.testHashPartition-seed#[2C733FFCE6B60D35]) [    ] o.a.s.u.p.LogUpdateProcessor [collection1] webapp=null path=null params={} {add=[995612 (1504958996070531072)]} 0 0
   [junit4]   2> 304153 INFO  (TEST-TestHashQParserPlugin.testHashPartition-seed#[2C733FFCE6B60D35]) [    ] o.a.s.u.p.LogUpdateProcessor [collection1] webapp=null path=null params={} {add=[670598 (1504958996072628224)]} 0 0
   [junit4]   2> 304154 INFO  (TEST-TestHashQParserPlugin.testHashPartition-seed#[2C733FFCE6B60D35]) [    ] o.a.s.u.p.LogUpdateProcessor [collection1] webapp=null path=null params={} {add=[447565 (1504958996073676800)]} 0 0
   [junit4]   2> 304156 INFO  (TEST-TestHashQParserPlugin.testHashPartition-seed#[2C733FFCE6B60D35]) [    ] o.a.s.u.p.LogUpdateProcessor [collection1] webapp=null path=null params={} {add=[438827 (1504958996074725376)]} 0 0
   [junit4]   2> 304157 INFO  (TEST-TestHashQParserPlugin.testHashPartition-seed#[2C733FFCE6B60D35]) [    ] o.a.s.u.p.LogUpdateProcessor [collection1] webapp=null path=null params={} {add=[966913 (1504958996076822528)]} 0 0
   [junit4]   2> 304158 INFO  (TEST-TestHashQParserPlugin.testHashPartition-seed#[2C733FFCE6B60D35]) [    ] o.a.s.u.p.LogUpdateProcessor [collection1] webapp=null path=null params={} {add=[348484 (1504958996077871104)]} 0 0
   [junit4]   2> 304159 INFO  (TEST-TestHashQParserPlugin.testHashPartition-seed#[2C733FFCE6B60D35]) [    ] o.a.s.u.p.LogUpdateProcessor [collection1] webapp=null path=null params={} {add=[686215 (1504958996078919680)]} 0 0
   [junit4]   2> 304160 INFO  (TEST-TestHashQParserPlugin.testHashPartition-seed#[2C733FFCE6B60D35]) [    ] o.a.s.u.UpdateHandler start commit{,optimize=false,openSearcher=true,waitSearcher=true,expungeDeletes=false,softCommit=false,prepareCommit=false}
   [junit4]   2> 304164 INFO  (TEST-TestHashQParserPlugin.testHashPartition-seed#[2C733FFCE6B60D35]) [    ] o.a.s.c.SolrCore SolrDeletionPolicy.onCommit: commits: num=2
   [junit4]   2> 	commit{dir=MockDirectoryWrapper(RAMDirectory@6b5fac73 lockFactory=org.apache.lucene.store.SingleInstanceLockFactory@5632e917),segFN=segments_4,generation=4}
   [junit4]   2> 	commit{dir=MockDirectoryWrapper(RAMDirectory@6b5fac73 lockFactory=org.apache.lucene.store.SingleInstanceLockFactory@5632e917),segFN=segments_5,generation=5}
   [junit4]   2> 304164 INFO  (TEST-TestHashQParserPlugin.testHashPartition-seed#[2C733FFCE6B60D35]) [    ] o.a.s.c.SolrCore newest commit generation = 5
   [junit4]   2> 304165 INFO  (TEST-TestHashQParserPlugin.testHashPartition-seed#[2C733FFCE6B60D35]) [    ] o.a.s.s.SolrIndexSearcher Opening Searcher@62eda165[collection1] main
   [junit4]   2> 304165 INFO  (TEST-TestHashQParserPlugin.testHashPartition-seed#[2C733FFCE6B60D35]) [    ] o.a.s.u.UpdateHandler end_commit_flush
   [junit4]   2> 304165 INFO  (searcherExecutor-1200-thread-1) [    ] o.a.s.c.SolrCore [collection1] Registered new searcher Searcher@62eda165[collection1] main{ExitableDirectoryReader(UninvertingDirectoryReader(Uninverting(_0(5.3.0):C1) Uninverting(_1(5.3.0):C10) Uninverting(_2(5.3.0):C10) Uninverting(_3(5.3.0):C10)))}
   [junit4]   2> 304165 INFO  (TEST-TestHashQParserPlugin.testHashPartition-seed#[2C733FFCE6B60D35]) [    ] o.a.s.u.p.LogUpdateProcessor [collection1] webapp=null path=null params={} {commit=} 0 5
   [junit4]   2> 304169 INFO  (TEST-TestHashQParserPlugin.testHashPartition-seed#[2C733FFCE6B60D35]) [    ] o.a.s.u.p.LogUpdateProcessor [collection1] webapp=null path=null params={} {add=[164822 (1504958996087308288)]} 0 2
   [junit4]   2> 304170 INFO  (TEST-TestHashQParserPlugin.testHashPartition-seed#[2C733FFCE6B60D35]) [    ] o.a.s.u.p.LogUpdateProcessor [collection1] webapp=null path=null params={} {add=[481987 (1504958996090454016)]} 0 0
   [junit4]   2> 304171 INFO  (TEST-TestHashQParserPlugin.testHashPartition-seed#[2C733FFCE6B60D35]) [    ] o.a.s.u.p.LogUpdateProcessor [collection1] webapp=null path=null params={} {add=[285919 (1504958996091502592)]} 0 0
   [junit4]   2> 304172 INFO  (TEST-TestHashQParserPlugin.testHashPartition-seed#[2C733FFCE6B60D35]) [    ] o.a.s.u.p.LogUpdateProcessor [collection1] webapp=null path=null params={} {add=[88251 (1504958996092551168)]} 0 0
   [junit4]   2> 304173 INFO  (TEST-TestHashQParserPlugin.testHashPartition-seed#[2C733FFCE6B60D35]) [    ] o.a.s.u.p.LogUpdateProcessor [collection1] webapp=null path=null params={} {add=[96715 (1504958996093599744)]} 0 0
   [junit4]   2> 304175 INFO  (TEST-TestHashQParserPlugin.testHashPartition-seed#[2C733FFCE6B60D35]) [    ] o.a.s.u.p.LogUpdateProcessor [collection1] webapp=null path=null params={} {add=[847151 (1504958996094648320)]} 0 0
   [junit4]   2> 304176 INFO  (TEST-TestHashQParserPlugin.testHashPartition-seed#[2C733FFCE6B60D35]) [    ] o.a.s.u.p.LogUpdateProcessor [collection1] webapp=null path=null params={} {add=[874087 (1504958996095696896)]} 0 0
   [junit4]   2> 304177 INFO  (TEST-TestHashQParserPlugin.testHashPartition-seed#[2C733FFCE6B60D35]) [    ] o.a.s.u.p.LogUpdateProcessor [collection1] webapp=null path=null params={} {add=[942479 (1504958996097794048)]} 0 0
   [junit4]   2> 304178 INFO  (TEST-TestHashQParserPlugin.testHashPartition-seed#[2C733FFCE6B60D35]) [    ] o.a.s.u.p.LogUpdateProcessor [collection1] webapp=null path=null params={} {add=[368346 (1504958996098842624)]} 0 0
   [junit4]   2> 304179 INFO  (TEST-TestHashQParserPlugin.testHashPartition-seed#[2C733FFCE6B60D35]) [    ] o.a.s.u.p.LogUpdateProcessor [collection1] webapp=null path=null params={} {add=[523007 (1504958996099891200)]} 0 0
   [junit4]   2> 304180 INFO  (TEST-TestHashQParserPlugin.testHashPartition-seed#[2C733FFCE6B60D35]) [    ] o.a.s.u.UpdateHandler start commit{,optimize=false,openSearcher=true,waitSearcher=true,expungeDeletes=false,softCommit=false,prepareCommit=false}
   [junit4]   2> 304185 INFO  (TEST-TestHashQParserPlugin.testHashPartition-seed#[2C733FFCE6B60D35]) [    ] o.a.s.c.SolrCore SolrDeletionPolicy.onCommit: commits: num=2
   [junit4]   2> 	commit{dir=MockDirectoryWrapper(RAMDirectory@6b5fac73 lockFactory=org.apache.lucene.store.SingleInstanceLockFactory@5632e917),segFN=segments_5,generation=5}
   [junit4]   2> 	commit{dir=MockDirectoryWrapper(RAMDirectory@6b5fac73 lockFactory=org.apache.lucene.store.SingleInstanceLockFactory@5632e917),segFN=segments_6,generation=6}
   [junit4]   2> 304186 INFO  (TEST-TestHashQParserPlugin.testHashPartition-seed#[2C733FFCE6B60D35]) [    ] o.a.s.c.SolrCore newest commit generation = 6
   [junit4]   2> 304186 INFO  (TEST-TestHashQParserPlugin.testHashPartition-seed#[2C733FFCE6B60D35]) [    ] o.a.s.s.SolrIndexSearcher Opening Searcher@27ddef3f[collection1] main
   [junit4]   2> 304186 INFO  (TEST-TestHashQParserPlugin.testHashPartition-seed#[2C733FFCE6B60D35]) [    ] o.a.s.u.UpdateHandler end_commit_flush
   [junit4]   2> 304186 INFO  (searcherExecutor-1200-thread-1) [    ] o.a.s.c.SolrCore [collection1] Registered new searcher Searcher@27ddef3f[collection1] main{ExitableDirectoryReader(UninvertingDirectoryReader(Uninverting(_0(5.3.0):C1) Uninverting(_1(5.3.0):C10) Uninverting(_2(5.3.0):C10) Uninverting(_3(5.3.0):C10) Uninverting(_4(5.3.0):C10)))}
   [junit4]   2> 304187 INFO  (TEST-TestHashQParserPlugin.testHashPartition-seed#[2C733FFCE6B60D35]) [    ] o.a.s.u.p.LogUpdateProcessor [collection1] webapp=null path=null params={} {commit=} 0 6
   [junit4]   2> 304189 INFO  (TEST-TestHashQParserPlugin.testHashPartition-seed#[2C733FFCE6B60D35]) [    ] o.a.s.u.p.LogUpdateProcessor [collection1] webapp=null path=null params={} {add=[751805 (1504958996109328384)]} 0 1
   [junit4]   2> 304190 INFO  (TEST-TestHashQParserPlugin.testHashPartition-seed#[2C733FFCE6B60D35]) [    ] o.a.s.u.p.LogUpdateProcessor [collection1] webapp=null path=null params={} {add=[366911 (1504958996111425536)]} 0 0
   [junit4]   2> 304192 INFO  (TEST-TestHashQParserPlugin.testHashPartition-seed#[2C733FFCE6B60D35]) [    ] o.a.s.u.p.LogUpdateProcessor [collection1] webapp=null path=null params={} {add=[564262 (1504958996112474112)]} 0 0
   [junit4]   2> 304193 INFO  (TEST-TestHashQParserPlugin.testHashPartition-seed#[2C733FFCE6B60D35]) [    ] o.a.s.u.p.LogUpdateProcessor [collection1] webapp=null path=null params={} {add=[456432 (1504958996114571264)]} 0 0
   [junit4]   2> 304194 INFO  (TEST-TestHashQParserPlugin.testHashPartition-seed#[2C733FFCE6B60D35]) [    ] o.a.s.u.p.LogUpdateProcessor [collection1] webapp=null path=null params={} {add=[910459 (1504958996115619840)]} 0 0
   [junit4]   2> 304195 INFO  (TEST-TestHashQParserPlugin.testHashPartition-seed#[2C733FFCE6B60D35]) [    ] o.a.s.u.p.LogUpdateProcessor [collection1] webapp=null path=null params={} {add=[864381 (1504958996116668416)]} 0 0
   [junit4]   2> 304196 INFO  (TEST-TestHashQParserPlugin.testHashPartition-seed#[2C733FFCE6B60D35]) [    ] o.a.s.u.p.LogUpdateProcessor [collection1] webapp=null path=null params={} {add=[117469 (1504958996117716992)]} 0 0
   [junit4]   2> 304198 INFO  (TEST-TestHashQParserPlugin.testHashPartition-seed#[2C733FFCE6B60D35]) [    ] o.a.s.u.p.LogUpdateProcessor [collection1] webapp=null path=null params={} {add=[39025 (1504958996118765568)]} 0 0
   [junit4]   2> 304199 INFO  (TEST-TestHashQParserPlugin.testHashPartition-seed#[2C733FFCE6B60D35]) [    ] o.a.s.u.p.LogUpdateProcessor [collection1] webapp=null path=null params={} {add=[288897 (1504958996119814144)]} 0 0
   [junit4]   2> 304200 INFO  (TEST-TestHashQParserPlugin.testHashPartition-seed#[2C733FFCE6B60D35]) [    ] o.a.s.u.UpdateHandler start commit{,optimize=false,openSearcher=true,waitSearcher=true,expungeDeletes=false,softCommit=false,prepareCommit=false}
   [junit4]   2> 304204 INFO  (TEST-TestHashQParserPlugin.testHashPartition-seed#[2C733FFCE6B60D35]) [    ] o.a.s.c.SolrCore SolrDeletionPolicy.onCommit: commits: num=2
   [junit4]   2> 	commit{dir=MockDirectoryWrapper(RAMDirectory@6b5fac73 lockFactory=org.apache.lucene.store.SingleInstanceLockFactory@5632e917),segFN=segments_6,generation=6}
   [junit4]   2> 	commit{dir=MockDirectoryWrapper(RAMDirectory@6b5fac73 lockFactory=org.apache.lucene.store.SingleInstanceLockFactory@5632e917),segFN=segments_7,generation=7}
   [junit4]   2> 304204 INFO  (TEST-TestHashQParserPlugin.testHashPartition-seed#[2C733FFCE6B60D35]) [    ] o.a.s.c.SolrCore newest commit generation = 7
   [junit4]   2> 304205 INFO  (TEST-TestHashQParserPlugin.testHashPartition-seed#[2C733FFCE6B60D35]) [    ] o.a.s.s.SolrIndexSearcher Opening Searcher@28ac523a[collection1] main
   [junit4]   2> 304205 INFO  (TEST-TestHashQParserPlugin.testHashPartition-seed#[2C733FFCE6B60D35]) [    ] o.a.s.u.UpdateHandler end_commit_flush
   [junit4]   2> 304205 INFO  (searcherExecutor-1200-thread-1) [    ] o.a.s.c.SolrCore [collection1] Registered new searcher Searcher@28ac523a[collection1] main{ExitableDirectoryReader(UninvertingDirectoryReader(Uninverting(_0(5.3.0):C1) Uninverting(_1(5.3.0):C10) Uninverting(_2(5.3.0):C10) Uninverting(_3(5.3.0):C10) Uninverting(_4(5.3.0):C10) Uninverting(_5(5.3.0):C9)))}
   [junit4]   2> 304205 INFO  (TEST-TestHashQParserPlugin.testHashPartition-seed#[2C733FFCE6B60D35]) [    ] o.a.s.u.p.LogUpdateProcessor [collection1] webapp=null path=null params={} {commit=} 0 5
   [junit4]   2> 304213 ERROR (TEST-TestHashQParserPlugin.testHashPartition-seed#[2C733FFCE6B60D35]) [    ] o.a.s.c.SolrCore java.lang.UnsupportedOperationException: Query  does not implement createWeight
   [junit4]   2> 	at org.apache.lucene.search.Query.createWeight(Query.java:79)
   [junit4]   2> 	at org.apache.lucene.search.IndexSearcher.createWeight(IndexSearcher.java:851)
   [junit4]   2> 	at org.apache.lucene.search.ConstantScoreQuery.createWeight(ConstantScoreQuery.java:117)
   [junit4]   2> 	at org.apache.solr.search.HashQParserPlugin$HashQuery.createWeight(HashQParserPlugin.java:151)
   [junit4]   2> 	at org.apache.lucene.search.IndexSearcher.createWeight(IndexSearcher.java:851)
   [junit4]   2> 	at org.apache.lucene.search.IndexSearcher.createNormalizedWeight(IndexSearcher.java:834)
   [junit4]   2> 	at org.apache.solr.search.SolrIndexSearcher.getProcessedFilter(SolrIndexSearcher.java:1146)
   [junit4]   2> 	at org.apache.solr.search.SolrIndexSearcher.getDocListNC(SolrIndexSearcher.java:1628)
   [junit4]   2> 	at org.apache.solr.search.SolrIndexSearcher.getDocListC(SolrIndexSearcher.java:1504)
   [junit4]   2> 	at org.apache.solr.search.SolrIndexSearcher.search(SolrIndexSearcher.java:561)
   [junit4]   2> 	at org.apache.solr.handler.component.QueryComponent.process(QueryComponent.java:518)
   [junit4]   2> 	at org.apache.solr.handler.component.SearchHandler.handleRequestBody(SearchHandler.java:277)
   [junit4]   2> 	at org.apache.solr.handler.RequestHandlerBase.handleRequest(RequestHandlerBase.java:143)
   [junit4]   2> 	at org.apache.solr.core.SolrCore.execute(SolrCore.java:2058)
   [junit4]   2> 	at org.apache.solr.util.TestHarness.query(TestHarness.java:320)
   [junit4]   2> 	at org.apache.solr.util.TestHarness.query(TestHarness.java:302)
   [junit4]   2> 	at org.apache.solr.search.TestHashQParserPlugin.testHashPartition(TestHashQParserPlugin.java:94)
   [junit4]   2> 	at sun.reflect.NativeMethodAccessorImpl.invoke0(Native Method)
   [junit4]   2> 	at sun.reflect.NativeMethodAccessorImpl.invoke(NativeMethodAccessorImpl.java:57)
   [junit4]   2> 	at sun.reflect.DelegatingMethodAccessorImpl.invoke(DelegatingMethodAccessorImpl.java:43)
   [junit4]   2> 	at java.lang.reflect.Method.invoke(Method.java:606)
   [junit4]   2> 	at com.carrotsearch.randomizedtesting.RandomizedRunner.invoke(RandomizedRunner.java:1627)
   [junit4]   2> 	at com.carrotsearch.randomizedtesting.RandomizedRunner$6.evaluate(RandomizedRunner.java:836)
   [junit4]   2> 	at com.carrotsearch.randomizedtesting.RandomizedRunner$7.evaluate(RandomizedRunner.java:872)
   [junit4]   2> 	at com.carrotsearch.randomizedtesting.RandomizedRunner$8.evaluate(RandomizedRunner.java:886)
   [junit4]   2> 	at com.carrotsearch.randomizedtesting.rules.SystemPropertiesRestoreRule$1.evaluate(SystemPropertiesRestoreRule.java:57)
   [junit4]   2> 	at org.apache.lucene.util.TestRuleSetupTeardownChained$1.evaluate(TestRuleSetupTeardownChained.java:50)
   [junit4]   2> 	at org.apache.lucene.util.AbstractBeforeAfterRule$1.evaluate(AbstractBeforeAfterRule.java:46)
   [junit4]   2> 	at org.apache.lucene.util.TestRuleThreadAndTestName$1.evaluate(TestRuleThreadAndTestName.java:49)
   [junit4]   2> 	at org.apache.lucene.util.TestRuleIgnoreAfterMaxFailures$1.evaluate(TestRuleIgnoreAfterMaxFailures.java:65)
   [junit4]   2> 	at org.apache.lucene.util.TestRuleMarkFailure$1.evaluate(TestRuleMarkFailure.java:48)
   [junit4]   2> 	at com.carrotsearch.randomizedtesting.rules.StatementAdapter.evaluate(StatementAdapter.java:36)
   [junit4]   2> 	at com.carrotsearch.randomizedtesting.ThreadLeakControl$StatementRunner.run(ThreadLeakControl.java:365)
   [junit4]   2> 	at com.carrotsearch.randomizedtesting.ThreadLeakControl.forkTimeoutingTask(ThreadLeakControl.java:798)
   [junit4]   2> 	at com.carrotsearch.randomizedtesting.ThreadLeakControl$3.evaluate(ThreadLeakControl.java:458)
   [junit4]   2> 	at com.carrotsearch.randomizedtesting.RandomizedRunner.runSingleTest(RandomizedRunner.java:845)
   [junit4]   2> 	at com.carrotsearch.randomizedtesting.RandomizedRunner$3.evaluate(RandomizedRunner.java:747)
   [junit4]   2> 	at com.carrotsearch.randomizedtesting.RandomizedRunner$4.evaluate(RandomizedRunner.java:781)
   [junit4]   2> 	at com.carrotsearch.randomizedtesting.RandomizedRunner$5.evaluate(RandomizedRunner.java:792)
   [junit4]   2> 	at com.carrotsearch.randomizedtesting.rules.StatementAdapter.evaluate(StatementAdapter.java:36)
   [junit4]   2> 	at com.carrotsearch.randomizedtesting.rules.SystemPropertiesRestoreRule$1.evaluate(SystemPropertiesRestoreRule.java:57)
   [junit4]   2> 	at org.apache.lucene.util.AbstractBeforeAfterRule$1.evaluate(AbstractBeforeAfterRule.java:46)
   [junit4]   2> 	at com.carrotsearch.randomizedtesting.rules.StatementAdapter.evaluate(StatementAdapter.java:36)
   [junit4]   2> 	at org.apache.lucene.util.TestRuleStoreClassName$1.evaluate(TestRuleStoreClassName.java:42)
   [junit4]   2> 	at com.carrotsearch.randomizedtesting.rules.NoShadowingOrOverridesOnMethodsRule$1.evaluate(NoShadowingOrOverridesOnMethodsRule.java:39)
   [junit4]   2> 	at com.carrotsearch.randomizedtesting.rules.NoShadowingOrOverridesOnMethodsRule$1.evaluate(NoShadowingOrOverridesOnMethodsRule.java:39)
   [junit4]   2> 	at com.carrotsearch.randomizedtesting.rules.StatementAdapter.evaluate(StatementAdapter.java:36)
   [junit4]   2> 	at com.carrotsearch.randomizedtesting.rules.StatementAdapter.evaluate(StatementAdapter.java:36)
   [junit4]   2> 	at com.carrotsearch.randomizedtesting.rules.StatementAdapter.evaluate(StatementAdapter.java:36)
   [junit4]   2> 	at org.apache.lucene.util.TestRuleAssertionsRequired$1.evaluate(TestRuleAssertionsRequired.java:54)
   [junit4]   2> 	at org.apache.lucene.util.TestRuleMarkFailure$1.evaluate(TestRuleMarkFailure.java:48)
   [junit4]   2> 	at org.apache.lucene.util.TestRuleIgnoreAfterMaxFailures$1.evaluate(TestRuleIgnoreAfterMaxFailures.java:65)
   [junit4]   2> 	at org.apache.lucene.util.TestRuleIgnoreTestSuites$1.evaluate(TestRuleIgnoreTestSuites.java:55)
   [junit4]   2> 	at com.carrotsearch.randomizedtesting.rules.StatementAdapter.evaluate(StatementAdapter.java:36)
   [junit4]   2> 	at com.carrotsearch.randomizedtesting.ThreadLeakControl$StatementRunner.run(ThreadLeakControl.java:365)
   [junit4]   2> 	at java.lang.Thread.run(Thread.java:745)
   [junit4]   2> 
   [junit4]   2> 304214 INFO  (TEST-TestHashQParserPlugin.testHashPartition-seed#[2C733FFCE6B60D35]) [    ] o.a.s.c.S.Request [collection1] webapp=null path=null params={q=*%3A*&fq=%7B%21hash+worker%3D0+workers%3D3+cost%3D1%7D&partitionKeys=a_s&rows=50} status=500 QTime=7 
   [junit4]   2> 304214 INFO  (TEST-TestHashQParserPlugin.testHashPartition-seed#[2C733FFCE6B60D35]) [    ] o.a.s.SolrTestCaseJ4 ###Ending testHashPartition
   [junit4]   2> NOTE: reproduce with: ant test  -Dtestcase=TestHashQParserPlugin -Dtests.method=testHashPartition -Dtests.seed=2C733FFCE6B60D35 -Dtests.multiplier=2 -Dtests.slow=true -Dtests.locale=it_IT -Dtests.timezone=Mideast/Riyadh88 -Dtests.asserts=true -Dtests.file.encoding=UTF-8
   [junit4] ERROR   0.15s J2 | TestHashQParserPlugin.testHashPartition <<<
   [junit4]    > Throwable #1: java.lang.UnsupportedOperationException: Query  does not implement createWeight
   [junit4]    > 	at __randomizedtesting.SeedInfo.seed([2C733FFCE6B60D35:FDCE1E19DDDCB45E]:0)
   [junit4]    > 	at org.apache.lucene.search.Query.createWeight(Query.java:79)
   [junit4]    > 	at org.apache.lucene.search.IndexSearcher.createWeight(IndexSearcher.java:851)
   [junit4]    > 	at org.apache.lucene.search.ConstantScoreQuery.createWeight(ConstantScoreQuery.java:117)
   [junit4]    > 	at org.apache.solr.search.HashQParserPlugin$HashQuery.createWeight(HashQParserPlugin.java:151)
   [junit4]    > 	at org.apache.lucene.search.IndexSearcher.createWeight(IndexSearcher.java:851)
   [junit4]    > 	at org.apache.lucene.search.IndexSearcher.createNormalizedWeight(IndexSearcher.java:834)
   [junit4]    > 	at org.apache.solr.search.SolrIndexSearcher.getProcessedFilter(SolrIndexSearcher.java:1146)
   [junit4]    > 	at org.apache.solr.search.SolrIndexSearcher.getDocListNC(SolrIndexSearcher.java:1628)
   [junit4]    > 	at org.apache.solr.search.SolrIndexSearcher.getDocListC(SolrIndexSearcher.java:1504)
   [junit4]    > 	at org.apache.solr.search.SolrIndexSearcher.search(SolrIndexSearcher.java:561)
   [junit4]    > 	at org.apache.solr.handler.component.QueryComponent.process(QueryComponent.java:518)
   [junit4]    > 	at org.apache.solr.handler.component.SearchHandler.handleRequestBody(SearchHandler.java:277)
   [junit4]    > 	at org.apache.solr.handler.RequestHandlerBase.handleRequest(RequestHandlerBase.java:143)
   [junit4]    > 	at org.apache.solr.core.SolrCore.execute(SolrCore.java:2058)
   [junit4]    > 	at org.apache.solr.util.TestHarness.query(TestHarness.java:320)
   [junit4]    > 	at org.apache.solr.util.TestHarness.query(TestHarness.java:302)
   [junit4]    > 	at org.apache.solr.search.TestHashQParserPlugin.testHashPartition(TestHashQParserPlugin.java:94)
   [junit4]    > 	at java.lang.Thread.run(Thread.java:745)
   [junit4]   2> 304220 INFO  (SUITE-TestHashQParserPlugin-seed#[2C733FFCE6B60D35]-worker) [    ] o.a.s.SolrTestCaseJ4 ###deleteCore
   [junit4]   2> 304220 INFO  (SUITE-TestHashQParserPlugin-seed#[2C733FFCE6B60D35]-worker) [    ] o.a.s.c.CoreContainer Shutting down CoreContainer instance=1005097399
   [junit4]   2> 304221 INFO  (SUITE-TestHashQParserPlugin-seed#[2C733FFCE6B60D35]-worker) [    x:collection1] o.a.s.c.SolrCore [collection1]  CLOSING SolrCore org.apache.solr.core.SolrCore@688ad989
   [junit4]   2> 304221 INFO  (SUITE-TestHashQParserPlugin-seed#[2C733FFCE6B60D35]-worker) [    x:collection1] o.a.s.u.UpdateHandler closing DirectUpdateHandler2{commits=7,autocommits=0,soft autocommits=0,optimizes=0,rollbacks=0,expungeDeletes=0,docsPending=0,adds=0,deletesById=0,deletesByQuery=0,errors=0,cumulative_adds=50,cumulative_deletesById=0,cumulative_deletesByQuery=1,cumulative_errors=0,transaction_logs_total_size=3681,transaction_logs_total_number=7}
   [junit4]   2> 304221 INFO  (SUITE-TestHashQParserPlugin-seed#[2C733FFCE6B60D35]-worker) [    x:collection1] o.a.s.u.SolrCoreState Closing SolrCoreState
   [junit4]   2> 304221 INFO  (SUITE-TestHashQParserPlugin-seed#[2C733FFCE6B60D35]-worker) [    x:collection1] o.a.s.u.DefaultSolrCoreState SolrCoreState ref count has reached 0 - closing IndexWriter
   [junit4]   2> 304221 INFO  (SUITE-TestHashQParserPlugin-seed#[2C733FFCE6B60D35]-worker) [    x:collection1] o.a.s.u.DefaultSolrCoreState closing IndexWriter with IndexWriterCloser
   [junit4]   2> 304222 INFO  (SUITE-TestHashQParserPlugin-seed#[2C733FFCE6B60D35]-worker) [    x:collection1] o.a.s.c.SolrCore [collection1] Closing main searcher on request.
   [junit4]   2> 304222 INFO  (SUITE-TestHashQParserPlugin-seed#[2C733FFCE6B60D35]-worker) [    x:collection1] o.a.s.c.CachingDirectoryFactory Closing MockDirectoryFactory - 2 directories currently being tracked
   [junit4]   2> 304222 INFO  (SUITE-TestHashQParserPlugin-seed#[2C733FFCE6B60D35]-worker) [    x:collection1] o.a.s.c.CachingDirectoryFactory looking to close /x1/jenkins/jenkins-slave/workspace/Lucene-Solr-Tests-5.x-Java7/solr/build/solr-core/test/J2/temp/solr.search.TestHashQParserPlugin_2C733FFCE6B60D35-001/init-core-data-001/index [CachedDir<<refCount=0;path=/x1/jenkins/jenkins-slave/workspace/Lucene-Solr-Tests-5.x-Java7/solr/build/solr-core/test/J2/temp/solr.search.TestHashQParserPlugin_2C733FFCE6B60D35-001/init-core-data-001/index;done=false>>]
   [junit4]   2> 304222 INFO  (SUITE-TestHashQParserPlugin-seed#[2C733FFCE6B60D35]-worker) [    x:collection1] o.a.s.c.CachingDirectoryFactory Closing directory: /x1/jenkins/jenkins-slave/workspace/Lucene-Solr-Tests-5.x-Java7/solr/build/solr-core/test/J2/temp/solr.search.TestHashQParserPlugin_2C733FFCE6B60D35-001/init-core-data-001/index
   [junit4]   2> 304222 INFO  (SUITE-TestHashQParserPlugin-seed#[2C733FFCE6B60D35]-worker) [    x:collection1] o.a.s.c.CachingDirectoryFactory looking to close /x1/jenkins/jenkins-slave/workspace/Lucene-Solr-Tests-5.x-Java7/solr/build/solr-core/test/J2/temp/solr.search.TestHashQParserPlugin_2C733FFCE6B60D35-001/init-core-data-001 [CachedDir<<refCount=0;path=/x1/jenkins/jenkins-slave/workspace/Lucene-Solr-Tests-5.x-Java7/solr/build/solr-core/test/J2/temp/solr.search.TestHashQParserPlugin_2C733FFCE6B60D35-001/init-core-data-001;done=false>>]
   [junit4]   2> 304223 INFO  (SUITE-TestHashQParserPlugin-seed#[2C733FFCE6B60D35]-worker) [    x:collection1] o.a.s.c.CachingDirectoryFactory Closing directory: /x1/jenkins/jenkins-slave/workspace/Lucene-Solr-Tests-5.x-Java7/solr/build/solr-core/test/J2/temp/solr.search.TestHashQParserPlugin_2C733FFCE6B60D35-001/init-core-data-001
   [junit4]   2> NOTE: leaving temporary files on disk at: /x1/jenkins/jenkins-slave/workspace/Lucene-Solr-Tests-5.x-Java7/solr/build/solr-core/test/J2/temp/solr.search.TestHashQParserPlugin_2C733FFCE6B60D35-001
   [junit4]   2> NOTE: test params are: codec=Lucene53, sim=RandomSimilarityProvider(queryNorm=true,coord=no): {}, locale=it_IT, timezone=Mideast/Riyadh88
   [junit4]   2> NOTE: Linux 3.13.0-52-generic amd64/Oracle Corporation 1.7.0_72 (64-bit)/cpus=4,threads=1,free=150346248,total=463470592
   [junit4]   2> NOTE: All tests run in this JVM: [ChaosMonkeyNothingIsSafeTest, SpellingQueryConverterTest, TestNoOpRegenerator, TestRecoveryHdfs, TestPHPSerializedResponseWriter, TestCSVResponseWriter, BasicZkTest, SolrIndexSplitterTest, TestBulkSchemaAPI, SearchHandlerTest, TestClassNameShortening, FileBasedSpellCheckerTest, SharedFSAutoReplicaFailoverUtilsTest, TestFieldCollectionResource, UUIDFieldTest, TestManagedStopFilterFactory, TestCoreContainer, CSVRequestHandlerTest, FastVectorHighlighterTest, TestRemoteStreaming, TestDocBasedVersionConstraints, TestSurroundQueryParser, TestSchemaResource, MultiThreadedOCPTest, TestBlendedInfixSuggestions, DistributedMLTComponentTest, TestReqParamsAPI, TestJsonFacets, FacetPivotSmallTest, ResponseLogComponentTest, TestSimpleTrackingShardHandler, TestAuthenticationFramework, TestAddFieldRealTimeGet, DirectSolrConnectionTest, IndexSchemaRuntimeFieldTest, RollingRestartTest, TestManagedSynonymFilterFactory, TestHashQParserPlugin]
   [junit4] Completed [139/507] on J2 in 0.74s, 1 test, 1 error <<< FAILURES!

[...truncated 849 lines...]
   [junit4] Suite: org.apache.solr.response.TestCustomDocTransformer
   [junit4]   2> Creating dataDir: /x1/jenkins/jenkins-slave/workspace/Lucene-Solr-Tests-5.x-Java7/solr/build/solr-core/test/J0/temp/solr.response.TestCustomDocTransformer_2C733FFCE6B60D35-001/init-core-data-001
   [junit4]   2> 1762534 INFO  (SUITE-TestCustomDocTransformer-seed#[2C733FFCE6B60D35]-worker) [    ] o.a.s.SolrTestCaseJ4 Randomized ssl (false) and clientAuth (false)
   [junit4]   2> 1762535 INFO  (SUITE-TestCustomDocTransformer-seed#[2C733FFCE6B60D35]-worker) [    ] o.a.s.SolrTestCaseJ4 ####initCore
   [junit4]   2> 1762535 INFO  (SUITE-TestCustomDocTransformer-seed#[2C733FFCE6B60D35]-worker) [    ] o.a.s.c.SolrResourceLoader new SolrResourceLoader for directory: '/x1/jenkins/jenkins-slave/workspace/Lucene-Solr-Tests-5.x-Java7/solr/core/src/test-files/solr/collection1/'
   [junit4]   2> 1762535 INFO  (SUITE-TestCustomDocTransformer-seed#[2C733FFCE6B60D35]-worker) [    ] o.a.s.c.SolrResourceLoader Adding 'file:/x1/jenkins/jenkins-slave/workspace/Lucene-Solr-Tests-5.x-Java7/solr/core/src/test-files/solr/collection1/lib/.svn/' to classloader
   [junit4]   2> 1762535 INFO  (SUITE-TestCustomDocTransformer-seed#[2C733FFCE6B60D35]-worker) [    ] o.a.s.c.SolrResourceLoader Adding 'file:/x1/jenkins/jenkins-slave/workspace/Lucene-Solr-Tests-5.x-Java7/solr/core/src/test-files/solr/collection1/lib/classes/' to classloader
   [junit4]   2> 1762536 INFO  (SUITE-TestCustomDocTransformer-seed#[2C733FFCE6B60D35]-worker) [    ] o.a.s.c.SolrResourceLoader Adding 'file:/x1/jenkins/jenkins-slave/workspace/Lucene-Solr-Tests-5.x-Java7/solr/core/src/test-files/solr/collection1/lib/README' to classloader
   [junit4]   2> 1762563 INFO  (SUITE-TestCustomDocTransformer-seed#[2C733FFCE6B60D35]-worker) [    ] o.a.s.c.SolrConfig current version of requestparams : -1
   [junit4]   2> 1762575 INFO  (SUITE-TestCustomDocTransformer-seed#[2C733FFCE6B60D35]-worker) [    ] o.a.s.c.SolrConfig Using Lucene MatchVersion: 5.3.0
   [junit4]   2> 1762600 INFO  (SUITE-TestCustomDocTransformer-seed#[2C733FFCE6B60D35]-worker) [    ] o.a.s.c.Config Loaded SolrConfig: solrconfig-doctransformers.xml
   [junit4]   2> 1762600 INFO  (SUITE-TestCustomDocTransformer-seed#[2C733FFCE6B60D35]-worker) [    ] o.a.s.s.IndexSchema Reading Solr Schema from /x1/jenkins/jenkins-slave/workspace/Lucene-Solr-Tests-5.x-Java7/solr/core/src/test-files/solr/collection1/conf/schema.xml
   [junit4]   2> 1762607 INFO  (SUITE-TestCustomDocTransformer-seed#[2C733FFCE6B60D35]-worker) [    ] o.a.s.s.IndexSchema [null] Schema name=test
   [junit4]   2> 1762884 INFO  (SUITE-TestCustomDocTransformer-seed#[2C733FFCE6B60D35]-worker) [    ] o.a.s.s.OpenExchangeRatesOrgProvider Initialized with rates=open-exchange-rates.json, refreshInterval=1440.
   [junit4]   2> 1762892 INFO  (SUITE-TestCustomDocTransformer-seed#[2C733FFCE6B60D35]-worker) [    ] o.a.s.s.IndexSchema default search field in schema is text
   [junit4]   2> 1762895 INFO  (SUITE-TestCustomDocTransformer-seed#[2C733FFCE6B60D35]-worker) [    ] o.a.s.s.IndexSchema unique key field: id
   [junit4]   2> 1762899 INFO  (SUITE-TestCustomDocTransformer-seed#[2C733FFCE6B60D35]-worker) [    ] o.a.s.s.FileExchangeRateProvider Reloading exchange rates from file currency.xml
   [junit4]   2> 1762902 INFO  (SUITE-TestCustomDocTransformer-seed#[2C733FFCE6B60D35]-worker) [    ] o.a.s.s.FileExchangeRateProvider Reloading exchange rates from file currency.xml
   [junit4]   2> 1762904 INFO  (SUITE-TestCustomDocTransformer-seed#[2C733FFCE6B60D35]-worker) [    ] o.a.s.s.OpenExchangeRatesOrgProvider Reloading exchange rates from open-exchange-rates.json
   [junit4]   2> 1762905 WARN  (SUITE-TestCustomDocTransformer-seed#[2C733FFCE6B60D35]-worker) [    ] o.a.s.s.OpenExchangeRatesOrgProvider Unknown key IMPORTANT NOTE
   [junit4]   2> 1762905 WARN  (SUITE-TestCustomDocTransformer-seed#[2C733FFCE6B60D35]-worker) [    ] o.a.s.s.OpenExchangeRatesOrgProvider Expected key, got STRING
   [junit4]   2> 1762905 INFO  (SUITE-TestCustomDocTransformer-seed#[2C733FFCE6B60D35]-worker) [    ] o.a.s.s.OpenExchangeRatesOrgProvider Reloading exchange rates from open-exchange-rates.json
   [junit4]   2> 1762905 WARN  (SUITE-TestCustomDocTransformer-seed#[2C733FFCE6B60D35]-worker) [    ] o.a.s.s.OpenExchangeRatesOrgProvider Unknown key IMPORTANT NOTE
   [junit4]   2> 1762905 WARN  (SUITE-TestCustomDocTransformer-seed#[2C733FFCE6B60D35]-worker) [    ] o.a.s.s.OpenExchangeRatesOrgProvider Expected key, got STRING
   [junit4]   2> 1762906 INFO  (SUITE-TestCustomDocTransformer-seed#[2C733FFCE6B60D35]-worker) [    ] o.a.s.c.SolrResourceLoader JNDI not configured for solr (NoInitialContextEx)
   [junit4]   2> 1762906 INFO  (SUITE-TestCustomDocTransformer-seed#[2C733FFCE6B60D35]-worker) [    ] o.a.s.c.SolrResourceLoader using system property solr.solr.home: /x1/jenkins/jenkins-slave/workspace/Lucene-Solr-Tests-5.x-Java7/solr/core/src/test-files/solr
   [junit4]   2> 1762906 INFO  (SUITE-TestCustomDocTransformer-seed#[2C733FFCE6B60D35]-worker) [    ] o.a.s.c.SolrResourceLoader new SolrResourceLoader for directory: '/x1/jenkins/jenkins-slave/workspace/Lucene-Solr-Tests-5.x-Java7/solr/core/src/test-files/solr/'
   [junit4]   2> 1762920 INFO  (SUITE-TestCustomDocTransformer-seed#[2C733FFCE6B60D35]-worker) [    ] o.a.s.c.CoreContainer New CoreContainer 160857650
   [junit4]   2> 1762920 INFO  (SUITE-TestCustomDocTransformer-seed#[2C733FFCE6B60D35]-worker) [    ] o.a.s.c.CoreContainer Loading cores into CoreContainer [instanceDir=/x1/jenkins/jenkins-slave/workspace/Lucene-Solr-Tests-5.x-Java7/solr/core/src/test-files/solr/]
   [junit4]   2> 1762920 INFO  (SUITE-TestCustomDocTransformer-seed#[2C733FFCE6B60D35]-worker) [    ] o.a.s.c.CoreContainer loading shared library: /x1/jenkins/jenkins-slave/workspace/Lucene-Solr-Tests-5.x-Java7/solr/core/src/test-files/solr/lib
   [junit4]   2> 1762921 WARN  (SUITE-TestCustomDocTransformer-seed#[2C733FFCE6B60D35]-worker) [    ] o.a.s.c.SolrResourceLoader Can't find (or read) directory to add to classloader: lib (resolved as: /x1/jenkins/jenkins-slave/workspace/Lucene-Solr-Tests-5.x-Java7/solr/core/src/test-files/solr/lib).
   [junit4]   2> 1762928 INFO  (SUITE-TestCustomDocTransformer-seed#[2C733FFCE6B60D35]-worker) [    ] o.a.s.h.c.HttpShardHandlerFactory created with socketTimeout : 600000,connTimeout : 60000,maxConnectionsPerHost : 20,maxConnections : 10000,corePoolSize : 0,maximumPoolSize : 2147483647,maxThreadIdleTime : 5,sizeOfQueue : -1,fairnessPolicy : false,useRetries : false,
   [junit4]   2> 1762930 INFO  (SUITE-TestCustomDocTransformer-seed#[2C733FFCE6B60D35]-worker) [    ] o.a.s.u.UpdateShardHandler Creating UpdateShardHandler HTTP client with params: socketTimeout=30000&connTimeout=30000&retry=true
   [junit4]   2> 1762931 INFO  (SUITE-TestCustomDocTransformer-seed#[2C733FFCE6B60D35]-worker) [    ] o.a.s.l.LogWatcher SLF4J impl is org.slf4j.impl.Log4jLoggerFactory
   [junit4]   2> 1762931 INFO  (SUITE-TestCustomDocTransformer-seed#[2C733FFCE6B60D35]-worker) [    ] o.a.s.l.LogWatcher Registering Log Listener [Log4j (org.slf4j.impl.Log4jLoggerFactory)]
   [junit4]   2> 1762931 INFO  (SUITE-TestCustomDocTransformer-seed#[2C733FFCE6B60D35]-worker) [    ] o.a.s.c.CoreContainer No authentication plugin used.
   [junit4]   2> 1762932 INFO  (SUITE-TestCustomDocTransformer-seed#[2C733FFCE6B60D35]-worker) [    ] o.a.s.c.SolrCore Created CoreDescriptor: {dataDir=/x1/jenkins/jenkins-slave/workspace/Lucene-Solr-Tests-5.x-Java7/solr/build/solr-core/test/J0/temp/solr.response.TestCustomDocTransformer_2C733FFCE6B60D35-001/init-core-data-001, instanceDir=collection1, shard=shard1, collection=collection1, absoluteInstDir=/x1/jenkins/jenkins-slave/workspace/Lucene-Solr-Tests-5.x-Java7/solr/core/src/test-files/solr/collection1/, config=solrconfig-doctransformers.xml, transient=false, schema=schema.xml, loadOnStartup=true, name=collection1}
   [junit4]   2> 1762933 INFO  (coreLoadExecutor-4752-thread-1) [    ] o.a.s.c.SolrResourceLoader new SolrResourceLoader for directory: '/x1/jenkins/jenkins-slave/workspace/Lucene-Solr-Tests-5.x-Java7/solr/core/src/test-files/solr/collection1/'
   [junit4]   2> 1762933 INFO  (coreLoadExecutor-4752-thread-1) [    ] o.a.s.c.SolrResourceLoader Adding 'file:/x1/jenkins/jenkins-slave/workspace/Lucene-Solr-Tests-5.x-Java7/solr/core/src/test-files/solr/collection1/lib/.svn/' to classloader
   [junit4]   2> 1762933 INFO  (coreLoadExecutor-4752-thread-1) [    ] o.a.s.c.SolrResourceLoader Adding 'file:/x1/jenkins/jenkins-slave/workspace/Lucene-Solr-Tests-5.x-Java7/solr/core/src/test-files/solr/collection1/lib/classes/' to classloader
   [junit4]   2> 1762934 INFO  (coreLoadExecutor-4752-thread-1) [    ] o.a.s.c.SolrResourceLoader Adding 'file:/x1/jenkins/jenkins-slave/workspace/Lucene-Solr-Tests-5.x-Java7/solr/core/src/test-files/solr/collection1/lib/README' to classloader
   [junit4]   2> 1762958 INFO  (coreLoadExecutor-4752-thread-1) [    ] o.a.s.c.SolrConfig current version of requestparams : -1
   [junit4]   2> 1762986 INFO  (coreLoadExecutor-4752-thread-1) [    ] o.a.s.c.SolrConfig Using Lucene MatchVersion: 5.3.0
   [junit4]   2> 1763011 INFO  (coreLoadExecutor-4752-thread-1) [    ] o.a.s.c.Config Loaded SolrConfig: solrconfig-doctransformers.xml
   [junit4]   2> 1763012 INFO  (coreLoadExecutor-4752-thread-1) [    ] o.a.s.s.IndexSchema Reading Solr Schema from /x1/jenkins/jenkins-slave/workspace/Lucene-Solr-Tests-5.x-Java7/solr/core/src/test-files/solr/collection1/conf/schema.xml
   [junit4]   2> 1763019 INFO  (coreLoadExecutor-4752-thread-1) [    ] o.a.s.s.IndexSchema [collection1] Schema name=test
   [junit4]   2> 1763319 INFO  (coreLoadExecutor-4752-thread-1) [    ] o.a.s.s.OpenExchangeRatesOrgProvider Initialized with rates=open-exchange-rates.json, refreshInterval=1440.
   [junit4]   2> 1763327 INFO  (coreLoadExecutor-4752-thread-1) [    ] o.a.s.s.IndexSchema default search field in schema is text
   [junit4]   2> 1763329 INFO  (coreLoadExecutor-4752-thread-1) [    ] o.a.s.s.IndexSchema unique key field: id
   [junit4]   2> 1763334 INFO  (coreLoadExecutor-4752-thread-1) [    ] o.a.s.s.FileExchangeRateProvider Reloading exchange rates from file currency.xml
   [junit4]   2> 1763337 INFO  (coreLoadExecutor-4752-thread-1) [    ] o.a.s.s.FileExchangeRateProvider Reloading exchange rates from file currency.xml
   [junit4]   2> 1763339 INFO  (coreLoadExecutor-4752-thread-1) [    ] o.a.s.s.OpenExchangeRatesOrgProvider Reloading exchange rates from open-exchange-rates.json
   [junit4]   2> 1763339 WARN  (coreLoadExecutor-4752-thread-1) [    ] o.a.s.s.OpenExchangeRatesOrgProvider Unknown key IMPORTANT NOTE
   [junit4]   2> 1763340 WARN  (coreLoadExecutor-4752-thread-1) [    ] o.a.s.s.OpenExchangeRatesOrgProvider Expected key, got STRING
   [junit4]   2> 1763340 INFO  (coreLoadExecutor-4752-thread-1) [    ] o.a.s.s.OpenExchangeRatesOrgProvider Reloading exchange rates from open-exchange-rates.json
   [junit4]   2> 1763340 WARN  (coreLoadExecutor-4752-thread-1) [    ] o.a.s.s.OpenExchangeRatesOrgProvider Unknown key IMPORTANT NOTE
   [junit4]   2> 1763340 WARN  (coreLoadExecutor-4752-thread-1) [    ] o.a.s.s.OpenExchangeRatesOrgProvider Expected key, got STRING
   [junit4]   2> 1763340 INFO  (coreLoadExecutor-4752-thread-1) [    ] o.a.s.c.CoreContainer Creating SolrCore 'collection1' using configuration from instancedir /x1/jenkins/jenkins-slave/workspace/Lucene-Solr-Tests-5.x-Java7/solr/core/src/test-files/solr/collection1/
   [junit4]   2> 1763340 INFO  (coreLoadExecutor-4752-thread-1) [    x:collection1] o.a.s.c.SolrCore org.apache.solr.core.MockDirectoryFactory
   [junit4]   2> 1763341 INFO  (coreLoadExecutor-4752-thread-1) [    x:collection1] o.a.s.c.SolrCore [[collection1] ] Opening new SolrCore at [/x1/jenkins/jenkins-slave/workspace/Lucene-Solr-Tests-5.x-Java7/solr/core/src/test-files/solr/collection1/], dataDir=[null]
   [junit4]   2> 1763341 INFO  (coreLoadExecutor-4752-thread-1) [    x:collection1] o.a.s.c.SolrCore JMX monitoring not detected for core: collection1
   [junit4]   2> 1763341 INFO  (coreLoadExecutor-4752-thread-1) [    x:collection1] o.a.s.c.CachingDirectoryFactory return new directory for /x1/jenkins/jenkins-slave/workspace/Lucene-Solr-Tests-5.x-Java7/solr/build/solr-core/test/J0/temp/solr.response.TestCustomDocTransformer_2C733FFCE6B60D35-001/init-core-data-001
   [junit4]   2> 1763341 INFO  (coreLoadExecutor-4752-thread-1) [    x:collection1] o.a.s.c.SolrCore New index directory detected: old=null new=/x1/jenkins/jenkins-slave/workspace/Lucene-Solr-Tests-5.x-Java7/solr/build/solr-core/test/J0/temp/solr.response.TestCustomDocTransformer_2C733FFCE6B60D35-001/init-core-data-001/index/
   [junit4]   2> 1763342 WARN  (coreLoadExecutor-4752-thread-1) [    x:collection1] o.a.s.c.SolrCore [collection1] Solr index directory '/x1/jenkins/jenkins-slave/workspace/Lucene-Solr-Tests-5.x-Java7/solr/build/solr-core/test/J0/temp/solr.response.TestCustomDocTransformer_2C733FFCE6B60D35-001/init-core-data-001/index' doesn't exist. Creating new index...
   [junit4]   2> 1763342 INFO  (coreLoadExecutor-4752-thread-1) [    x:collection1] o.a.s.c.CachingDirectoryFactory return new directory for /x1/jenkins/jenkins-slave/workspace/Lucene-Solr-Tests-5.x-Java7/solr/build/solr-core/test/J0/temp/solr.response.TestCustomDocTransformer_2C733FFCE6B60D35-001/init-core-data-001/index
   [junit4]   2> 1763343 INFO  (coreLoadExecutor-4752-thread-1) [    x:collection1] o.a.s.c.SolrCore SolrDeletionPolicy.onCommit: commits: num=1
   [junit4]   2> 	commit{dir=MockDirectoryWrapper(NRTCachingDirectory(RAMDirectory@109337c1 lockFactory=org.apache.lucene.store.SingleInstanceLockFactory@31316867; maxCacheMB=0.396484375 maxMergeSizeMB=0.4013671875)),segFN=segments_1,generation=1}
   [junit4]   2> 1763343 INFO  (coreLoadExecutor-4752-thread-1) [    x:collection1] o.a.s.c.SolrCore newest commit generation = 1
   [junit4]   2> 1763343 INFO  (OldIndexDirectoryCleanupThreadForCore-collection1) [    x:collection1] o.a.s.c.SolrCore Looking for old index directories to cleanup for core collection1 in /x1/jenkins/jenkins-slave/workspace/Lucene-Solr-Tests-5.x-Java7/solr/build/solr-core/test/J0/temp/solr.response.TestCustomDocTransformer_2C733FFCE6B60D35-001/init-core-data-001/
   [junit4]   2> 1763348 INFO  (coreLoadExecutor-4752-thread-1) [    x:collection1] o.a.s.c.SolrCore no updateRequestProcessorChain defined as default, creating implicit default
   [junit4]   2> 1763351 INFO  (coreLoadExecutor-4752-thread-1) [    x:collection1] o.a.s.h.l.XMLLoader xsltCacheLifetimeSeconds=60
   [junit4]   2> 1763352 INFO  (coreLoadExecutor-4752-thread-1) [    x:collection1] o.a.s.h.l.XMLLoader xsltCacheLifetimeSeconds=60
   [junit4]   2> 1763353 INFO  (coreLoadExecutor-4752-thread-1) [    x:collection1] o.a.s.h.l.XMLLoader xsltCacheLifetimeSeconds=60
   [junit4]   2> 1763355 INFO  (coreLoadExecutor-4752-thread-1) [    x:collection1] o.a.s.h.l.XMLLoader xsltCacheLifetimeSeconds=60
   [junit4]   2> 1763357 INFO  (coreLoadExecutor-4752-thread-1) [    x:collection1] o.a.s.c.RequestHandlers Registered paths: /update/json/docs,/admin/system,/replication,/admin/mbeans,/update/csv,/admin/ping,/update/json,/admin/properties,/admin/threads,/admin/logging,/schema,/config,/admin/luke,/get,/admin/segments,/admin/plugins,/select,/admin/file,/update
   [junit4]   2> 1763358 INFO  (coreLoadExecutor-4752-thread-1) [    x:collection1] o.a.s.c.SolrCore Using default statsCache cache: org.apache.solr.search.stats.LocalStatsCache
   [junit4]   2> 1763358 INFO  (coreLoadExecutor-4752-thread-1) [    x:collection1] o.a.s.u.UpdateHandler Using UpdateLog implementation: org.apache.solr.update.UpdateLog
   [junit4]   2> 1763359 INFO  (coreLoadExecutor-4752-thread-1) [    x:collection1] o.a.s.u.UpdateLog Initializing UpdateLog: dataDir= defaultSyncLevel=FLUSH numRecordsToKeep=100 maxNumLogsToKeep=10 numVersionBuckets=65536
   [junit4]   2> 1763359 INFO  (coreLoadExecutor-4752-thread-1) [    x:collection1] o.a.s.c.SolrCore Hard AutoCommit: disabled
   [junit4]   2> 1763359 INFO  (coreLoadExecutor-4752-thread-1) [    x:collection1] o.a.s.c.SolrCore Soft AutoCommit: disabled
   [junit4]   2> 1763360 INFO  (coreLoadExecutor-4752-thread-1) [    x:collection1] o.a.s.c.SolrCore SolrDeletionPolicy.onInit: commits: num=1
   [junit4]   2> 	commit{dir=MockDirectoryWrapper(NRTCachingDirectory(RAMDirectory@109337c1 lockFactory=org.apache.lucene.store.SingleInstanceLockFactory@31316867; maxCacheMB=0.396484375 maxMergeSizeMB=0.4013671875)),segFN=segments_1,generation=1}
   [junit4]   2> 1763360 INFO  (coreLoadExecutor-4752-thread-1) [    x:collection1] o.a.s.c.SolrCore newest commit generation = 1
   [junit4]   2> 1763360 INFO  (coreLoadExecutor-4752-thread-1) [    x:collection1] o.a.s.s.SolrIndexSearcher Opening Searcher@64c92156[collection1] main
   [junit4]   2> 1763360 WARN  (coreLoadExecutor-4752-thread-1) [    x:collection1] o.a.s.r.ManagedResourceStorage Cannot write to config directory /x1/jenkins/jenkins-slave/workspace/Lucene-Solr-Tests-5.x-Java7/solr/core/src/test-files/solr/collection1/conf; switching to use InMemory storage instead.
   [junit4]   2> 1763361 INFO  (coreLoadExecutor-4752-thread-1) [    x:collection1] o.a.s.r.RestManager Initializing RestManager with initArgs: {}
   [junit4]   2> 1763361 INFO  (coreLoadExecutor-4752-thread-1) [    x:collection1] o.a.s.r.ManagedResourceStorage Reading _rest_managed.json using InMemoryStorage
   [junit4]   2> 1763361 INFO  (coreLoadExecutor-4752-thread-1) [    x:collection1] o.a.s.r.RestManager Initializing 0 registered ManagedResources
   [junit4]   2> 1763361 INFO  (coreLoadExecutor-4752-thread-1) [    x:collection1] o.a.s.h.ReplicationHandler Commits will be reserved for  10000
   [junit4]   2> 1763361 INFO  (coreLoadExecutor-4752-thread-1) [    x:collection1] o.a.s.u.UpdateLog Looking up max value of version field to seed version buckets
   [junit4]   2> 1763361 INFO  (searcherExecutor-4753-thread-1-processing-x:collection1) [    x:collection1] o.a.s.c.SolrCore [collection1] Registered new searcher Searcher@64c92156[collection1] main{ExitableDirectoryReader(UninvertingDirectoryReader())}
   [junit4]   2> 1763361 INFO  (coreLoadExecutor-4752-thread-1) [    x:collection1] o.a.s.u.VersionInfo Refreshing highest value of _version_ for 65536 version buckets from index
   [junit4]   2> 1763362 INFO  (coreLoadExecutor-4752-thread-1) [    x:collection1] o.a.s.u.VersionInfo No terms found for _version_, cannot seed version bucket highest value from index
   [junit4]   2> 1763362 INFO  (coreLoadExecutor-4752-thread-1) [    x:collection1] o.a.s.u.UpdateLog Could not find max version in index or recent updates, using new clock 1504960525955497984
   [junit4]   2> 1763364 INFO  (coreLoadExecutor-4752-thread-1) [    x:collection1] o.a.s.u.UpdateLog Took 3 ms to seed version buckets with highest version 1504960525955497984
   [junit4]   2> 1763364 INFO  (coreLoadExecutor-4752-thread-1) [    x:collection1] o.a.s.c.CoreContainer registering core: collection1
   [junit4]   2> 1763365 INFO  (SUITE-TestCustomDocTransformer-seed#[2C733FFCE6B60D35]-worker) [    ] o.a.s.SolrTestCaseJ4 ####initCore end
   [junit4]   2> 1763369 INFO  (TEST-TestCustomDocTransformer.testCustomTransformer-seed#[2C733FFCE6B60D35]) [    ] o.a.s.SolrTestCaseJ4 ###Starting testCustomTransformer
   [junit4]   2> 1763371 INFO  (TEST-TestCustomDocTransformer.testCustomTransformer-seed#[2C733FFCE6B60D35]) [    ] o.a.s.u.p.LogUpdateProcessor [collection1] webapp=null path=null params={wt=json&indent=true} {add=[0 (1504960525962838016)]} 0 2
   [junit4]   2> 1763372 INFO  (TEST-TestCustomDocTransformer.testCustomTransformer-seed#[2C733FFCE6B60D35]) [    ] o.a.s.u.p.LogUpdateProcessor [collection1] webapp=null path=null params={wt=json&indent=true} {add=[1 (1504960525965983744)]} 0 0
   [junit4]   2> 1763372 INFO  (TEST-TestCustomDocTransformer.testCustomTransformer-seed#[2C733FFCE6B60D35]) [    ] o.a.s.u.p.LogUpdateProcessor [collection1] webapp=null path=null params={wt=json&indent=true} {add=[2 (1504960525965983745)]} 0 0
   [junit4]   2> 1763373 INFO  (TEST-TestCustomDocTransformer.testCustomTransformer-seed#[2C733FFCE6B60D35]) [    ] o.a.s.u.p.LogUpdateProcessor [collection1] webapp=null path=null params={wt=json&indent=true} {add=[3 (1504960525967032320)]} 0 0
   [junit4]   2> 1763373 INFO  (TEST-TestCustomDocTransformer.testCustomTransformer-seed#[2C733FFCE6B60D35]) [    ] o.a.s.u.p.LogUpdateProcessor [collection1] webapp=null path=null params={wt=json&indent=true} {add=[4 (1504960525967032321)]} 0 0
   [junit4]   2> 1763374 INFO  (TEST-TestCustomDocTransformer.testCustomTransformer-seed#[2C733FFCE6B60D35]) [    ] o.a.s.u.p.LogUpdateProcessor [collection1] webapp=null path=null params={wt=json&indent=true} {add=[5 (1504960525967032322)]} 0 0
   [junit4]   2> 1763374 INFO  (TEST-TestCustomDocTransformer.testCustomTransformer-seed#[2C733FFCE6B60D35]) [    ] o.a.s.u.p.LogUpdateProcessor [collection1] webapp=null path=null params={wt=json&indent=true} {add=[6 (1504960525968080896)]} 0 0
   [junit4]   2> 1763375 INFO  (TEST-TestCustomDocTransformer.testCustomTransformer-seed#[2C733FFCE6B60D35]) [    ] o.a.s.u.p.LogUpdateProcessor [collection1] webapp=null path=null params={wt=json&indent=true} {add=[7 (1504960525968080897)]} 0 0
   [junit4]   2> 1763375 INFO  (TEST-TestCustomDocTransformer.testCustomTransformer-seed#[2C733FFCE6B60D35]) [    ] o.a.s.u.p.LogUpdateProcessor [collection1] webapp=null path=null params={wt=json&indent=true} {add=[8 (1504960525969129472)]} 0 0
   [junit4]   2> 1763375 INFO  (TEST-TestCustomDocTransformer.testCustomTransformer-seed#[2C733FFCE6B60D35]) [    ] o.a.s.u.p.LogUpdateProcessor [collection1] webapp=null path=null params={wt=json&indent=true} {add=[9 (1504960525969129473)]} 0 0
   [junit4]   2> 1763376 INFO  (TEST-TestCustomDocTransformer.testCustomTransformer-seed#[2C733FFCE6B60D35]) [    ] o.a.s.u.UpdateHandler start commit{,optimize=false,openSearcher=true,waitSearcher=true,expungeDeletes=false,softCommit=false,prepareCommit=false}
   [junit4]   2> 1763381 INFO  (TEST-TestCustomDocTransformer.testCustomTransformer-seed#[2C733FFCE6B60D35]) [    ] o.a.s.c.SolrCore SolrDeletionPolicy.onCommit: commits: num=2
   [junit4]   2> 	commit{dir=MockDirectoryWrapper(NRTCachingDirectory(RAMDirectory@109337c1 lockFactory=org.apache.lucene.store.SingleInstanceLockFactory@31316867; maxCacheMB=0.396484375 maxMergeSizeMB=0.4013671875)),segFN=segments_1,generation=1}
   [junit4]   2> 	commit{dir=MockDirectoryWrapper(NRTCachingDirectory(RAMDirectory@109337c1 lockFactory=org.apache.lucene.store.SingleInstanceLockFactory@31316867; maxCacheMB=0.396484375 maxMergeSizeMB=0.4013671875)),segFN=segments_2,generation=2}
   [junit4]   2> 1763381 INFO  (TEST-TestCustomDocTransformer.testCustomTransformer-seed#[2C733FFCE6B60D35]) [    ] o.a.s.c.SolrCore newest commit generation = 2
   [junit4]   2> 1763383 INFO  (TEST-TestCustomDocTransformer.testCustomTransformer-seed#[2C733FFCE6B60D35]) [    ] o.a.s.s.SolrIndexSearcher Opening Searcher@2c3e3591[collection1] main
   [junit4]   2> 1763384 INFO  (searcherExecutor-4753-thread-1) [    ] o.a.s.c.SolrCore [collection1] Registered new searcher Searcher@2c3e3591[collection1] main{ExitableDirectoryReader(UninvertingDirectoryReader(Uninverting(_0(5.3.0):c10)))}
   [junit4]   2> 1763384 INFO  (TEST-TestCustomDocTransformer.testCustomTransformer-seed#[2C733FFCE6B60D35]) [    ] o.a.s.u.UpdateHandler end_commit_flush
   [junit4]   2> 1763384 INFO  (TEST-TestCustomDocTransformer.testCustomTransformer-seed#[2C733FFCE6B60D35]) [    ] o.a.s.u.p.LogUpdateProcessor [collection1] webapp=null path=null params={} {commit=} 0 8
   [junit4]   2> 1763387 INFO  (TEST-TestCustomDocTransformer.testCustomTransformer-seed#[2C733FFCE6B60D35]) [    ] o.a.s.c.S.Request [collection1] webapp=null path=null params={wt=xml&q=*:*} hits=10 status=0 QTime=0

[...truncated too long message...]

Container Shutting down CoreContainer instance=160857650
   [junit4]   2> 1763412 INFO  (SUITE-TestCustomDocTransformer-seed#[2C733FFCE6B60D35]-worker) [    x:collection1] o.a.s.c.SolrCore [collection1]  CLOSING SolrCore org.apache.solr.core.SolrCore@2a100f8b
   [junit4]   2> 1763413 INFO  (SUITE-TestCustomDocTransformer-seed#[2C733FFCE6B60D35]-worker) [    x:collection1] o.a.s.u.UpdateHandler closing DirectUpdateHandler2{commits=2,autocommits=0,soft autocommits=0,optimizes=0,rollbacks=0,expungeDeletes=0,docsPending=0,adds=0,deletesById=0,deletesByQuery=0,errors=0,cumulative_adds=10,cumulative_deletesById=0,cumulative_deletesByQuery=1,cumulative_errors=0,transaction_logs_total_size=612,transaction_logs_total_number=2}
   [junit4]   2> 1763413 INFO  (SUITE-TestCustomDocTransformer-seed#[2C733FFCE6B60D35]-worker) [    x:collection1] o.a.s.u.SolrCoreState Closing SolrCoreState
   [junit4]   2> 1763413 INFO  (SUITE-TestCustomDocTransformer-seed#[2C733FFCE6B60D35]-worker) [    x:collection1] o.a.s.u.DefaultSolrCoreState SolrCoreState ref count has reached 0 - closing IndexWriter
   [junit4]   2> 1763413 INFO  (SUITE-TestCustomDocTransformer-seed#[2C733FFCE6B60D35]-worker) [    x:collection1] o.a.s.u.DefaultSolrCoreState closing IndexWriter with IndexWriterCloser
   [junit4]   2> 1763413 INFO  (SUITE-TestCustomDocTransformer-seed#[2C733FFCE6B60D35]-worker) [    x:collection1] o.a.s.c.SolrCore [collection1] Closing main searcher on request.
   [junit4]   2> 1763414 INFO  (SUITE-TestCustomDocTransformer-seed#[2C733FFCE6B60D35]-worker) [    x:collection1] o.a.s.c.CachingDirectoryFactory Closing MockDirectoryFactory - 2 directories currently being tracked
   [junit4]   2> 1763414 INFO  (SUITE-TestCustomDocTransformer-seed#[2C733FFCE6B60D35]-worker) [    x:collection1] o.a.s.c.CachingDirectoryFactory looking to close /x1/jenkins/jenkins-slave/workspace/Lucene-Solr-Tests-5.x-Java7/solr/build/solr-core/test/J0/temp/solr.response.TestCustomDocTransformer_2C733FFCE6B60D35-001/init-core-data-001/index [CachedDir<<refCount=0;path=/x1/jenkins/jenkins-slave/workspace/Lucene-Solr-Tests-5.x-Java7/solr/build/solr-core/test/J0/temp/solr.response.TestCustomDocTransformer_2C733FFCE6B60D35-001/init-core-data-001/index;done=false>>]
   [junit4]   2> 1763414 INFO  (SUITE-TestCustomDocTransformer-seed#[2C733FFCE6B60D35]-worker) [    x:collection1] o.a.s.c.CachingDirectoryFactory Closing directory: /x1/jenkins/jenkins-slave/workspace/Lucene-Solr-Tests-5.x-Java7/solr/build/solr-core/test/J0/temp/solr.response.TestCustomDocTransformer_2C733FFCE6B60D35-001/init-core-data-001/index
   [junit4]   2> 1763414 INFO  (SUITE-TestCustomDocTransformer-seed#[2C733FFCE6B60D35]-worker) [    x:collection1] o.a.s.c.CachingDirectoryFactory looking to close /x1/jenkins/jenkins-slave/workspace/Lucene-Solr-Tests-5.x-Java7/solr/build/solr-core/test/J0/temp/solr.response.TestCustomDocTransformer_2C733FFCE6B60D35-001/init-core-data-001 [CachedDir<<refCount=0;path=/x1/jenkins/jenkins-slave/workspace/Lucene-Solr-Tests-5.x-Java7/solr/build/solr-core/test/J0/temp/solr.response.TestCustomDocTransformer_2C733FFCE6B60D35-001/init-core-data-001;done=false>>]
   [junit4]   2> 1763414 INFO  (SUITE-TestCustomDocTransformer-seed#[2C733FFCE6B60D35]-worker) [    x:collection1] o.a.s.c.CachingDirectoryFactory Closing directory: /x1/jenkins/jenkins-slave/workspace/Lucene-Solr-Tests-5.x-Java7/solr/build/solr-core/test/J0/temp/solr.response.TestCustomDocTransformer_2C733FFCE6B60D35-001/init-core-data-001
   [junit4]   2> NOTE: leaving temporary files on disk at: /x1/jenkins/jenkins-slave/workspace/Lucene-Solr-Tests-5.x-Java7/solr/build/solr-core/test/J0/temp/solr.response.TestCustomDocTransformer_2C733FFCE6B60D35-001
   [junit4]   2> NOTE: test params are: codec=Asserting(Lucene53): {timestamp=PostingsFormat(name=Asserting), text=PostingsFormat(name=MockRandom), range_facet_l_dv=PostingsFormat(name=Memory doPackFST= true), _version_=TestBloomFilteredLucenePostings(BloomFilteringPostingsFormat(Lucene50(blocksize=128))), title_lettertok=PostingsFormat(name=Memory doPackFST= true), multiDefault=PostingsFormat(name=Asserting), intDefault=TestBloomFilteredLucenePostings(BloomFilteringPostingsFormat(Lucene50(blocksize=128))), title=TestBloomFilteredLucenePostings(BloomFilteringPostingsFormat(Lucene50(blocksize=128))), subject=PostingsFormat(name=Asserting), title_stemmed=TestBloomFilteredLucenePostings(BloomFilteringPostingsFormat(Lucene50(blocksize=128))), range_facet_l=PostingsFormat(name=Asserting), range_facet_i_dv=PostingsFormat(name=Asserting), id=PostingsFormat(name=Memory doPackFST= true), title_stringNoNorms=PostingsFormat(name=Asserting)}, docValues:{timestamp=DocValuesFormat(name=Lucene50), range_facet_l_dv=DocValuesFormat(name=Memory), range_facet_i_dv=DocValuesFormat(name=Lucene50)}, sim=RandomSimilarityProvider(queryNorm=false,coord=yes): {}, locale=nl_BE, timezone=Portugal
   [junit4]   2> NOTE: Linux 3.13.0-52-generic amd64/Oracle Corporation 1.7.0_72 (64-bit)/cpus=4,threads=1,free=212784088,total=529530880
   [junit4]   2> NOTE: All tests run in this JVM: [TestSolrIndexConfig, HdfsNNFailoverTest, TestBadConfig, TestZkChroot, ScriptEngineTest, ReturnFieldsTest, SpellCheckCollatorTest, DistributedTermsComponentTest, TestFieldResource, FieldAnalysisRequestHandlerTest, ChaosMonkeySafeLeaderTest, OverseerStatusTest, TestWordDelimiterFilterFactory, ShardRoutingTest, AddBlockUpdateTest, TestObjectReleaseTracker, TestPerFieldSimilarity, TestLRUCache, TestSolrDeletionPolicy2, NoCacheHeaderTest, HdfsChaosMonkeySafeLeaderTest, TestRTGBase, SliceStateTest, FieldMutatingUpdateProcessorTest, BadComponentTest, PrimUtilsTest, TestSchemaNameResource, PluginInfoTest, TestSuggestSpellingConverter, TestShardHandlerFactory, TestQueryUtils, HighlighterConfigTest, TestMiniSolrCloudClusterSSL, MergeStrategyTest, TestDistributedGrouping, TestElisionMultitermQuery, TestRestManager, TestSolr4Spatial2, TestReload, SharedFSAutoReplicaFailoverTest, TestChildDocTransformer, TestMergePolicyConfig, TestManagedResourceStorage, BlockDirectoryTest, TestAuthorizationFramework, TestOrdValues, SolrCoreCheckLockOnStartupTest, SoftAutoCommitTest, SolrCmdDistributorTest, SmileWriterTest, TestTolerantSearch, OutOfBoxZkACLAndCredentialsProvidersTest, DirectUpdateHandlerOptimizeTest, TestJmxIntegration, ShowFileRequestHandlerTest, RequestLoggingTest, QueryParsingTest, TestDownShardTolerantSearch, ConvertedLegacyTest, TestOverriddenPrefixQueryForCustomFieldType, TestFaceting, TestHighlightDedupGrouping, ExternalFileFieldSortTest, TestSolrXml, ZkControllerTest, DefaultValueUpdateProcessorTest, AddSchemaFieldsUpdateProcessorFactoryTest, SortByFunctionTest, SegmentsInfoRequestHandlerTest, DistributedSpellCheckComponentTest, TestRawResponseWriter, RulesTest, DocExpirationUpdateProcessorFactoryTest, UpdateParamsTest, DocValuesMultiTest, ParsingFieldUpdateProcessorsTest, AnalysisErrorHandlingTest, UnloadDistributedZkTest, SchemaVersionSpecificBehaviorTest, TestGroupingSearch, URLClassifyProcessorTest, TestCloudManagedSchemaConcurrent, HttpPartitionTest, CustomCollectionTest, DistributedVersionInfoTest, BasicDistributedZk2Test, MigrateRouteKeyTest, SolrCloudExampleTest, TestCryptoKeys, DistributedIntervalFacetingTest, TestRandomRequestDistribution, CollectionsAPIAsyncDistributedZkTest, DeleteReplicaTest, TestRequestStatusCollectionAPI, RemoteQueryErrorTest, TestCloudManagedSchema, TestRandomFaceting, DistributedFacetPivotLargeTest, TestSolrCloudWithKerberosAlt, TestDistributedMissingSort, AsyncCallRequestStatusResponseTest, CursorPagingTest, TestManagedSchemaDynamicFieldResource, ExitableDirectoryReaderTest, SaslZkACLProviderTest, CachingDirectoryFactoryTest, ZkCLITest, AnalyticsMergeStrategyTest, TestRangeQuery, ConnectionManagerTest, SpatialRPTFieldTypeTest, ActionThrottleTest, TestCoreDiscovery, OverseerCollectionProcessorTest, BadIndexSchemaTest, HighlighterTest, BasicFunctionalityTest, SuggesterTest, SuggesterFSTTest, IndexBasedSpellCheckerTest, TestComplexPhraseQParserPlugin, CursorMarkTest, SpatialFilterTest, TestCollapseQParserPlugin, TestRemoveLastDynamicCopyField, IndexSchemaTest, InfoHandlerTest, BJQParserTest, TermVectorComponentTest, TestAnalyzedSuggestions, TestValueSourceCache, RankQueryTest, JSONWriterTest, UniqFieldsUpdateProcessorFactoryTest, TestCustomDocTransformer]
   [junit4] Completed [414/507] on J0 in 0.91s, 1 test, 1 error <<< FAILURES!

[...truncated 292 lines...]
BUILD FAILED
/x1/jenkins/jenkins-slave/workspace/Lucene-Solr-Tests-5.x-Java7/build.xml:536: The following error occurred while executing this line:
/x1/jenkins/jenkins-slave/workspace/Lucene-Solr-Tests-5.x-Java7/build.xml:484: The following error occurred while executing this line:
/x1/jenkins/jenkins-slave/workspace/Lucene-Solr-Tests-5.x-Java7/build.xml:61: The following error occurred while executing this line:
/x1/jenkins/jenkins-slave/workspace/Lucene-Solr-Tests-5.x-Java7/extra-targets.xml:39: The following error occurred while executing this line:
/x1/jenkins/jenkins-slave/workspace/Lucene-Solr-Tests-5.x-Java7/solr/build.xml:230: The following error occurred while executing this line:
/x1/jenkins/jenkins-slave/workspace/Lucene-Solr-Tests-5.x-Java7/solr/common-build.xml:512: The following error occurred while executing this line:
/x1/jenkins/jenkins-slave/workspace/Lucene-Solr-Tests-5.x-Java7/lucene/common-build.xml:1444: The following error occurred while executing this line:
/x1/jenkins/jenkins-slave/workspace/Lucene-Solr-Tests-5.x-Java7/lucene/common-build.xml:999: There were test failures: 507 suites, 2007 tests, 2 errors, 59 ignored (25 assumptions)

Total time: 52 minutes 38 seconds
Build step 'Invoke Ant' marked build as failure
Archiving artifacts
Sending artifact delta relative to Lucene-Solr-Tests-5.x-Java7 #3254
Archived 4 artifacts
Archive block size is 32768
Received 0 blocks and 317702379 bytes
Compression is 0.0%
Took 52 sec
Recording test results
Email was triggered for: Failure
Sending email for trigger: Failure



Mime
View raw message