lucene-dev mailing list archives

Site index · List index
Message view « Date » · « Thread »
Top « Date » · « Thread »
From Apache Jenkins Server <jenk...@builds.apache.org>
Subject [JENKINS] Lucene-Solr-Tests-trunk-Java8 - Build # 36 - Still Failing
Date Thu, 04 Jun 2015 02:24:35 GMT
Build: https://builds.apache.org/job/Lucene-Solr-Tests-trunk-Java8/36/

1 tests failed.
FAILED:  org.apache.solr.cloud.MultiThreadedOCPTest.test

Error Message:
Mutual exclusion failed. Found more than one task running for the same collection

Stack Trace:
java.lang.AssertionError: Mutual exclusion failed. Found more than one task running for the same collection
	at __randomizedtesting.SeedInfo.seed([CB45F455B0319F04:4311CB8F1ECDF2FC]:0)
	at org.junit.Assert.fail(Assert.java:93)
	at org.junit.Assert.assertTrue(Assert.java:43)
	at org.apache.solr.cloud.MultiThreadedOCPTest.testTaskExclusivity(MultiThreadedOCPTest.java:139)
	at org.apache.solr.cloud.MultiThreadedOCPTest.test(MultiThreadedOCPTest.java:61)
	at sun.reflect.NativeMethodAccessorImpl.invoke0(Native Method)
	at sun.reflect.NativeMethodAccessorImpl.invoke(NativeMethodAccessorImpl.java:62)
	at sun.reflect.DelegatingMethodAccessorImpl.invoke(DelegatingMethodAccessorImpl.java:43)
	at java.lang.reflect.Method.invoke(Method.java:483)
	at com.carrotsearch.randomizedtesting.RandomizedRunner.invoke(RandomizedRunner.java:1627)
	at com.carrotsearch.randomizedtesting.RandomizedRunner$6.evaluate(RandomizedRunner.java:836)
	at com.carrotsearch.randomizedtesting.RandomizedRunner$7.evaluate(RandomizedRunner.java:872)
	at com.carrotsearch.randomizedtesting.RandomizedRunner$8.evaluate(RandomizedRunner.java:886)
	at org.apache.solr.BaseDistributedSearchTestCase$ShardsRepeatRule$ShardsFixedStatement.callStatement(BaseDistributedSearchTestCase.java:960)
	at org.apache.solr.BaseDistributedSearchTestCase$ShardsRepeatRule$ShardsStatement.evaluate(BaseDistributedSearchTestCase.java:935)
	at com.carrotsearch.randomizedtesting.rules.SystemPropertiesRestoreRule$1.evaluate(SystemPropertiesRestoreRule.java:57)
	at org.apache.lucene.util.TestRuleSetupTeardownChained$1.evaluate(TestRuleSetupTeardownChained.java:50)
	at org.apache.lucene.util.AbstractBeforeAfterRule$1.evaluate(AbstractBeforeAfterRule.java:46)
	at org.apache.lucene.util.TestRuleThreadAndTestName$1.evaluate(TestRuleThreadAndTestName.java:49)
	at org.apache.lucene.util.TestRuleIgnoreAfterMaxFailures$1.evaluate(TestRuleIgnoreAfterMaxFailures.java:65)
	at org.apache.lucene.util.TestRuleMarkFailure$1.evaluate(TestRuleMarkFailure.java:48)
	at com.carrotsearch.randomizedtesting.rules.StatementAdapter.evaluate(StatementAdapter.java:36)
	at com.carrotsearch.randomizedtesting.ThreadLeakControl$StatementRunner.run(ThreadLeakControl.java:365)
	at com.carrotsearch.randomizedtesting.ThreadLeakControl.forkTimeoutingTask(ThreadLeakControl.java:798)
	at com.carrotsearch.randomizedtesting.ThreadLeakControl$3.evaluate(ThreadLeakControl.java:458)
	at com.carrotsearch.randomizedtesting.RandomizedRunner.runSingleTest(RandomizedRunner.java:845)
	at com.carrotsearch.randomizedtesting.RandomizedRunner$3.evaluate(RandomizedRunner.java:747)
	at com.carrotsearch.randomizedtesting.RandomizedRunner$4.evaluate(RandomizedRunner.java:781)
	at com.carrotsearch.randomizedtesting.RandomizedRunner$5.evaluate(RandomizedRunner.java:792)
	at com.carrotsearch.randomizedtesting.rules.StatementAdapter.evaluate(StatementAdapter.java:36)
	at com.carrotsearch.randomizedtesting.rules.SystemPropertiesRestoreRule$1.evaluate(SystemPropertiesRestoreRule.java:57)
	at org.apache.lucene.util.AbstractBeforeAfterRule$1.evaluate(AbstractBeforeAfterRule.java:46)
	at com.carrotsearch.randomizedtesting.rules.StatementAdapter.evaluate(StatementAdapter.java:36)
	at org.apache.lucene.util.TestRuleStoreClassName$1.evaluate(TestRuleStoreClassName.java:42)
	at com.carrotsearch.randomizedtesting.rules.NoShadowingOrOverridesOnMethodsRule$1.evaluate(NoShadowingOrOverridesOnMethodsRule.java:39)
	at com.carrotsearch.randomizedtesting.rules.NoShadowingOrOverridesOnMethodsRule$1.evaluate(NoShadowingOrOverridesOnMethodsRule.java:39)
	at com.carrotsearch.randomizedtesting.rules.StatementAdapter.evaluate(StatementAdapter.java:36)
	at com.carrotsearch.randomizedtesting.rules.StatementAdapter.evaluate(StatementAdapter.java:36)
	at com.carrotsearch.randomizedtesting.rules.StatementAdapter.evaluate(StatementAdapter.java:36)
	at org.apache.lucene.util.TestRuleAssertionsRequired$1.evaluate(TestRuleAssertionsRequired.java:54)
	at org.apache.lucene.util.TestRuleMarkFailure$1.evaluate(TestRuleMarkFailure.java:48)
	at org.apache.lucene.util.TestRuleIgnoreAfterMaxFailures$1.evaluate(TestRuleIgnoreAfterMaxFailures.java:65)
	at org.apache.lucene.util.TestRuleIgnoreTestSuites$1.evaluate(TestRuleIgnoreTestSuites.java:55)
	at com.carrotsearch.randomizedtesting.rules.StatementAdapter.evaluate(StatementAdapter.java:36)
	at com.carrotsearch.randomizedtesting.ThreadLeakControl$StatementRunner.run(ThreadLeakControl.java:365)
	at java.lang.Thread.run(Thread.java:745)




Build Log:
[...truncated 9671 lines...]
   [junit4] Suite: org.apache.solr.cloud.MultiThreadedOCPTest
   [junit4]   2> Creating dataDir: /x1/jenkins/jenkins-slave/workspace/Lucene-Solr-Tests-trunk-Java8/solr/build/solr-core/test/J0/temp/solr.cloud.MultiThreadedOCPTest CB45F455B0319F04-001/init-core-data-001
   [junit4]   2> 518368 INFO  (SUITE-MultiThreadedOCPTest-seed#[CB45F455B0319F04]-worker) [    ] o.a.s.SolrTestCaseJ4 Randomized ssl (false) and clientAuth (false)
   [junit4]   2> 518369 INFO  (SUITE-MultiThreadedOCPTest-seed#[CB45F455B0319F04]-worker) [    ] o.a.s.BaseDistributedSearchTestCase Setting hostContext system property: /xvz/qq
   [junit4]   2> 518372 INFO  (TEST-MultiThreadedOCPTest.test-seed#[CB45F455B0319F04]) [    ] o.a.s.c.ZkTestServer STARTING ZK TEST SERVER
   [junit4]   2> 518381 INFO  (Thread-1353) [    ] o.a.s.c.ZkTestServer client port:0.0.0.0/0.0.0.0:0
   [junit4]   2> 518381 INFO  (Thread-1353) [    ] o.a.s.c.ZkTestServer Starting server
   [junit4]   2> 518481 INFO  (TEST-MultiThreadedOCPTest.test-seed#[CB45F455B0319F04]) [    ] o.a.s.c.ZkTestServer start zk server on port:33054
   [junit4]   2> 518481 INFO  (TEST-MultiThreadedOCPTest.test-seed#[CB45F455B0319F04]) [    ] o.a.s.c.c.SolrZkClient Using default ZkCredentialsProvider
   [junit4]   2> 518483 INFO  (TEST-MultiThreadedOCPTest.test-seed#[CB45F455B0319F04]) [    ] o.a.s.c.c.ConnectionManager Waiting for client to connect to ZooKeeper
   [junit4]   2> 518489 INFO  (zkCallback-341-thread-1) [    ] o.a.s.c.c.ConnectionManager Watcher org.apache.solr.common.cloud.ConnectionManager@7f629f2b name:ZooKeeperConnection Watcher:127.0.0.1:33054 got event WatchedEvent state:SyncConnected type:None path:null path:null type:None
   [junit4]   2> 518489 INFO  (TEST-MultiThreadedOCPTest.test-seed#[CB45F455B0319F04]) [    ] o.a.s.c.c.ConnectionManager Client is connected to ZooKeeper
   [junit4]   2> 518489 INFO  (TEST-MultiThreadedOCPTest.test-seed#[CB45F455B0319F04]) [    ] o.a.s.c.c.SolrZkClient Using default ZkACLProvider
   [junit4]   2> 518489 INFO  (TEST-MultiThreadedOCPTest.test-seed#[CB45F455B0319F04]) [    ] o.a.s.c.c.SolrZkClient makePath: /solr
   [junit4]   2> 518492 INFO  (TEST-MultiThreadedOCPTest.test-seed#[CB45F455B0319F04]) [    ] o.a.s.c.c.SolrZkClient Using default ZkCredentialsProvider
   [junit4]   2> 518498 INFO  (TEST-MultiThreadedOCPTest.test-seed#[CB45F455B0319F04]) [    ] o.a.s.c.c.ConnectionManager Waiting for client to connect to ZooKeeper
   [junit4]   2> 518499 INFO  (zkCallback-342-thread-1) [    ] o.a.s.c.c.ConnectionManager Watcher org.apache.solr.common.cloud.ConnectionManager@5205fc28 name:ZooKeeperConnection Watcher:127.0.0.1:33054/solr got event WatchedEvent state:SyncConnected type:None path:null path:null type:None
   [junit4]   2> 518499 INFO  (TEST-MultiThreadedOCPTest.test-seed#[CB45F455B0319F04]) [    ] o.a.s.c.c.ConnectionManager Client is connected to ZooKeeper
   [junit4]   2> 518499 INFO  (TEST-MultiThreadedOCPTest.test-seed#[CB45F455B0319F04]) [    ] o.a.s.c.c.SolrZkClient Using default ZkACLProvider
   [junit4]   2> 518499 INFO  (TEST-MultiThreadedOCPTest.test-seed#[CB45F455B0319F04]) [    ] o.a.s.c.c.SolrZkClient makePath: /collections/collection1
   [junit4]   2> 518501 INFO  (TEST-MultiThreadedOCPTest.test-seed#[CB45F455B0319F04]) [    ] o.a.s.c.c.SolrZkClient makePath: /collections/collection1/shards
   [junit4]   2> 518502 INFO  (TEST-MultiThreadedOCPTest.test-seed#[CB45F455B0319F04]) [    ] o.a.s.c.c.SolrZkClient makePath: /collections/control_collection
   [junit4]   2> 518504 INFO  (TEST-MultiThreadedOCPTest.test-seed#[CB45F455B0319F04]) [    ] o.a.s.c.c.SolrZkClient makePath: /collections/control_collection/shards
   [junit4]   2> 518505 INFO  (TEST-MultiThreadedOCPTest.test-seed#[CB45F455B0319F04]) [    ] o.a.s.c.AbstractZkTestCase put /x1/jenkins/jenkins-slave/workspace/Lucene-Solr-Tests-trunk-Java8/solr/core/src/test-files/solr/collection1/conf/solrconfig-tlog.xml to /configs/conf1/solrconfig.xml
   [junit4]   2> 518505 INFO  (TEST-MultiThreadedOCPTest.test-seed#[CB45F455B0319F04]) [    ] o.a.s.c.c.SolrZkClient makePath: /configs/conf1/solrconfig.xml
   [junit4]   2> 518507 INFO  (TEST-MultiThreadedOCPTest.test-seed#[CB45F455B0319F04]) [    ] o.a.s.c.AbstractZkTestCase put /x1/jenkins/jenkins-slave/workspace/Lucene-Solr-Tests-trunk-Java8/solr/core/src/test-files/solr/collection1/conf/schema.xml to /configs/conf1/schema.xml
   [junit4]   2> 518507 INFO  (TEST-MultiThreadedOCPTest.test-seed#[CB45F455B0319F04]) [    ] o.a.s.c.c.SolrZkClient makePath: /configs/conf1/schema.xml
   [junit4]   2> 518509 INFO  (TEST-MultiThreadedOCPTest.test-seed#[CB45F455B0319F04]) [    ] o.a.s.c.AbstractZkTestCase put /x1/jenkins/jenkins-slave/workspace/Lucene-Solr-Tests-trunk-Java8/solr/core/src/test-files/solr/collection1/conf/solrconfig.snippet.randomindexconfig.xml to /configs/conf1/solrconfig.snippet.randomindexconfig.xml
   [junit4]   2> 518509 INFO  (TEST-MultiThreadedOCPTest.test-seed#[CB45F455B0319F04]) [    ] o.a.s.c.c.SolrZkClient makePath: /configs/conf1/solrconfig.snippet.randomindexconfig.xml
   [junit4]   2> 518510 INFO  (TEST-MultiThreadedOCPTest.test-seed#[CB45F455B0319F04]) [    ] o.a.s.c.AbstractZkTestCase put /x1/jenkins/jenkins-slave/workspace/Lucene-Solr-Tests-trunk-Java8/solr/core/src/test-files/solr/collection1/conf/stopwords.txt to /configs/conf1/stopwords.txt
   [junit4]   2> 518511 INFO  (TEST-MultiThreadedOCPTest.test-seed#[CB45F455B0319F04]) [    ] o.a.s.c.c.SolrZkClient makePath: /configs/conf1/stopwords.txt
   [junit4]   2> 518512 INFO  (TEST-MultiThreadedOCPTest.test-seed#[CB45F455B0319F04]) [    ] o.a.s.c.AbstractZkTestCase put /x1/jenkins/jenkins-slave/workspace/Lucene-Solr-Tests-trunk-Java8/solr/core/src/test-files/solr/collection1/conf/protwords.txt to /configs/conf1/protwords.txt
   [junit4]   2> 518512 INFO  (TEST-MultiThreadedOCPTest.test-seed#[CB45F455B0319F04]) [    ] o.a.s.c.c.SolrZkClient makePath: /configs/conf1/protwords.txt
   [junit4]   2> 518514 INFO  (TEST-MultiThreadedOCPTest.test-seed#[CB45F455B0319F04]) [    ] o.a.s.c.AbstractZkTestCase put /x1/jenkins/jenkins-slave/workspace/Lucene-Solr-Tests-trunk-Java8/solr/core/src/test-files/solr/collection1/conf/currency.xml to /configs/conf1/currency.xml
   [junit4]   2> 518514 INFO  (TEST-MultiThreadedOCPTest.test-seed#[CB45F455B0319F04]) [    ] o.a.s.c.c.SolrZkClient makePath: /configs/conf1/currency.xml
   [junit4]   2> 518515 INFO  (TEST-MultiThreadedOCPTest.test-seed#[CB45F455B0319F04]) [    ] o.a.s.c.AbstractZkTestCase put /x1/jenkins/jenkins-slave/workspace/Lucene-Solr-Tests-trunk-Java8/solr/core/src/test-files/solr/collection1/conf/enumsConfig.xml to /configs/conf1/enumsConfig.xml
   [junit4]   2> 518515 INFO  (TEST-MultiThreadedOCPTest.test-seed#[CB45F455B0319F04]) [    ] o.a.s.c.c.SolrZkClient makePath: /configs/conf1/enumsConfig.xml
   [junit4]   2> 518517 INFO  (TEST-MultiThreadedOCPTest.test-seed#[CB45F455B0319F04]) [    ] o.a.s.c.AbstractZkTestCase put /x1/jenkins/jenkins-slave/workspace/Lucene-Solr-Tests-trunk-Java8/solr/core/src/test-files/solr/collection1/conf/open-exchange-rates.json to /configs/conf1/open-exchange-rates.json
   [junit4]   2> 518517 INFO  (TEST-MultiThreadedOCPTest.test-seed#[CB45F455B0319F04]) [    ] o.a.s.c.c.SolrZkClient makePath: /configs/conf1/open-exchange-rates.json
   [junit4]   2> 518518 INFO  (TEST-MultiThreadedOCPTest.test-seed#[CB45F455B0319F04]) [    ] o.a.s.c.AbstractZkTestCase put /x1/jenkins/jenkins-slave/workspace/Lucene-Solr-Tests-trunk-Java8/solr/core/src/test-files/solr/collection1/conf/mapping-ISOLatin1Accent.txt to /configs/conf1/mapping-ISOLatin1Accent.txt
   [junit4]   2> 518518 INFO  (TEST-MultiThreadedOCPTest.test-seed#[CB45F455B0319F04]) [    ] o.a.s.c.c.SolrZkClient makePath: /configs/conf1/mapping-ISOLatin1Accent.txt
   [junit4]   2> 518520 INFO  (TEST-MultiThreadedOCPTest.test-seed#[CB45F455B0319F04]) [    ] o.a.s.c.AbstractZkTestCase put /x1/jenkins/jenkins-slave/workspace/Lucene-Solr-Tests-trunk-Java8/solr/core/src/test-files/solr/collection1/conf/old_synonyms.txt to /configs/conf1/old_synonyms.txt
   [junit4]   2> 518520 INFO  (TEST-MultiThreadedOCPTest.test-seed#[CB45F455B0319F04]) [    ] o.a.s.c.c.SolrZkClient makePath: /configs/conf1/old_synonyms.txt
   [junit4]   2> 518521 INFO  (TEST-MultiThreadedOCPTest.test-seed#[CB45F455B0319F04]) [    ] o.a.s.c.AbstractZkTestCase put /x1/jenkins/jenkins-slave/workspace/Lucene-Solr-Tests-trunk-Java8/solr/core/src/test-files/solr/collection1/conf/synonyms.txt to /configs/conf1/synonyms.txt
   [junit4]   2> 518522 INFO  (TEST-MultiThreadedOCPTest.test-seed#[CB45F455B0319F04]) [    ] o.a.s.c.c.SolrZkClient makePath: /configs/conf1/synonyms.txt
   [junit4]   2> 518832 INFO  (TEST-MultiThreadedOCPTest.test-seed#[CB45F455B0319F04]) [    ] o.a.s.SolrTestCaseJ4 Writing core.properties file to /x1/jenkins/jenkins-slave/workspace/Lucene-Solr-Tests-trunk-Java8/solr/build/solr-core/test/J0/temp/solr.cloud.MultiThreadedOCPTest CB45F455B0319F04-001/control-001/cores/collection1
   [junit4]   2> 518836 INFO  (TEST-MultiThreadedOCPTest.test-seed#[CB45F455B0319F04]) [    ] o.e.j.s.Server jetty-9.2.10.v20150310
   [junit4]   2> 518838 INFO  (TEST-MultiThreadedOCPTest.test-seed#[CB45F455B0319F04]) [    ] o.e.j.s.h.ContextHandler Started o.e.j.s.ServletContextHandler@12456fad{/xvz/qq,null,AVAILABLE}
   [junit4]   2> 518841 INFO  (TEST-MultiThreadedOCPTest.test-seed#[CB45F455B0319F04]) [    ] o.e.j.s.ServerConnector Started ServerConnector@5d198aff{HTTP/1.1}{127.0.0.1:46304}
   [junit4]   2> 518841 INFO  (TEST-MultiThreadedOCPTest.test-seed#[CB45F455B0319F04]) [    ] o.e.j.s.Server Started @522037ms
   [junit4]   2> 518841 INFO  (TEST-MultiThreadedOCPTest.test-seed#[CB45F455B0319F04]) [    ] o.a.s.c.s.e.JettySolrRunner Jetty properties: {solr.data.dir=/x1/jenkins/jenkins-slave/workspace/Lucene-Solr-Tests-trunk-Java8/solr/build/solr-core/test/J0/temp/solr.cloud.MultiThreadedOCPTest CB45F455B0319F04-001/tempDir-001/control/data, hostContext=/xvz/qq, hostPort=46304, coreRootDirectory=/x1/jenkins/jenkins-slave/workspace/Lucene-Solr-Tests-trunk-Java8/solr/build/solr-core/test/J0/temp/solr.cloud.MultiThreadedOCPTest CB45F455B0319F04-001/control-001/cores}
   [junit4]   2> 518842 INFO  (TEST-MultiThreadedOCPTest.test-seed#[CB45F455B0319F04]) [    ] o.a.s.s.SolrDispatchFilter SolrDispatchFilter.init()sun.misc.Launcher$AppClassLoader@c387f44
   [junit4]   2> 518842 INFO  (TEST-MultiThreadedOCPTest.test-seed#[CB45F455B0319F04]) [    ] o.a.s.c.SolrResourceLoader new SolrResourceLoader for directory: '/x1/jenkins/jenkins-slave/workspace/Lucene-Solr-Tests-trunk-Java8/solr/build/solr-core/test/J0/temp/solr.cloud.MultiThreadedOCPTest CB45F455B0319F04-001/control-001/'
   [junit4]   2> 518858 INFO  (TEST-MultiThreadedOCPTest.test-seed#[CB45F455B0319F04]) [    ] o.a.s.c.SolrXmlConfig Loading container configuration from /x1/jenkins/jenkins-slave/workspace/Lucene-Solr-Tests-trunk-Java8/solr/build/solr-core/test/J0/temp/solr.cloud.MultiThreadedOCPTest CB45F455B0319F04-001/control-001/solr.xml
   [junit4]   2> 518863 INFO  (TEST-MultiThreadedOCPTest.test-seed#[CB45F455B0319F04]) [    ] o.a.s.c.CoresLocator Config-defined core root directory: /x1/jenkins/jenkins-slave/workspace/Lucene-Solr-Tests-trunk-Java8/solr/build/solr-core/test/J0/temp/solr.cloud.MultiThreadedOCPTest CB45F455B0319F04-001/control-001/cores
   [junit4]   2> 518863 INFO  (TEST-MultiThreadedOCPTest.test-seed#[CB45F455B0319F04]) [    ] o.a.s.c.CoreContainer New CoreContainer 1745826137
   [junit4]   2> 518863 INFO  (TEST-MultiThreadedOCPTest.test-seed#[CB45F455B0319F04]) [    ] o.a.s.c.CoreContainer Loading cores into CoreContainer [instanceDir=/x1/jenkins/jenkins-slave/workspace/Lucene-Solr-Tests-trunk-Java8/solr/build/solr-core/test/J0/temp/solr.cloud.MultiThreadedOCPTest CB45F455B0319F04-001/control-001/]
   [junit4]   2> 518863 INFO  (TEST-MultiThreadedOCPTest.test-seed#[CB45F455B0319F04]) [    ] o.a.s.c.CoreContainer loading shared library: /x1/jenkins/jenkins-slave/workspace/Lucene-Solr-Tests-trunk-Java8/solr/build/solr-core/test/J0/temp/solr.cloud.MultiThreadedOCPTest CB45F455B0319F04-001/control-001/lib
   [junit4]   2> 518863 WARN  (TEST-MultiThreadedOCPTest.test-seed#[CB45F455B0319F04]) [    ] o.a.s.c.SolrResourceLoader Can't find (or read) directory to add to classloader: lib (resolved as: /x1/jenkins/jenkins-slave/workspace/Lucene-Solr-Tests-trunk-Java8/solr/build/solr-core/test/J0/temp/solr.cloud.MultiThreadedOCPTest CB45F455B0319F04-001/control-001/lib).
   [junit4]   2> 518870 INFO  (TEST-MultiThreadedOCPTest.test-seed#[CB45F455B0319F04]) [    ] o.a.s.h.c.HttpShardHandlerFactory created with socketTimeout : 90000,urlScheme : ,connTimeout : 15000,maxConnectionsPerHost : 20,maxConnections : 10000,corePoolSize : 0,maximumPoolSize : 2147483647,maxThreadIdleTime : 5,sizeOfQueue : -1,fairnessPolicy : false,useRetries : false,
   [junit4]   2> 518872 INFO  (TEST-MultiThreadedOCPTest.test-seed#[CB45F455B0319F04]) [    ] o.a.s.u.UpdateShardHandler Creating UpdateShardHandler HTTP client with params: socketTimeout=340000&connTimeout=45000&retry=true
   [junit4]   2> 518872 INFO  (TEST-MultiThreadedOCPTest.test-seed#[CB45F455B0319F04]) [    ] o.a.s.l.LogWatcher SLF4J impl is org.slf4j.impl.Log4jLoggerFactory
   [junit4]   2> 518872 INFO  (TEST-MultiThreadedOCPTest.test-seed#[CB45F455B0319F04]) [    ] o.a.s.l.LogWatcher Registering Log Listener [Log4j (org.slf4j.impl.Log4jLoggerFactory)]
   [junit4]   2> 518873 INFO  (TEST-MultiThreadedOCPTest.test-seed#[CB45F455B0319F04]) [    ] o.a.s.c.ZkContainer Zookeeper client=127.0.0.1:33054/solr
   [junit4]   2> 518873 INFO  (TEST-MultiThreadedOCPTest.test-seed#[CB45F455B0319F04]) [    ] o.a.s.c.ZkController zkHost includes chroot
   [junit4]   2> 518873 INFO  (TEST-MultiThreadedOCPTest.test-seed#[CB45F455B0319F04]) [    ] o.a.s.c.c.SolrZkClient Using default ZkCredentialsProvider
   [junit4]   2> 518874 INFO  (TEST-MultiThreadedOCPTest.test-seed#[CB45F455B0319F04]) [    ] o.a.s.c.c.ConnectionManager Waiting for client to connect to ZooKeeper
   [junit4]   2> 518875 INFO  (zkCallback-344-thread-1) [    ] o.a.s.c.c.ConnectionManager Watcher org.apache.solr.common.cloud.ConnectionManager@54b300db name:ZooKeeperConnection Watcher:127.0.0.1:33054 got event WatchedEvent state:SyncConnected type:None path:null path:null type:None
   [junit4]   2> 518876 INFO  (TEST-MultiThreadedOCPTest.test-seed#[CB45F455B0319F04]) [    ] o.a.s.c.c.ConnectionManager Client is connected to ZooKeeper
   [junit4]   2> 518877 INFO  (TEST-MultiThreadedOCPTest.test-seed#[CB45F455B0319F04]) [    ] o.a.s.c.c.SolrZkClient Using default ZkACLProvider
   [junit4]   2> 518878 INFO  (TEST-MultiThreadedOCPTest.test-seed#[CB45F455B0319F04]) [n:127.0.0.1:46304_xvz%2Fqq    ] o.a.s.c.c.ConnectionManager Waiting for client to connect to ZooKeeper
   [junit4]   2> 518887 INFO  (zkCallback-345-thread-1-processing-n:127.0.0.1:46304_xvz%2Fqq) [n:127.0.0.1:46304_xvz%2Fqq    ] o.a.s.c.c.ConnectionManager Watcher org.apache.solr.common.cloud.ConnectionManager@22caa1bf name:ZooKeeperConnection Watcher:127.0.0.1:33054/solr got event WatchedEvent state:SyncConnected type:None path:null path:null type:None
   [junit4]   2> 518887 INFO  (TEST-MultiThreadedOCPTest.test-seed#[CB45F455B0319F04]) [n:127.0.0.1:46304_xvz%2Fqq    ] o.a.s.c.c.ConnectionManager Client is connected to ZooKeeper
   [junit4]   2> 518889 INFO  (TEST-MultiThreadedOCPTest.test-seed#[CB45F455B0319F04]) [n:127.0.0.1:46304_xvz%2Fqq    ] o.a.s.c.c.SolrZkClient makePath: /overseer/queue
   [junit4]   2> 518891 INFO  (TEST-MultiThreadedOCPTest.test-seed#[CB45F455B0319F04]) [n:127.0.0.1:46304_xvz%2Fqq    ] o.a.s.c.c.SolrZkClient makePath: /overseer/collection-queue-work
   [junit4]   2> 518893 INFO  (TEST-MultiThreadedOCPTest.test-seed#[CB45F455B0319F04]) [n:127.0.0.1:46304_xvz%2Fqq    ] o.a.s.c.c.SolrZkClient makePath: /overseer/collection-map-running
   [junit4]   2> 518894 INFO  (TEST-MultiThreadedOCPTest.test-seed#[CB45F455B0319F04]) [n:127.0.0.1:46304_xvz%2Fqq    ] o.a.s.c.c.SolrZkClient makePath: /overseer/collection-map-completed
   [junit4]   2> 518896 INFO  (TEST-MultiThreadedOCPTest.test-seed#[CB45F455B0319F04]) [n:127.0.0.1:46304_xvz%2Fqq    ] o.a.s.c.c.SolrZkClient makePath: /overseer/collection-map-failure
   [junit4]   2> 518898 INFO  (TEST-MultiThreadedOCPTest.test-seed#[CB45F455B0319F04]) [n:127.0.0.1:46304_xvz%2Fqq    ] o.a.s.c.c.SolrZkClient makePath: /live_nodes
   [junit4]   2> 518899 INFO  (TEST-MultiThreadedOCPTest.test-seed#[CB45F455B0319F04]) [n:127.0.0.1:46304_xvz%2Fqq    ] o.a.s.c.c.SolrZkClient makePath: /aliases.json
   [junit4]   2> 518901 INFO  (TEST-MultiThreadedOCPTest.test-seed#[CB45F455B0319F04]) [n:127.0.0.1:46304_xvz%2Fqq    ] o.a.s.c.c.SolrZkClient makePath: /clusterstate.json
   [junit4]   2> 518902 INFO  (TEST-MultiThreadedOCPTest.test-seed#[CB45F455B0319F04]) [n:127.0.0.1:46304_xvz%2Fqq    ] o.a.s.c.ZkController Register node as live in ZooKeeper:/live_nodes/127.0.0.1:46304_xvz%2Fqq
   [junit4]   2> 518902 INFO  (TEST-MultiThreadedOCPTest.test-seed#[CB45F455B0319F04]) [n:127.0.0.1:46304_xvz%2Fqq    ] o.a.s.c.c.SolrZkClient makePath: /live_nodes/127.0.0.1:46304_xvz%2Fqq
   [junit4]   2> 518903 INFO  (TEST-MultiThreadedOCPTest.test-seed#[CB45F455B0319F04]) [n:127.0.0.1:46304_xvz%2Fqq    ] o.a.s.c.c.SolrZkClient makePath: /overseer_elect
   [junit4]   2> 518905 INFO  (TEST-MultiThreadedOCPTest.test-seed#[CB45F455B0319F04]) [n:127.0.0.1:46304_xvz%2Fqq    ] o.a.s.c.c.SolrZkClient makePath: /overseer_elect/election
   [junit4]   2> 518906 INFO  (TEST-MultiThreadedOCPTest.test-seed#[CB45F455B0319F04]) [n:127.0.0.1:46304_xvz%2Fqq    ] o.a.s.c.Overseer Overseer (id=null) closing
   [junit4]   2> 518907 INFO  (TEST-MultiThreadedOCPTest.test-seed#[CB45F455B0319F04]) [n:127.0.0.1:46304_xvz%2Fqq    ] o.a.s.c.OverseerElectionContext I am going to be the leader 127.0.0.1:46304_xvz%2Fqq
   [junit4]   2> 518907 INFO  (TEST-MultiThreadedOCPTest.test-seed#[CB45F455B0319F04]) [n:127.0.0.1:46304_xvz%2Fqq    ] o.a.s.c.c.SolrZkClient makePath: /overseer_elect/leader
   [junit4]   2> 518908 INFO  (TEST-MultiThreadedOCPTest.test-seed#[CB45F455B0319F04]) [n:127.0.0.1:46304_xvz%2Fqq    ] o.a.s.c.Overseer Overseer (id=93938211563962371-127.0.0.1:46304_xvz%2Fqq-n_0000000000) starting
   [junit4]   2> 518910 INFO  (TEST-MultiThreadedOCPTest.test-seed#[CB45F455B0319F04]) [n:127.0.0.1:46304_xvz%2Fqq    ] o.a.s.c.c.SolrZkClient makePath: /overseer/queue-work
   [junit4]   2> 518916 INFO  (TEST-MultiThreadedOCPTest.test-seed#[CB45F455B0319F04]) [n:127.0.0.1:46304_xvz%2Fqq    ] o.a.s.c.OverseerAutoReplicaFailoverThread Starting OverseerAutoReplicaFailoverThread autoReplicaFailoverWorkLoopDelay=10000 autoReplicaFailoverWaitAfterExpiration=30000 autoReplicaFailoverBadNodeExpiration=60000
   [junit4]   2> 518917 INFO  (OverseerStateUpdate-93938211563962371-127.0.0.1:46304_xvz%2Fqq-n_0000000000) [n:127.0.0.1:46304_xvz%2Fqq    ] o.a.s.c.Overseer Starting to work on the main queue
   [junit4]   2> 518924 INFO  (OverseerCollectionProcessor-93938211563962371-127.0.0.1:46304_xvz%2Fqq-n_0000000000) [n:127.0.0.1:46304_xvz%2Fqq    ] o.a.s.c.OverseerCollectionProcessor Process current queue of collection creations
   [junit4]   2> 518925 INFO  (TEST-MultiThreadedOCPTest.test-seed#[CB45F455B0319F04]) [n:127.0.0.1:46304_xvz%2Fqq    ] o.a.s.c.c.ZkStateReader Updating cluster state from ZooKeeper... 
   [junit4]   2> 518929 INFO  (TEST-MultiThreadedOCPTest.test-seed#[CB45F455B0319F04]) [n:127.0.0.1:46304_xvz%2Fqq    ] o.a.s.c.CoreContainer No authentication plugin used.
   [junit4]   2> 518929 INFO  (TEST-MultiThreadedOCPTest.test-seed#[CB45F455B0319F04]) [n:127.0.0.1:46304_xvz%2Fqq    ] o.a.s.c.CoreContainer Security conf doesn't exist. Skipping setup for authorization module.
   [junit4]   2> 518930 INFO  (TEST-MultiThreadedOCPTest.test-seed#[CB45F455B0319F04]) [n:127.0.0.1:46304_xvz%2Fqq    ] o.a.s.c.CoresLocator Looking for core definitions underneath /x1/jenkins/jenkins-slave/workspace/Lucene-Solr-Tests-trunk-Java8/solr/build/solr-core/test/J0/temp/solr.cloud.MultiThreadedOCPTest CB45F455B0319F04-001/control-001/cores
   [junit4]   2> 518931 INFO  (TEST-MultiThreadedOCPTest.test-seed#[CB45F455B0319F04]) [n:127.0.0.1:46304_xvz%2Fqq    ] o.a.s.c.SolrCore Created CoreDescriptor: {name=collection1, config=solrconfig.xml, transient=false, schema=schema.xml, loadOnStartup=true, instanceDir=/x1/jenkins/jenkins-slave/workspace/Lucene-Solr-Tests-trunk-Java8/solr/build/solr-core/test/J0/temp/solr.cloud.MultiThreadedOCPTest CB45F455B0319F04-001/control-001/cores/collection1, collection=control_collection, absoluteInstDir=/x1/jenkins/jenkins-slave/workspace/Lucene-Solr-Tests-trunk-Java8/solr/build/solr-core/test/J0/temp/solr.cloud.MultiThreadedOCPTest CB45F455B0319F04-001/control-001/cores/collection1/, coreNodeName=, dataDir=data/, shard=}
   [junit4]   2> 518931 INFO  (TEST-MultiThreadedOCPTest.test-seed#[CB45F455B0319F04]) [n:127.0.0.1:46304_xvz%2Fqq    ] o.a.s.c.CoresLocator Found core collection1 in /x1/jenkins/jenkins-slave/workspace/Lucene-Solr-Tests-trunk-Java8/solr/build/solr-core/test/J0/temp/solr.cloud.MultiThreadedOCPTest CB45F455B0319F04-001/control-001/cores/collection1/
   [junit4]   2> 518932 INFO  (TEST-MultiThreadedOCPTest.test-seed#[CB45F455B0319F04]) [n:127.0.0.1:46304_xvz%2Fqq    ] o.a.s.c.CoresLocator Found 1 core definitions
   [junit4]   2> 518933 INFO  (coreLoadExecutor-1314-thread-1-processing-n:127.0.0.1:46304_xvz%2Fqq) [n:127.0.0.1:46304_xvz%2Fqq c:control_collection   x:collection1] o.a.s.c.ZkController publishing state=down
   [junit4]   2> 518933 INFO  (coreLoadExecutor-1314-thread-1-processing-n:127.0.0.1:46304_xvz%2Fqq) [n:127.0.0.1:46304_xvz%2Fqq c:control_collection   x:collection1] o.a.s.c.ZkController numShards not found on descriptor - reading it from system property
   [junit4]   2> 518934 INFO  (coreLoadExecutor-1314-thread-1-processing-n:127.0.0.1:46304_xvz%2Fqq) [n:127.0.0.1:46304_xvz%2Fqq c:control_collection   x:collection1] o.a.s.c.ZkController look for our core node name
   [junit4]   2> 518934 INFO  (TEST-MultiThreadedOCPTest.test-seed#[CB45F455B0319F04]) [n:127.0.0.1:46304_xvz%2Fqq    ] o.a.s.s.SolrDispatchFilter user.dir=/x1/jenkins/jenkins-slave/workspace/Lucene-Solr-Tests-trunk-Java8/solr/build/solr-core/test/J0
   [junit4]   2> 518934 INFO  (zkCallback-345-thread-1-processing-n:127.0.0.1:46304_xvz%2Fqq) [n:127.0.0.1:46304_xvz%2Fqq    ] o.a.s.c.DistributedQueue NodeChildrenChanged fired on path /overseer/queue state SyncConnected
   [junit4]   2> 518934 INFO  (TEST-MultiThreadedOCPTest.test-seed#[CB45F455B0319F04]) [n:127.0.0.1:46304_xvz%2Fqq    ] o.a.s.s.SolrDispatchFilter SolrDispatchFilter.init() done
   [junit4]   2> 518935 INFO  (OverseerStateUpdate-93938211563962371-127.0.0.1:46304_xvz%2Fqq-n_0000000000) [n:127.0.0.1:46304_xvz%2Fqq    ] o.a.s.c.Overseer processMessage: queueSize: 1, message = {
   [junit4]   2>   "core":"collection1",
   [junit4]   2>   "roles":null,
   [junit4]   2>   "base_url":"http://127.0.0.1:46304/xvz/qq",
   [junit4]   2>   "node_name":"127.0.0.1:46304_xvz%2Fqq",
   [junit4]   2>   "numShards":"1",
   [junit4]   2>   "state":"down",
   [junit4]   2>   "shard":null,
   [junit4]   2>   "collection":"control_collection",
   [junit4]   2>   "operation":"state"} current state version: 0
   [junit4]   2> 518935 INFO  (OverseerStateUpdate-93938211563962371-127.0.0.1:46304_xvz%2Fqq-n_0000000000) [n:127.0.0.1:46304_xvz%2Fqq    ] o.a.s.c.o.ReplicaMutator Update state numShards=1 message={
   [junit4]   2>   "core":"collection1",
   [junit4]   2>   "roles":null,
   [junit4]   2>   "base_url":"http://127.0.0.1:46304/xvz/qq",
   [junit4]   2>   "node_name":"127.0.0.1:46304_xvz%2Fqq",
   [junit4]   2>   "numShards":"1",
   [junit4]   2>   "state":"down",
   [junit4]   2>   "shard":null,
   [junit4]   2>   "collection":"control_collection",
   [junit4]   2>   "operation":"state"}
   [junit4]   2> 518935 INFO  (OverseerStateUpdate-93938211563962371-127.0.0.1:46304_xvz%2Fqq-n_0000000000) [n:127.0.0.1:46304_xvz%2Fqq    ] o.a.s.c.o.ClusterStateMutator building a new cName: control_collection
   [junit4]   2> 518936 INFO  (OverseerStateUpdate-93938211563962371-127.0.0.1:46304_xvz%2Fqq-n_0000000000) [n:127.0.0.1:46304_xvz%2Fqq    ] o.a.s.c.o.ReplicaMutator Assigning new node to shard shard=shard1
   [junit4]   2> 518937 INFO  (zkCallback-345-thread-1-processing-n:127.0.0.1:46304_xvz%2Fqq) [n:127.0.0.1:46304_xvz%2Fqq    ] o.a.s.c.c.ZkStateReader A cluster state change: WatchedEvent state:SyncConnected type:NodeDataChanged path:/clusterstate.json, has occurred - updating... (live nodes size: 1)
   [junit4]   2> 518939 INFO  (zkCallback-345-thread-1-processing-n:127.0.0.1:46304_xvz%2Fqq) [n:127.0.0.1:46304_xvz%2Fqq    ] o.a.s.c.c.ZkStateReader Updated cluster state version to 1
   [junit4]   2> 519934 INFO  (coreLoadExecutor-1314-thread-1-processing-n:127.0.0.1:46304_xvz%2Fqq) [n:127.0.0.1:46304_xvz%2Fqq c:control_collection   x:collection1] o.a.s.c.ZkController waiting to find shard id in clusterstate for collection1
   [junit4]   2> 519934 INFO  (coreLoadExecutor-1314-thread-1-processing-n:127.0.0.1:46304_xvz%2Fqq) [n:127.0.0.1:46304_xvz%2Fqq c:control_collection   x:collection1] o.a.s.c.ZkController Check for collection zkNode:control_collection
   [junit4]   2> 519935 INFO  (coreLoadExecutor-1314-thread-1-processing-n:127.0.0.1:46304_xvz%2Fqq) [n:127.0.0.1:46304_xvz%2Fqq c:control_collection   x:collection1] o.a.s.c.ZkController Collection zkNode exists
   [junit4]   2> 519935 INFO  (coreLoadExecutor-1314-thread-1-processing-n:127.0.0.1:46304_xvz%2Fqq) [n:127.0.0.1:46304_xvz%2Fqq c:control_collection   x:collection1] o.a.s.c.c.ZkStateReader Load collection config from:/collections/control_collection
   [junit4]   2> 519936 INFO  (coreLoadExecutor-1314-thread-1-processing-n:127.0.0.1:46304_xvz%2Fqq) [n:127.0.0.1:46304_xvz%2Fqq c:control_collection   x:collection1] o.a.s.c.c.ZkStateReader path=/collections/control_collection configName=conf1 specified config exists in ZooKeeper
   [junit4]   2> 519936 INFO  (coreLoadExecutor-1314-thread-1-processing-n:127.0.0.1:46304_xvz%2Fqq) [n:127.0.0.1:46304_xvz%2Fqq c:control_collection   x:collection1] o.a.s.c.SolrResourceLoader new SolrResourceLoader for directory: '/x1/jenkins/jenkins-slave/workspace/Lucene-Solr-Tests-trunk-Java8/solr/build/solr-core/test/J0/temp/solr.cloud.MultiThreadedOCPTest CB45F455B0319F04-001/control-001/cores/collection1/'
   [junit4]   2> 519950 INFO  (coreLoadExecutor-1314-thread-1-processing-n:127.0.0.1:46304_xvz%2Fqq) [n:127.0.0.1:46304_xvz%2Fqq c:control_collection   x:collection1] o.a.s.c.Config loaded config solrconfig.xml with version 0 
   [junit4]   2> 519955 INFO  (coreLoadExecutor-1314-thread-1-processing-n:127.0.0.1:46304_xvz%2Fqq) [n:127.0.0.1:46304_xvz%2Fqq c:control_collection   x:collection1] o.a.s.c.SolrConfig current version of requestparams : -1
   [junit4]   2> 519974 INFO  (coreLoadExecutor-1314-thread-1-processing-n:127.0.0.1:46304_xvz%2Fqq) [n:127.0.0.1:46304_xvz%2Fqq c:control_collection   x:collection1] o.a.s.c.SolrConfig Using Lucene MatchVersion: 6.0.0
   [junit4]   2> 519982 INFO  (coreLoadExecutor-1314-thread-1-processing-n:127.0.0.1:46304_xvz%2Fqq) [n:127.0.0.1:46304_xvz%2Fqq c:control_collection   x:collection1] o.a.s.c.Config Loaded SolrConfig: solrconfig.xml
   [junit4]   2> 519983 INFO  (coreLoadExecutor-1314-thread-1-processing-n:127.0.0.1:46304_xvz%2Fqq) [n:127.0.0.1:46304_xvz%2Fqq c:control_collection   x:collection1] o.a.s.s.IndexSchema Reading Solr Schema from /configs/conf1/schema.xml
   [junit4]   2> 519989 INFO  (coreLoadExecutor-1314-thread-1-processing-n:127.0.0.1:46304_xvz%2Fqq) [n:127.0.0.1:46304_xvz%2Fqq c:control_collection   x:collection1] o.a.s.s.IndexSchema [collection1] Schema name=test
   [junit4]   2> 520071 INFO  (coreLoadExecutor-1314-thread-1-processing-n:127.0.0.1:46304_xvz%2Fqq) [n:127.0.0.1:46304_xvz%2Fqq c:control_collection   x:collection1] o.a.s.s.OpenExchangeRatesOrgProvider Initialized with rates=open-exchange-rates.json, refreshInterval=1440.
   [junit4]   2> 520085 INFO  (coreLoadExecutor-1314-thread-1-processing-n:127.0.0.1:46304_xvz%2Fqq) [n:127.0.0.1:46304_xvz%2Fqq c:control_collection   x:collection1] o.a.s.s.IndexSchema default search field in schema is text
   [junit4]   2> 520086 INFO  (coreLoadExecutor-1314-thread-1-processing-n:127.0.0.1:46304_xvz%2Fqq) [n:127.0.0.1:46304_xvz%2Fqq c:control_collection   x:collection1] o.a.s.s.IndexSchema unique key field: id
   [junit4]   2> 520094 INFO  (coreLoadExecutor-1314-thread-1-processing-n:127.0.0.1:46304_xvz%2Fqq) [n:127.0.0.1:46304_xvz%2Fqq c:control_collection   x:collection1] o.a.s.s.FileExchangeRateProvider Reloading exchange rates from file currency.xml
   [junit4]   2> 520097 INFO  (coreLoadExecutor-1314-thread-1-processing-n:127.0.0.1:46304_xvz%2Fqq) [n:127.0.0.1:46304_xvz%2Fqq c:control_collection   x:collection1] o.a.s.s.FileExchangeRateProvider Reloading exchange rates from file currency.xml
   [junit4]   2> 520099 INFO  (coreLoadExecutor-1314-thread-1-processing-n:127.0.0.1:46304_xvz%2Fqq) [n:127.0.0.1:46304_xvz%2Fqq c:control_collection   x:collection1] o.a.s.s.OpenExchangeRatesOrgProvider Reloading exchange rates from open-exchange-rates.json
   [junit4]   2> 520099 WARN  (coreLoadExecutor-1314-thread-1-processing-n:127.0.0.1:46304_xvz%2Fqq) [n:127.0.0.1:46304_xvz%2Fqq c:control_collection   x:collection1] o.a.s.s.OpenExchangeRatesOrgProvider Unknown key IMPORTANT NOTE
   [junit4]   2> 520099 WARN  (coreLoadExecutor-1314-thread-1-processing-n:127.0.0.1:46304_xvz%2Fqq) [n:127.0.0.1:46304_xvz%2Fqq c:control_collection   x:collection1] o.a.s.s.OpenExchangeRatesOrgProvider Expected key, got STRING
   [junit4]   2> 520100 INFO  (coreLoadExecutor-1314-thread-1-processing-n:127.0.0.1:46304_xvz%2Fqq) [n:127.0.0.1:46304_xvz%2Fqq c:control_collection   x:collection1] o.a.s.s.OpenExchangeRatesOrgProvider Reloading exchange rates from open-exchange-rates.json
   [junit4]   2> 520100 WARN  (coreLoadExecutor-1314-thread-1-processing-n:127.0.0.1:46304_xvz%2Fqq) [n:127.0.0.1:46304_xvz%2Fqq c:control_collection   x:collection1] o.a.s.s.OpenExchangeRatesOrgProvider Unknown key IMPORTANT NOTE
   [junit4]   2> 520100 WARN  (coreLoadExecutor-1314-thread-1-processing-n:127.0.0.1:46304_xvz%2Fqq) [n:127.0.0.1:46304_xvz%2Fqq c:control_collection   x:collection1] o.a.s.s.OpenExchangeRatesOrgProvider Expected key, got STRING
   [junit4]   2> 520100 INFO  (coreLoadExecutor-1314-thread-1-processing-n:127.0.0.1:46304_xvz%2Fqq) [n:127.0.0.1:46304_xvz%2Fqq c:control_collection   x:collection1] o.a.s.c.CoreContainer Creating SolrCore 'collection1' using configuration from collection control_collection
   [junit4]   2> 520101 INFO  (coreLoadExecutor-1314-thread-1-processing-n:127.0.0.1:46304_xvz%2Fqq) [n:127.0.0.1:46304_xvz%2Fqq c:control_collection s:shard1 r:core_node1 x:collection1] o.a.s.c.SolrCore org.apache.solr.core.MockDirectoryFactory
   [junit4]   2> 520101 INFO  (coreLoadExecutor-1314-thread-1-processing-n:127.0.0.1:46304_xvz%2Fqq) [n:127.0.0.1:46304_xvz%2Fqq c:control_collection s:shard1 r:core_node1 x:collection1] o.a.s.c.SolrCore [[collection1] ] Opening new SolrCore at [/x1/jenkins/jenkins-slave/workspace/Lucene-Solr-Tests-trunk-Java8/solr/build/solr-core/test/J0/temp/solr.cloud.MultiThreadedOCPTest CB45F455B0319F04-001/control-001/cores/collection1/], dataDir=[null]
   [junit4]   2> 520101 INFO  (coreLoadExecutor-1314-thread-1-processing-n:127.0.0.1:46304_xvz%2Fqq) [n:127.0.0.1:46304_xvz%2Fqq c:control_collection s:shard1 r:core_node1 x:collection1] o.a.s.c.JmxMonitoredMap JMX monitoring is enabled. Adding Solr mbeans to JMX Server: com.sun.jmx.mbeanserver.JmxMBeanServer@4cad1652
   [junit4]   2> 520102 INFO  (coreLoadExecutor-1314-thread-1-processing-n:127.0.0.1:46304_xvz%2Fqq) [n:127.0.0.1:46304_xvz%2Fqq c:control_collection s:shard1 r:core_node1 x:collection1] o.a.s.c.CachingDirectoryFactory return new directory for /x1/jenkins/jenkins-slave/workspace/Lucene-Solr-Tests-trunk-Java8/solr/build/solr-core/test/J0/temp/solr.cloud.MultiThreadedOCPTest CB45F455B0319F04-001/control-001/cores/collection1/data
   [junit4]   2> 520103 INFO  (coreLoadExecutor-1314-thread-1-processing-n:127.0.0.1:46304_xvz%2Fqq) [n:127.0.0.1:46304_xvz%2Fqq c:control_collection s:shard1 r:core_node1 x:collection1] o.a.s.c.SolrCore New index directory detected: old=null new=/x1/jenkins/jenkins-slave/workspace/Lucene-Solr-Tests-trunk-Java8/solr/build/solr-core/test/J0/temp/solr.cloud.MultiThreadedOCPTest CB45F455B0319F04-001/control-001/cores/collection1/data/index/
   [junit4]   2> 520103 WARN  (coreLoadExecutor-1314-thread-1-processing-n:127.0.0.1:46304_xvz%2Fqq) [n:127.0.0.1:46304_xvz%2Fqq c:control_collection s:shard1 r:core_node1 x:collection1] o.a.s.c.SolrCore [collection1] Solr index directory '/x1/jenkins/jenkins-slave/workspace/Lucene-Solr-Tests-trunk-Java8/solr/build/solr-core/test/J0/temp/solr.cloud.MultiThreadedOCPTest CB45F455B0319F04-001/control-001/cores/collection1/data/index' doesn't exist. Creating new index...
   [junit4]   2> 520103 INFO  (coreLoadExecutor-1314-thread-1-processing-n:127.0.0.1:46304_xvz%2Fqq) [n:127.0.0.1:46304_xvz%2Fqq c:control_collection s:shard1 r:core_node1 x:collection1] o.a.s.c.CachingDirectoryFactory return new directory for /x1/jenkins/jenkins-slave/workspace/Lucene-Solr-Tests-trunk-Java8/solr/build/solr-core/test/J0/temp/solr.cloud.MultiThreadedOCPTest CB45F455B0319F04-001/control-001/cores/collection1/data/index
   [junit4]   2> 520104 INFO  (coreLoadExecutor-1314-thread-1-processing-n:127.0.0.1:46304_xvz%2Fqq) [n:127.0.0.1:46304_xvz%2Fqq c:control_collection s:shard1 r:core_node1 x:collection1] o.a.s.u.RandomMergePolicy RandomMergePolicy wrapping class org.apache.lucene.index.TieredMergePolicy: [TieredMergePolicy: maxMergeAtOnce=42, maxMergeAtOnceExplicit=18, maxMergedSegmentMB=19.8623046875, floorSegmentMB=0.7998046875, forceMergeDeletesPctAllowed=8.468515154491655, segmentsPerTier=36.0, maxCFSSegmentSizeMB=8.796093022207999E12, noCFSRatio=0.23410487163543633
   [junit4]   2> 520105 INFO  (coreLoadExecutor-1314-thread-1-processing-n:127.0.0.1:46304_xvz%2Fqq) [n:127.0.0.1:46304_xvz%2Fqq c:control_collection s:shard1 r:core_node1 x:collection1] o.a.s.c.SolrCore SolrDeletionPolicy.onCommit: commits: num=1
   [junit4]   2> 	commit{dir=MockDirectoryWrapper(RAMDirectory@79dc7a91 lockFactory=org.apache.lucene.store.SingleInstanceLockFactory@4e45a9c6),segFN=segments_1,generation=1}
   [junit4]   2> 520105 INFO  (coreLoadExecutor-1314-thread-1-processing-n:127.0.0.1:46304_xvz%2Fqq) [n:127.0.0.1:46304_xvz%2Fqq c:control_collection s:shard1 r:core_node1 x:collection1] o.a.s.c.SolrCore newest commit generation = 1
   [junit4]   2> 520109 INFO  (coreLoadExecutor-1314-thread-1-processing-n:127.0.0.1:46304_xvz%2Fqq) [n:127.0.0.1:46304_xvz%2Fqq c:control_collection s:shard1 r:core_node1 x:collection1] o.a.s.u.p.UpdateRequestProcessorChain creating updateRequestProcessorChain "nodistrib"
   [junit4]   2> 520109 INFO  (coreLoadExecutor-1314-thread-1-processing-n:127.0.0.1:46304_xvz%2Fqq) [n:127.0.0.1:46304_xvz%2Fqq c:control_collection s:shard1 r:core_node1 x:collection1] o.a.s.u.p.UpdateRequestProcessorChain creating updateRequestProcessorChain "dedupe"
   [junit4]   2> 520110 INFO  (coreLoadExecutor-1314-thread-1-processing-n:127.0.0.1:46304_xvz%2Fqq) [n:127.0.0.1:46304_xvz%2Fqq c:control_collection s:shard1 r:core_node1 x:collection1] o.a.s.u.p.UpdateRequestProcessorChain inserting DistributedUpdateProcessorFactory into updateRequestProcessorChain "dedupe"
   [junit4]   2> 520110 INFO  (coreLoadExecutor-1314-thread-1-processing-n:127.0.0.1:46304_xvz%2Fqq) [n:127.0.0.1:46304_xvz%2Fqq c:control_collection s:shard1 r:core_node1 x:collection1] o.a.s.u.p.UpdateRequestProcessorChain creating updateRequestProcessorChain "stored_sig"
   [junit4]   2> 520110 INFO  (coreLoadExecutor-1314-thread-1-processing-n:127.0.0.1:46304_xvz%2Fqq) [n:127.0.0.1:46304_xvz%2Fqq c:control_collection s:shard1 r:core_node1 x:collection1] o.a.s.u.p.UpdateRequestProcessorChain inserting DistributedUpdateProcessorFactory into updateRequestProcessorChain "stored_sig"
   [junit4]   2> 520110 INFO  (coreLoadExecutor-1314-thread-1-processing-n:127.0.0.1:46304_xvz%2Fqq) [n:127.0.0.1:46304_xvz%2Fqq c:control_collection s:shard1 r:core_node1 x:collection1] o.a.s.u.p.UpdateRequestProcessorChain creating updateRequestProcessorChain "distrib-dup-test-chain-explicit"
   [junit4]   2> 520110 INFO  (coreLoadExecutor-1314-thread-1-processing-n:127.0.0.1:46304_xvz%2Fqq) [n:127.0.0.1:46304_xvz%2Fqq c:control_collection s:shard1 r:core_node1 x:collection1] o.a.s.u.p.UpdateRequestProcessorChain creating updateRequestProcessorChain "distrib-dup-test-chain-implicit"
   [junit4]   2> 520111 INFO  (coreLoadExecutor-1314-thread-1-processing-n:127.0.0.1:46304_xvz%2Fqq) [n:127.0.0.1:46304_xvz%2Fqq c:control_collection s:shard1 r:core_node1 x:collection1] o.a.s.u.p.UpdateRequestProcessorChain inserting DistributedUpdateProcessorFactory into updateRequestProcessorChain "distrib-dup-test-chain-implicit"
   [junit4]   2> 520111 INFO  (coreLoadExecutor-1314-thread-1-processing-n:127.0.0.1:46304_xvz%2Fqq) [n:127.0.0.1:46304_xvz%2Fqq c:control_collection s:shard1 r:core_node1 x:collection1] o.a.s.c.SolrCore no updateRequestProcessorChain defined as default, creating implicit default
   [junit4]   2> 520113 INFO  (coreLoadExecutor-1314-thread-1-processing-n:127.0.0.1:46304_xvz%2Fqq) [n:127.0.0.1:46304_xvz%2Fqq c:control_collection s:shard1 r:core_node1 x:collection1] o.a.s.h.l.XMLLoader xsltCacheLifetimeSeconds=60
   [junit4]   2> 520114 INFO  (coreLoadExecutor-1314-thread-1-processing-n:127.0.0.1:46304_xvz%2Fqq) [n:127.0.0.1:46304_xvz%2Fqq c:control_collection s:shard1 r:core_node1 x:collection1] o.a.s.h.l.XMLLoader xsltCacheLifetimeSeconds=60
   [junit4]   2> 520115 INFO  (coreLoadExecutor-1314-thread-1-processing-n:127.0.0.1:46304_xvz%2Fqq) [n:127.0.0.1:46304_xvz%2Fqq c:control_collection s:shard1 r:core_node1 x:collection1] o.a.s.h.l.XMLLoader xsltCacheLifetimeSeconds=60
   [junit4]   2> 520115 INFO  (coreLoadExecutor-1314-thread-1-processing-n:127.0.0.1:46304_xvz%2Fqq) [n:127.0.0.1:46304_xvz%2Fqq c:control_collection s:shard1 r:core_node1 x:collection1] o.a.s.h.l.XMLLoader xsltCacheLifetimeSeconds=60
   [junit4]   2> 520119 INFO  (coreLoadExecutor-1314-thread-1-processing-n:127.0.0.1:46304_xvz%2Fqq) [n:127.0.0.1:46304_xvz%2Fqq c:control_collection s:shard1 r:core_node1 x:collection1] o.a.s.c.RequestHandlers Registered paths: /admin/mbeans,standard,/update/csv,/update/json/docs,/admin/luke,/admin/segments,/get,/admin/system,/replication,/admin/properties,/config,/schema,/admin/plugins,/admin/logging,/update/json,/admin/threads,/admin/ping,/update,/admin/file
   [junit4]   2> 520119 INFO  (coreLoadExecutor-1314-thread-1-processing-n:127.0.0.1:46304_xvz%2Fqq) [n:127.0.0.1:46304_xvz%2Fqq c:control_collection s:shard1 r:core_node1 x:collection1] o.a.s.c.SolrCore Using default statsCache cache: org.apache.solr.search.stats.LocalStatsCache
   [junit4]   2> 520120 INFO  (coreLoadExecutor-1314-thread-1-processing-n:127.0.0.1:46304_xvz%2Fqq) [n:127.0.0.1:46304_xvz%2Fqq c:control_collection s:shard1 r:core_node1 x:collection1] o.a.s.u.UpdateHandler Using UpdateLog implementation: org.apache.solr.update.UpdateLog
   [junit4]   2> 520120 INFO  (coreLoadExecutor-1314-thread-1-processing-n:127.0.0.1:46304_xvz%2Fqq) [n:127.0.0.1:46304_xvz%2Fqq c:control_collection s:shard1 r:core_node1 x:collection1] o.a.s.u.UpdateLog Initializing UpdateLog: dataDir= defaultSyncLevel=FLUSH numRecordsToKeep=100 maxNumLogsToKeep=10 numVersionBuckets=65536
   [junit4]   2> 520121 INFO  (coreLoadExecutor-1314-thread-1-processing-n:127.0.0.1:46304_xvz%2Fqq) [n:127.0.0.1:46304_xvz%2Fqq c:control_collection s:shard1 r:core_node1 x:collection1] o.a.s.c.SolrCore Hard AutoCommit: disabled
   [junit4]   2> 520121 INFO  (coreLoadExecutor-1314-thread-1-processing-n:127.0.0.1:46304_xvz%2Fqq) [n:127.0.0.1:46304_xvz%2Fqq c:control_collection s:shard1 r:core_node1 x:collection1] o.a.s.c.SolrCore Soft AutoCommit: disabled
   [junit4]   2> 520121 INFO  (coreLoadExecutor-1314-thread-1-processing-n:127.0.0.1:46304_xvz%2Fqq) [n:127.0.0.1:46304_xvz%2Fqq c:control_collection s:shard1 r:core_node1 x:collection1] o.a.s.u.RandomMergePolicy RandomMergePolicy wrapping class org.apache.lucene.index.LogByteSizeMergePolicy: [LogByteSizeMergePolicy: minMergeSize=1677721, mergeFactor=47, maxMergeSize=2147483648, maxMergeSizeForForcedMerge=9223372036854775807, calibrateSizeByDeletes=false, maxMergeDocs=2147483647, maxCFSSegmentSizeMB=8.796093022207999E12, noCFSRatio=0.4053075479766576]
   [junit4]   2> 520122 INFO  (coreLoadExecutor-1314-thread-1-processing-n:127.0.0.1:46304_xvz%2Fqq) [n:127.0.0.1:46304_xvz%2Fqq c:control_collection s:shard1 r:core_node1 x:collection1] o.a.s.c.SolrCore SolrDeletionPolicy.onInit: commits: num=1
   [junit4]   2> 	commit{dir=MockDirectoryWrapper(RAMDirectory@79dc7a91 lockFactory=org.apache.lucene.store.SingleInstanceLockFactory@4e45a9c6),segFN=segments_1,generation=1}
   [junit4]   2> 520122 INFO  (coreLoadExecutor-1314-thread-1-processing-n:127.0.0.1:46304_xvz%2Fqq) [n:127.0.0.1:46304_xvz%2Fqq c:control_collection s:shard1 r:core_node1 x:collection1] o.a.s.c.SolrCore newest commit generation = 1
   [junit4]   2> 520122 INFO  (coreLoadExecutor-1314-thread-1-processing-n:127.0.0.1:46304_xvz%2Fqq) [n:127.0.0.1:46304_xvz%2Fqq c:control_collection s:shard1 r:core_node1 x:collection1] o.a.s.s.SolrIndexSearcher Opening Searcher@63ddd08d[collection1] main
   [junit4]   2> 520122 INFO  (coreLoadExecutor-1314-thread-1-processing-n:127.0.0.1:46304_xvz%2Fqq) [n:127.0.0.1:46304_xvz%2Fqq c:control_collection s:shard1 r:core_node1 x:collection1] o.a.s.c.c.ZkStateReader Load collection config from:/collections/control_collection
   [junit4]   2> 520123 INFO  (coreLoadExecutor-1314-thread-1-processing-n:127.0.0.1:46304_xvz%2Fqq) [n:127.0.0.1:46304_xvz%2Fqq c:control_collection s:shard1 r:core_node1 x:collection1] o.a.s.c.c.ZkStateReader path=/collections/control_collection configName=conf1 specified config exists in ZooKeeper
   [junit4]   2> 520123 INFO  (coreLoadExecutor-1314-thread-1-processing-n:127.0.0.1:46304_xvz%2Fqq) [n:127.0.0.1:46304_xvz%2Fqq c:control_collection s:shard1 r:core_node1 x:collection1] o.a.s.r.ManagedResourceStorage Setting up ZooKeeper-based storage for the RestManager with znodeBase: /configs/conf1
   [junit4]   2> 520124 INFO  (coreLoadExecutor-1314-thread-1-processing-n:127.0.0.1:46304_xvz%2Fqq) [n:127.0.0.1:46304_xvz%2Fqq c:control_collection s:shard1 r:core_node1 x:collection1] o.a.s.r.ManagedResourceStorage Configured ZooKeeperStorageIO with znodeBase: /configs/conf1
   [junit4]   2> 520124 INFO  (coreLoadExecutor-1314-thread-1-processing-n:127.0.0.1:46304_xvz%2Fqq) [n:127.0.0.1:46304_xvz%2Fqq c:control_collection s:shard1 r:core_node1 x:collection1] o.a.s.r.RestManager Initializing RestManager with initArgs: {}
   [junit4]   2> 520124 INFO  (coreLoadExecutor-1314-thread-1-processing-n:127.0.0.1:46304_xvz%2Fqq) [n:127.0.0.1:46304_xvz%2Fqq c:control_collection s:shard1 r:core_node1 x:collection1] o.a.s.r.ManagedResourceStorage Reading _rest_managed.json using ZooKeeperStorageIO:path=/configs/conf1
   [junit4]   2> 520124 INFO  (coreLoadExecutor-1314-thread-1-processing-n:127.0.0.1:46304_xvz%2Fqq) [n:127.0.0.1:46304_xvz%2Fqq c:control_collection s:shard1 r:core_node1 x:collection1] o.a.s.r.ManagedResourceStorage No data found for znode /configs/conf1/_rest_managed.json
   [junit4]   2> 520125 INFO  (coreLoadExecutor-1314-thread-1-processing-n:127.0.0.1:46304_xvz%2Fqq) [n:127.0.0.1:46304_xvz%2Fqq c:control_collection s:shard1 r:core_node1 x:collection1] o.a.s.r.ManagedResourceStorage Loaded null at path _rest_managed.json using ZooKeeperStorageIO:path=/configs/conf1
   [junit4]   2> 520125 INFO  (coreLoadExecutor-1314-thread-1-processing-n:127.0.0.1:46304_xvz%2Fqq) [n:127.0.0.1:46304_xvz%2Fqq c:control_collection s:shard1 r:core_node1 x:collection1] o.a.s.r.RestManager Initializing 0 registered ManagedResources
   [junit4]   2> 520125 INFO  (coreLoadExecutor-1314-thread-1-processing-n:127.0.0.1:46304_xvz%2Fqq) [n:127.0.0.1:46304_xvz%2Fqq c:control_collection s:shard1 r:core_node1 x:collection1] o.a.s.h.ReplicationHandler Commits will be reserved for  10000
   [junit4]   2> 520125 INFO  (coreLoadExecutor-1314-thread-1-processing-n:127.0.0.1:46304_xvz%2Fqq) [n:127.0.0.1:46304_xvz%2Fqq c:control_collection s:shard1 r:core_node1 x:collection1] o.a.s.u.UpdateLog Looking up max value of version field to seed version buckets
   [junit4]   2> 520126 INFO  (coreLoadExecutor-1314-thread-1-processing-n:127.0.0.1:46304_xvz%2Fqq) [n:127.0.0.1:46304_xvz%2Fqq c:control_collection s:shard1 r:core_node1 x:collection1] o.a.s.u.VersionInfo Refreshing highest value of _version_ for 65536 version buckets from index
   [junit4]   2> 520126 INFO  (coreLoadExecutor-1314-thread-1-processing-n:127.0.0.1:46304_xvz%2Fqq) [n:127.0.0.1:46304_xvz%2Fqq c:control_collection s:shard1 r:core_node1 x:collection1] o.a.s.u.VersionInfo No terms found for _version_, cannot seed version bucket highest value from index
   [junit4]   2> 520126 INFO  (coreLoadExecutor-1314-thread-1-processing-n:127.0.0.1:46304_xvz%2Fqq) [n:127.0.0.1:46304_xvz%2Fqq c:control_collection s:shard1 r:core_node1 x:collection1] o.a.s.u.UpdateLog Could not find max version in index or recent updates, using new clock 1503011386847920128
   [junit4]   2> 520128 INFO  (coreLoadExecutor-1314-thread-1-processing-n:127.0.0.1:46304_xvz%2Fqq) [n:127.0.0.1:46304_xvz%2Fqq c:control_collection s:shard1 r:core_node1 x:collection1] o.a.s.u.UpdateLog Took 3 ms to seed version buckets with highest version 1503011386847920128
   [junit4]   2> 520128 INFO  (coreLoadExecutor-1314-thread-1-processing-n:127.0.0.1:46304_xvz%2Fqq) [n:127.0.0.1:46304_xvz%2Fqq c:control_collection s:shard1 r:core_node1 x:collection1] o.a.s.c.ZkController watch zkdir /configs/conf1
   [junit4]   2> 520129 INFO  (searcherExecutor-1315-thread-1-processing-n:127.0.0.1:46304_xvz%2Fqq x:collection1 s:shard1 c:control_collection r:core_node1) [n:127.0.0.1:46304_xvz%2Fqq c:control_collection s:shard1 r:core_node1 x:collection1] o.a.s.c.SolrCore [collection1] Registered new searcher Searcher@63ddd08d[collection1] main{ExitableDirectoryReader(UninvertingDirectoryReader())}
   [junit4]   2> 520129 INFO  (coreLoadExecutor-1314-thread-1-processing-n:127.0.0.1:46304_xvz%2Fqq) [n:127.0.0.1:46304_xvz%2Fqq c:control_collection s:shard1 r:core_node1 x:collection1] o.a.s.c.CoreContainer registering core: collection1
   [junit4]   2> 520129 INFO  (coreZkRegister-1308-thread-1-processing-n:127.0.0.1:46304_xvz%2Fqq x:collection1 s:shard1 c:control_collection r:core_node1) [n:127.0.0.1:46304_xvz%2Fqq c:control_collection s:shard1 r:core_node1 x:collection1] o.a.s.c.ZkController Register replica - core:collection1 address:http://127.0.0.1:46304/xvz/qq collection:control_collection shard:shard1
   [junit4]   2> 520130 INFO  (coreZkRegister-1308-thread-1-processing-n:127.0.0.1:46304_xvz%2Fqq x:collection1 s:shard1 c:control_collection r:core_node1) [n:127.0.0.1:46304_xvz%2Fqq c:control_collection s:shard1 r:core_node1 x:collection1] o.a.s.c.c.SolrZkClient makePath: /collections/control_collection/leader_elect/shard1/election
   [junit4]   2> 520134 INFO  (coreZkRegister-1308-thread-1-processing-n:127.0.0.1:46304_xvz%2Fqq x:collection1 s:shard1 c:control_collection r:core_node1) [n:127.0.0.1:46304_xvz%2Fqq c:control_collection s:shard1 r:core_node1 x:collection1] o.a.s.c.ShardLeaderElectionContext Running the leader process for shard shard1
   [junit4]   2> 520135 INFO  (zkCallback-345-thread-1-processing-n:127.0.0.1:46304_xvz%2Fqq) [n:127.0.0.1:46304_xvz%2Fqq    ] o.a.s.c.DistributedQueue NodeChildrenChanged fired on path /overseer/queue state SyncConnected
   [junit4]   2> 520136 INFO  (coreZkRegister-1308-thread-1-processing-n:127.0.0.1:46304_xvz%2Fqq x:collection1 s:shard1 c:control_collection r:core_node1) [n:127.0.0.1:46304_xvz%2Fqq c:control_collection s:shard1 r:core_node1 x:collection1] o.a.s.c.ShardLeaderElectionContext Enough replicas found to continue.
   [junit4]   2> 520136 INFO  (coreZkRegister-1308-thread-1-processing-n:127.0.0.1:46304_xvz%2Fqq x:collection1 s:shard1 c:control_collection r:core_node1) [n:127.0.0.1:46304_xvz%2Fqq c:control_collection s:shard1 r:core_node1 x:collection1] o.a.s.c.ShardLeaderElectionContext I may be the new leader - try and sync
   [junit4]   2> 520136 INFO  (OverseerStateUpdate-93938211563962371-127.0.0.1:46304_xvz%2Fqq-n_0000000000) [n:127.0.0.1:46304_xvz%2Fqq    ] o.a.s.c.Overseer processMessage: queueSize: 1, message = {
   [junit4]   2>   "operation":"leader",
   [junit4]   2>   "shard":"shard1",
   [junit4]   2>   "collection":"control_collection"} current state version: 1
   [junit4]   2> 520136 INFO  (coreZkRegister-1308-thread-1-processing-n:127.0.0.1:46304_xvz%2Fqq x:collection1 s:shard1 c:control_collection r:core_node1) [n:127.0.0.1:46304_xvz%2Fqq c:control_collection s:shard1 r:core_node1 x:collection1] o.a.s.c.SyncStrategy Sync replicas to http://127.0.0.1:46304/xvz/qq/collection1/
   [junit4]   2> 520137 INFO  (coreZkRegister-1308-thread-1-processing-n:127.0.0.1:46304_xvz%2Fqq x:collection1 s:shard1 c:control_collection r:core_node1) [n:127.0.0.1:46304_xvz%2Fqq c:control_collection s:shard1 r:core_node1 x:collection1] o.a.s.c.SyncStrategy Sync Success - now sync replicas to me
   [junit4]   2> 520137 INFO  (coreZkRegister-1308-thread-1-processing-n:127.0.0.1:46304_xvz%2Fqq x:collection1 s:shard1 c:control_collection r:core_node1) [n:127.0.0.1:46304_xvz%2Fqq c:control_collection s:shard1 r:core_node1 x:collection1] o.a.s.c.SyncStrategy http://127.0.0.1:46304/xvz/qq/collection1/ has no replicas
   [junit4]   2> 520137 INFO  (coreZkRegister-1308-thread-1-processing-n:127.0.0.1:46304_xvz%2Fqq x:collection1 s:shard1 c:control_collection r:core_node1) [n:127.0.0.1:46304_xvz%2Fqq c:control_collection s:shard1 r:core_node1 x:collection1] o.a.s.c.ShardLeaderElectionContext I am the new leader: http://127.0.0.1:46304/xvz/qq/collection1/ shard1
   [junit4]   2> 520137 INFO  (coreZkRegister-1308-thread-1-processing-n:127.0.0.1:46304_xvz%2Fqq x:collection1 s:shard1 c:control_collection r:core_node1) [n:127.0.0.1:46304_xvz%2Fqq c:control_collection s:shard1 r:core_node1 x:collection1] o.a.s.c.c.SolrZkClient makePath: /collections/control_collection/leaders/shard1
   [junit4]   2> 520140 INFO  (zkCallback-345-thread-1-processing-n:127.0.0.1:46304_xvz%2Fqq) [n:127.0.0.1:46304_xvz%2Fqq    ] o.a.s.c.DistributedQueue NodeChildrenChanged fired on path /overseer/queue state SyncConnected
   [junit4]   2> 520141 INFO  (OverseerStateUpdate-93938211563962371-127.0.0.1:46304_xvz%2Fqq-n_0000000000) [n:127.0.0.1:46304_xvz%2Fqq    ] o.a.s.c.Overseer processMessage: queueSize: 1, message = {
   [junit4]   2>   "operation":"leader",
   [junit4]   2>   "shard":"shard1",
   [junit4]   2>   "collection":"control_collection",
   [junit4]   2>   "base_url":"http://127.0.0.1:46304/xvz/qq",
   [junit4]   2>   "core":"collection1",
   [junit4]   2>   "state":"active"} current state version: 1
   [junit4]   2> 520244 INFO  (zkCallback-345-thread-1-processing-n:127.0.0.1:46304_xvz%2Fqq) [n:127.0.0.1:46304_xvz%2Fqq    ] o.a.s.c.c.ZkStateReader A cluster state change: WatchedEvent state:SyncConnected type:NodeDataChanged path:/clusterstate.json, has occurred - updating... (live nodes size: 1)
   [junit4]   2> 520246 INFO  (zkCallback-345-thread-1-processing-n:127.0.0.1:46304_xvz%2Fqq) [n:127.0.0.1:46304_xvz%2Fqq    ] o.a.s.c.c.ZkStateReader Updated cluster state version to 2
   [junit4]   2> 520292 INFO  (coreZkRegister-1308-thread-1-processing-n:127.0.0.1:46304_xvz%2Fqq x:collection1 s:shard1 c:control_collection r:core_node1) [n:127.0.0.1:46304_xvz%2Fqq c:control_collection s:shard1 r:core_node1 x:collection1] o.a.s.c.ZkController We are http://127.0.0.1:46304/xvz/qq/collection1/ and leader is http://127.0.0.1:46304/xvz/qq/collection1/
   [junit4]   2> 520292 INFO  (coreZkRegister-1308-thread-1-processing-n:127.0.0.1:46304_xvz%2Fqq x:collection1 s:shard1 c:control_collection r:core_node1) [n:127.0.0.1:46304_xvz%2Fqq c:control_collection s:shard1 r:core_node1 x:collection1] o.a.s.c.ZkController No LogReplay needed for core=collection1 baseURL=http://127.0.0.1:46304/xvz/qq
   [junit4]   2> 520292 INFO  (coreZkRegister-1308-thread-1-processing-n:127.0.0.1:46304_xvz%2Fqq x:collection1 s:shard1 c:control_collection r:core_node1) [n:127.0.0.1:46304_xvz%2Fqq c:control_collection s:shard1 r:core_node1 x:collection1] o.a.s.c.ZkController I am the leader, no recovery necessary
   [junit4]   2> 520292 INFO  (coreZkRegister-1308-thread-1-processing-n:127.0.0.1:46304_xvz%2Fqq x:collection1 s:shard1 c:control_collection r:core_node1) [n:127.0.0.1:46304_xvz%2Fqq c:control_collection s:shard1 r:core_node1 x:collection1] o.a.s.c.ZkController publishing state=active
   [junit4]   2> 520292 INFO  (coreZkRegister-1308-thread-1-processing-n:127.0.0.1:46304_xvz%2Fqq x:collection1 s:shard1 c:control_collection r:core_node1) [n:127.0.0.1:46304_xvz%2Fqq c:control_collection s:shard1 r:core_node1 x:collection1] o.a.s.c.ZkController numShards not found on descriptor - reading it from system property
   [junit4]   2> 520294 INFO  (zkCallback-345-thread-1-processing-n:127.0.0.1:46304_xvz%2Fqq) [n:127.0.0.1:46304_xvz%2Fqq    ] o.a.s.c.DistributedQueue NodeChildrenChanged fired on path /overseer/queue state SyncConnected
   [junit4]   2> 520298 INFO  (OverseerStateUpdate-93938211563962371-127.0.0.1:46304_xvz%2Fqq-n_0000000000) [n:127.0.0.1:46304_xvz%2Fqq    ] o.a.s.c.Overseer processMessage: queueSize: 1, message = {
   [junit4]   2>   "core":"collection1",
   [junit4]   2>   "core_node_name":"core_node1",
   [junit4]   2>   "roles":null,
   [junit4]   2>   "base_url":"http://127.0.0.1:46304/xvz/qq",
   [junit4]   2>   "node_name":"127.0.0.1:46304_xvz%2Fqq",
   [junit4]   2>   "numShards":"1",
   [junit4]   2>   "state":"active",
   [junit4]   2>   "shard":"shard1",
   [junit4]   2>   "collection":"control_collection",
   [junit4]   2>   "operation":"state"} current state version: 2
   [junit4]   2> 520299 INFO  (OverseerStateUpdate-93938211563962371-127.0.0.1:46304_xvz%2Fqq-n_0000000000) [n:127.0.0.1:46304_xvz%2Fqq    ] o.a.s.c.o.ReplicaMutator Update state numShards=1 message={
   [junit4]   2>   "core":"collection1",
   [junit4]   2>   "core_node_name":"core_node1",
   [junit4]   2>   "roles":null,
   [junit4]   2>   "base_url":"http://127.0.0.1:46304/xvz/qq",
   [junit4]   2>   "node_name":"127.0.0.1:46304_xvz%2Fqq",
   [junit4]   2>   "numShards":"1",
   [junit4]   2>   "state":"active",
   [junit4]   2>   "shard":"shard1",
   [junit4]   2>   "collection":"control_collection",
   [junit4]   2>   "operation":"state"}
   [junit4]   2> 520401 INFO  (zkCallback-345-thread-1-processing-n:127.0.0.1:46304_xvz%2Fqq) [n:127.0.0.1:46304_xvz%2Fqq    ] o.a.s.c.c.ZkStateReader A cluster state change: WatchedEvent state:SyncConnected type:NodeDataChanged path:/clusterstate.json, has occurred - updating... (live nodes size: 1)
   [junit4]   2> 520403 INFO  (zkCallback-345-thread-1-processing-n:127.0.0.1:46304_xvz%2Fqq) [n:127.0.0.1:46304_xvz%2Fqq    ] o.a.s.c.c.ZkStateReader Updated cluster state version to 3
   [junit4]   2> 520436 INFO  (TEST-MultiThreadedOCPTest.test-seed#[CB45F455B0319F04]) [    ] o.a.s.c.c.SolrZkClient Using default ZkCredentialsProvider
   [junit4]   2> 520442 INFO  (TEST-MultiThreadedOCPTest.test-seed#[CB45F455B0319F04]) [    ] o.a.s.c.c.ConnectionManager Waiting for client to connect to ZooKeeper
   [junit4]   2> 520443 INFO  (zkCallback-347-thread-1) [    ] o.a.s.c.c.ConnectionManager Watcher org.apache.solr.common.cloud.ConnectionManager@1cb5c610 name:ZooKeeperConnection Watcher:127.0.0.1:33054/solr got event WatchedEvent state:SyncConnected type:None path:null path:null type:None
   [junit4]   2> 520443 INFO  (TEST-MultiThreadedOCPTest.test-seed#[CB45F455B0319F04]) [    ] o.a.s.c.c.ConnectionManager Client is connected to ZooKeeper
   [junit4]   2> 520444 INFO  (TEST-MultiThreadedOCPTest.test-seed#[CB45F455B0319F04]) [    ] o.a.s.c.c.SolrZkClient Using default ZkACLProvider
   [junit4]   2> 520444 INFO  (TEST-MultiThreadedOCPTest.test-seed#[CB45F455B0319F04]) [    ] o.a.s.c.c.ZkStateReader Updating cluster state from ZooKeeper... 
   [junit4]   2> 520446 INFO  (TEST-MultiThreadedOCPTest.test-seed#[CB45F455B0319F04]) [    ] o.a.s.c.ChaosMonkey monkey: init - expire sessions:false cause connection loss:false
   [junit4]   2> 520446 INFO  (TEST-MultiThreadedOCPTest.test-seed#[CB45F455B0319F04]) [    ] o.a.s.c.AbstractFullDistribZkTestBase Creating collection1 with stateFormat=2
   [junit4]   2> 520447 INFO  (TEST-MultiThreadedOCPTest.test-seed#[CB45F455B0319F04]) [    ] o.a.s.c.c.SolrZkClient Using default ZkCredentialsProvider
   [junit4]   2> 520448 INFO  (TEST-MultiThreadedOCPTest.test-seed#[CB45F455B0319F04]) [    ] o.a.s.c.c.ConnectionManager Waiting for client to connect to ZooKeeper
   [junit4]   2> 520451 INFO  (zkCallback-348-thread-1) [    ] o.a.s.c.c.ConnectionManager Watcher org.apache.solr.common.cloud.ConnectionManager@5bb35714 name:ZooKeeperConnection Watcher:127.0.0.1:33054/solr got event WatchedEvent state:SyncConnected type:None path:null path:null type:None
   [junit4]   2> 520452 INFO  (TEST-MultiThreadedOCPTest.test-seed#[CB45F455B0319F04]) [    ] o.a.s.c.c.ConnectionManager Client is connected to ZooKeeper
   [junit4]   2> 520452 INFO  (TEST-MultiThreadedOCPTest.test-seed#[CB45F455B0319F04]) [    ] o.a.s.c.c.SolrZkClient Using default ZkACLProvider
   [junit4]   2> 520453 INFO  (zkCallback-345-thread-1-processing-n:127.0.0.1:46304_xvz%2Fqq) [n:127.0.0.1:46304_xvz%2Fqq    ] o.a.s.c.DistributedQueue NodeChildrenChanged fired on path /overseer/queue state SyncConnected
   [junit4]   2> 520454 INFO  (OverseerStateUpdate-93938211563962371-127.0.0.1:46304_xvz%2Fqq-n_0000000000) [n:127.0.0.1:46304_xvz%2Fqq    ] o.a.s.c.Overseer processMessage: queueSize: 1, message = {
   [junit4]   2>   "operation":"create",
   [junit4]   2>   "name":"collection1",
   [junit4]   2>   "numShards":"2",
   [junit4]   2>   "stateFormat":"2"} current state version: 3
   [junit4]   2> 520454 INFO  (OverseerStateUpdate-93938211563962371-127.0.0.1:46304_xvz%2Fqq-n_0000000000) [n:127.0.0.1:46304_xvz%2Fqq    ] o.a.s.c.o.ClusterStateMutator building a new cName: collection1
   [junit4]   2> 520559 INFO  (OverseerStateUpdate-93938211563962371-127.0.0.1:46304_xvz%2Fqq-n_0000000000) [n:127.0.0.1:46304_xvz%2Fqq    ] o.a.s.c.o.ZkStateWriter going to create_collection /collections/collection1/state.json
   [junit4]   2> 520560 INFO  (zkCallback-347-thread-1) [    ] o.a.s.c.c.ZkStateReader A cluster state change: WatchedEvent state:SyncConnected type:NodeDataChanged path:/clusterstate.json, has occurred - updating... (live nodes size: 1)
   [junit4]   2> 520560 INFO  (zkCallback-345-thread-1-processing-n:127.0.0.1:46304_xvz%2Fqq) [n:127.0.0.1:46304_xvz%2Fqq    ] o.a.s.c.c.ZkStateReader A cluster state change: WatchedEvent state:SyncConnected type:NodeDataChanged path:/clusterstate.json, has occurred - updating... (live nodes size: 1)
   [junit4]   2> 520562 INFO  (zkCallback-347-thread-1) [    ] o.a.s.c.c.ZkStateReader Updated cluster state version to 4
   [junit4]   2> 520562 INFO  (zkCallback-345-thread-1-processing-n:127.0.0.1:46304_xvz%2Fqq) [n:127.0.0.1:46304_xvz%2Fqq    ] o.a.s.c.c.ZkStateReader Updated cluster state version to 4
   [junit4]   2> 520779 INFO  (TEST-MultiThreadedOCPTest.test-seed#[CB45F455B0319F04]) [    ] o.a.s.SolrTestCaseJ4 Writing core.properties file to /x1/jenkins/jenkins-slave/workspace/Lucene-Solr-Tests-trunk-Java8/solr/build/solr-core/test/J0/temp/solr.cloud.MultiThreadedOCPTest CB45F455B0319F04-001/shard-1-001/cores/collection1
   [junit4]   2> 520780 INFO  (TEST-MultiThreadedOCPTest.test-seed#[CB45F455B0319F04]) [    ] o.a.s.c.AbstractFullDistribZkTestBase create jetty 1 in directory /x1/jenkins/jenkins-slave/workspace/Lucene-Solr-Tests-trunk-Java8/solr/build/solr-core/test/J0/temp/solr.cloud.MultiThreadedOCPTest CB45F455B0319F04-001/shard-1-001
   [junit4]   2> 520781 INFO  (TEST-MultiThreadedOCPTest.test-seed#[CB45F455B0319F04]) [    ] o.e.j.s.Server jetty-9.2.10.v20150310
   [junit4]   2> 520783 INFO  (TEST-MultiThreadedOCPTest.test-seed#[CB45F455B0319F04]) [    ] o.e.j.s.h.ContextHandler Started o.e.j.s.ServletContextHandler@1c4f9894{/xvz/qq,null,AVAILABLE}
   [junit4]   2> 520784 INFO  (TEST-MultiThreadedOCPTest.test-seed#[CB45F455B0319F04]) [    ] o.e.j.s.ServerConnector Started ServerConnector@5e6fc528{HTTP/1.1}{127.0.0.1:55740}
   [junit4]   2> 520784 INFO  (TEST-MultiThreadedOCPTest.test-seed#[CB45F455B0319F04]) [    ] o.e.j.s.Server Started @523980ms
   [junit4]   2> 520784 INFO  (TEST-MultiThreadedOCPTest.test-seed#[CB45F455B0319F04]) [    ] o.a.s.c.s.e.JettySolrRunner Jetty properties: {solr.data.dir=/x1/jenkins/jenkins-slave/workspace/Lucene-Solr-Tests-trunk-Java8/solr/build/solr-core/test/J0/temp/solr.cloud.MultiThreadedOCPTest CB45F455B0319F04-001/tempDir-001/jetty1, solrconfig=solrconfig.xml, hostContext=/xvz/qq, hostPort=55740, coreRootDirectory=/x1/jenkins/jenkins-slave/workspace/Lucene-Solr-Tests-trunk-Java8/solr/build/solr-core/test/J0/../../../../../../../../../../x1/jenkins/jenkins-slave/workspace/Lucene-Solr-Tests-trunk-Java8/solr/build/solr-core/test/J0/temp/solr.cloud.MultiThreadedOCPTest CB45F455B0319F04-001/shard-1-001/cores}
   [junit4]   2> 520785 INFO  (TEST-MultiThreadedOCPTest.test-seed#[CB45F455B0319F04]) [    ] o.a.s.s.SolrDispatchFilter SolrDispatchFilter.init()sun.misc.Launcher$AppClassLoader@c387f44
   [junit4]   2> 520785 INFO  (TEST-MultiThreadedOCPTest.test-seed#[CB45F455B0319F04]) [    ] o.a.s.c.SolrResourceLoader new SolrResourceLoader for directory: '/x1/jenkins/jenkins-slave/workspace/Lucene-Solr-Tests-trunk-Java8/solr/build/solr-core/test/J0/../../../../../../../../../../x1/jenkins/jenkins-slave/workspace/Lucene-Solr-Tests-trunk-Java8/solr/build/solr-core/test/J0/temp/solr.cloud.MultiThreadedOCPTest CB45F455B0319F04-001/shard-1-001/'
   [junit4]   2> 520801 INFO  (TEST-MultiThreadedOCPTest.test-seed#[CB45F455B0319F04]) [    ] o.a.s.c.SolrXmlConfig Loading container configuration from /x1/jenkins/jenkins-slave/workspace/Lucene-Solr-Tests-trunk-Java8/solr/build/solr-core/test/J0/../../../../../../../../../../x1/jenkins/jenkins-slave/workspace/Lucene-Solr-Tests-trunk-Java8/solr/build/solr-core/test/J0/temp/solr.cloud.MultiThreadedOCPTest CB45F455B0319F04-001/shard-1-001/solr.xml
   [junit4]   2> 520807 INFO  (TEST-MultiThreadedOCPTest.test-seed#[CB45F455B0319F04]) [    ] o.a.s.c.CoresLocator Config-defined core root directory: /x1/jenkins/jenkins-slave/workspace/Lucene-Solr-Tests-trunk-Java8/solr/build/solr-core/test/J0/../../../../../../../../../../x1/jenkins/jenkins-slave/workspace/Lucene-Solr-Tests-trunk-Java8/solr/build/solr-core/test/J0/temp/solr.cloud.MultiThreadedOCPTest CB45F455B0319F04-001/shard-1-001/cores
   [junit4]   2> 520807 INFO  (TEST-MultiThreadedOCPTest.test-seed#[CB45F455B0319F04]) [    ] o.a.s.c.CoreContainer New CoreContainer 1740657588
   [junit4]   2> 520808 INFO  (TEST-MultiThreadedOCPTest.test-seed#[CB45F455B0319F04]) [    ] o.a.s.c.CoreContainer Loading cores into CoreContainer [instanceDir=/x1/jenkins/jenkins-slave/workspace/Lucene-Solr-Tests-trunk-Java8/solr/build/solr-core/test/J0/../../../../../../../../../../x1/jenkins/jenkins-slave/workspace/Lucene-Solr-Tests-trunk-Java8/solr/build/solr-core/test/J0/temp/solr.cloud.MultiThreadedOCPTest CB45F455B0319F04-001/shard-1-001/]
   [junit4]   2> 520808 INFO  (TEST-MultiThreadedOCPTest.test-seed#[CB45F455B0319F04]) [    ] o.a.s.c.CoreContainer loading shared library: /x1/jenkins/jenkins-slave/workspace/Lucene-Solr-Tests-trunk-Java8/solr/build/solr-core/test/J0/../../../../../../../../../../x1/jenkins/jenkins-slave/workspace/Lucene-Solr-Tests-trunk-Java8/solr/build/solr-core/test/J0/temp/solr.cloud.MultiThreadedOCPTest CB45F455B0319F04-001/shard-1-001/lib
   [junit4]   2> 520808 WARN  (TEST-MultiThreadedOCPTest.test-seed#[CB45F455B0319F04]) [    ] o.a.s.c.SolrResourceLoader Can't find (or read) directory to add to classloader: lib (resolved as: /x1/jenkins/jenkins-slave/workspace/Lucene-Solr-Tests-trunk-Java8/solr/build/solr-core/test/J0/../../../../../../../../../../x1/jenkins/jenkins-slave/workspace/Lucene-Solr-Tests-trunk-Java8/solr/build/solr-core/test/J0/temp/solr.cloud.MultiThreadedOCPTest CB45F455B0319F04-001/shard-1-001/lib).
   [junit4]   2> 520816 INFO  (TEST-MultiThreadedOCPTest.test-seed#[CB45F455B0319F04]) [    ] o.a.s.h.c.HttpShardHandlerFactory created with socketTimeout : 90000,urlScheme : ,connTimeout : 15000,maxConnectionsPerHost : 20,maxConnections : 10000,corePoolSize : 0,maximumPoolSize : 2147483647,maxThreadIdleTime : 5,sizeOfQueue : -1,fairnessPolicy : false,useRetries : false,
   [junit4]   2> 520817 INFO  (TEST-MultiThreadedOCPTest.test-seed#[CB45F455B0319F04]) [    ] o.a.s.u.UpdateShardHandler Creating UpdateShardHandler HTTP client with params: socketTimeout=340000&connTimeout=45000&retry=true
   [junit4]   2> 520818 INFO  (TEST-MultiThreadedOCPTest.test-seed#[CB45F455B0319F04]) [    ] o.a.s.l.LogWatcher SLF4J impl is org.slf4j.impl.Log4jLoggerFactory
   [junit4]   2> 520818 INFO  (TEST-MultiThreadedOCPTest.test-seed#[CB45F455B0319F04]) [    ] o.a.s.l.LogWatcher Registering Log Listener [Log4j (org.slf4j.impl.Log4jLoggerFactory)]
   [junit4]   2> 520818 INFO  (TEST-MultiThreadedOCPTest.test-seed#[CB45F455B0319F04]) [    ] o.a.s.c.ZkContainer Zookeeper client=127.0.0.1:33054/solr
   [junit4]   2> 520818 INFO  (TEST-MultiThreadedOCPTest.test-seed#[CB45F455B0319F04]) [    ] o.a.s.c.ZkController zkHost includes chroot
   [junit4]   2> 520818 INFO  (TEST-MultiThreadedOCPTest.test-seed#[CB45F455B0319F04]) [    ] o.a.s.c.c.SolrZkClient Using default ZkCredentialsProvider
   [junit4]   2> 520819 INFO  (TEST-MultiThreadedOCPTest.test-seed#[CB45F455B0319F04]) [    ] o.a.s.c.c.ConnectionManager Waiting for client to connect to ZooKeeper
   [junit4]   2> 520820 INFO  (zkCallback-350-thread-1) [    ] o.a.s.c.c.ConnectionManager Watcher org.apache.solr.common.cloud.ConnectionManager@316589be name:ZooKeeperConnection Watcher:127.0.0.1:33054 got event WatchedEvent state:SyncConnected type:None path:null path:null type:None
   [junit4]   2> 520821 INFO  (TEST-MultiThreadedOCPTest.test-seed#[CB45F455B0319F04]) [    ] o.a.s.c.c.ConnectionManager Client is connected to ZooKeeper
   [junit4]   2> 520822 INFO  (TEST-MultiThreadedOCPTest.test-seed#[CB45F455B0319F04]) [    ] o.a.s.c.c.SolrZkClient Using default ZkACLProvider
   [junit4]   2> 520824 INFO  (TEST-MultiThreadedOCPTest.test-seed#[CB45F455B0319F04]) [n:127.0.0.1:55740_xvz%2Fqq    ] o.a.s.c.c.ConnectionManager Waiting for client to connect to ZooKeeper
   [junit4]   2> 520825 INFO  (zkCallback-351-thread-1-processing-n:127.0.0.1:55740_xvz%2Fqq) [n:127.0.0.1:55740_xvz%2Fqq    ] o.a.s.c.c.ConnectionManager Watcher org.apache.solr.common.cloud.ConnectionManager@d23f998 name:ZooKeeperConnection Watcher:127.0.0.1:33054/solr got event WatchedEvent state:SyncConnected type:None path:null path:null type:None
   [junit4]   2> 520825 INFO  (TEST-MultiThreadedOCPTest.test-seed#[CB45F455B0319F04]) [n:127.0.0.1:55740_xvz%2Fqq    ] o.a.s.c.c.ConnectionManager Client is connected to ZooKeeper
   [junit4]   2> 520829 INFO  (TEST-MultiThreadedOCPTest.test-seed#[CB45F455B0319F04]) [n:127.0.0.1:55740_xvz%2Fqq    ] o.a.s.c.c.ZkStateReader Updating cluster state from ZooKeeper... 
   [junit4]   2> 521834 INFO  (TEST-MultiThreadedOCPTest.test-seed#[CB45F455B0319F04]) [n:127.0.0.1:55740_xvz%2Fqq    ] o.a.s.c.ZkController Register node as live in ZooKeeper:/live_nodes/127.0.0.1:55740_xvz%2Fqq
   [junit4]   2> 521835 INFO  (TEST-MultiThreadedOCPTest.test-seed#[CB45F455B0319F04]) [n:127.0.0.1:55740_xvz%2Fqq    ] o.a.s.c.c.SolrZkClient makePath: /live_nodes/127.0.0.1:55740_xvz%2Fqq
   [junit4]   2> 521838 INFO  (TEST-MultiThreadedOCPTest.test-seed#[CB45F455B0319F04]) [n:127.0.0.1:55740_xvz%2Fqq    ] o.a.s.c.Overseer Overseer (id=null) closing
   [junit4]   2> 521839 INFO  (TEST-MultiThreadedOCPTest.test-seed#[CB45F455B0319F04]) [n:127.0.0.1:55740_xvz%2Fqq    ] o.a.s.c.CoreContainer No authentication plugin used.
   [junit4]   2> 521840 INFO  (TEST-MultiThreadedOCPTest.test-seed#[CB45F455B0319F04]) [n:127.0.0.1:55740_xvz%2Fqq    ] o.a.s.c.CoreContainer Security conf doesn't exist. Skipping setup for authorization module.
   [junit4]   2> 521840 INFO  (TEST-MultiThreadedOCPTest.test-seed#[CB45F455B0319F04]) [n:127.0.0.1:55740_xvz%2Fqq    ] o.a.s.c.CoresLocator Looking for core definitions underneath /x1/jenkins/jenkins-slave/workspace/Lucene-Solr-Tests-trunk-Java8/solr/build/solr-core/test/J0/../../../../../../../../../../x1/jenkins/jenkins-slave/workspace/Lucene-Solr-Tests-trunk-Java8/solr/build/solr-core/test/J0/temp/solr.cloud.MultiThreadedOCPTest CB45F455B0319F04-001/shard-1-001/cores
   [junit4]   2> 521841 INFO  (TEST-MultiThreadedOCPTest.test-seed#[CB45F455B0319F04]) [n:127.0.0.1:55740_xvz%2Fqq    ] o.a.s.c.SolrCore Created CoreDescriptor: {name=collection1, config=solrconfig.xml, transient=false, schema=schema.xml, loadOnStartup=true, instanceDir=/x1/jenkins/jenkins-slave/workspace/Lucene-Solr-Tests-trunk-Java8/solr/build/solr-core/test/J0/../../../../../../../../../../x1/jenkins/jenkins-slave/workspace/Lucene-Solr-Tests-trunk-Java8/solr/build/solr-core/test/J0/temp/solr.cloud.MultiThreadedOCPTest CB45F455B0319F04-001/shard-1-001/cores/collection1, collection=collection1, absoluteInstDir=/x1/jenkins/jenkins-slave/workspace/Lucene-Solr-Tests-trunk-Java8/solr/build/solr-core/test/J0/../../../../../../../../../../x1/jenkins/jenkins-slave/workspace/Lucene-Solr-Tests-trunk-Java8/solr/build/solr-core/test/J0/temp/solr.cloud.MultiThreadedOCPTest CB45F455B0319F04-001/shard-1-001/cores/collection1/, coreNodeName=, dataDir=data/, shard=}
   [junit4]   2> 521842 INFO  (TEST-MultiThreadedOCPTest.test-seed#[CB45F455B0319F04]) [n:127.0.0.1:55740_xvz%2Fqq    ] o.a.s.c.CoresLocator Found core collection1 in /x1/jenkins/jenkins-slave/workspace/Lucene-Solr-Tests-trunk-Java8/solr/build/solr-core/test/J0/../../../../../../../../../../x1/jenkins/jenkins-slave/workspace/Lucene-Solr-Tests-trunk-Java8/solr/build/solr-core/test/J0/temp/solr.cloud.MultiThreadedOCPTest CB45F455B0319F04-001/shard-1-001/cores/collection1/
   [junit4]   2> 521842 INFO  (TEST-MultiThreadedOCPTest.test-seed#[CB45F455B0319F04]) [n:127.0.0.1:55740_xvz%2Fqq    ] o.a.s.c.CoresLocator Found 1 core definitions
   [junit4]   2> 521843 INFO  (TEST-MultiThreadedOCPTest.test-seed#[CB45F455B0319F04]) [n:127.0.0.1:55740_xvz%2Fqq    ] o.a.s.s.SolrDispatchFilter user.dir=/x1/jenkins/jenkins-slave/workspace/Lucene-Solr-Tests-trunk-Java8/solr/build/solr-core/test/J0
   [junit4]   2> 521843 INFO  (TEST-MultiThreadedOCPTest.test-seed#[CB45F455B0319F04]) [n:127.0.0.1:55740_xvz%2Fqq    ] o.a.s.s.SolrDispatchFilter SolrDispatchFilter.init() done
   [junit4]   2> 521844 INFO  (coreLoadExecutor-1325-thread-1-processing-n:127.0.0.1:55740_xvz%2Fqq) [n:127.0.0.1:55740_xvz%2Fqq c:collection1   x:collection1] o.a.s.c.ZkController publishing state=down
   [junit4]   2> 521844 INFO  (coreLoadExecutor-1325-thread-1-processing-n:127.0.0.1:55740_xvz%2Fqq) [n:127.0.0.1:55740_xvz%2Fqq c:collection1   x:collection1] o.a.s.c.ZkController numShards not found on descriptor - reading it from system property
   [junit4]   2> 521847 INFO  (zkCallback-345-thread-1-processing-n:127.0.0.1:46304_xvz%2Fqq) [n:127.0.0.1:46304_xvz%2Fqq    ] o.a.s.c.DistributedQueue NodeChildrenChanged fired on path /overseer/queue state SyncConnected
   [junit4]   2> 521847 INFO  (OverseerStateUpdate-93938211563962371-127.0.0.1:46304_xvz%2Fqq-n_0000000000) [n:127.0.0.1:46304_xvz%2Fqq    ] o.a.s.c.Overseer processMessage: queueSize: 1, message = {
   [junit4]   2>   "core":"collection1",
   [junit4]   2>   "roles":null,
   [junit4]   2>   "base_url":"http://127.0.0.1:55740/xvz/qq",
   [junit4]   2>   "node_name":"127.0.0.1:55740_xvz%2Fqq",
   [junit4]   2>   "numShards":"2",
   [junit4]   2>   "state":"down",
   [junit4]   2>   "shard":null,
   [junit4]   2>   "collection":"collection1",
   [junit4]   2>   "operation":"state"} current state version: 4
   [junit4]   2> 521848 INFO  (OverseerStateUpdate-93938211563962371-127.0.0.1:46304_xvz%2Fqq-n_0000000000) [n:127.0.0.1:46304_xvz%2Fqq    ] o.a.s.c.o.ReplicaMutator Update state numShards=2 message={
   [junit4]   2>   "core":"collection1",
   [junit4]   2>   "roles":null,
   [junit4]   2>   "base_url":"http://127.0.0.1:55740/xvz/qq",
   [junit4]   2>   "node_name":"127.0.0.1:55740_xvz%2Fqq",
   [junit4]   2>   "numShards":"2",
   [junit4]   2>   "state":"down",
   [junit4]   2>   "shard":null,
   [junit4]   2>   "collection":"collection1",
   [junit4]   2>   "operation":"state"}
   [junit4]   2> 521848 INFO  (OverseerStateUpdate-93938211563962371-127.0.0.1:46304_xvz%2Fqq-n_0000000000) [n:127.0.0.1:46304_xvz%2Fqq    ] o.a.s.c.o.ReplicaMutator Collection already exists with numShards=2
   [junit4]   2> 521848 INFO  (OverseerStateUpdate-93938211563962371-127.0.0.1:46304_xvz%2Fqq-n_0000000000) [n:127.0.0.1:46304_xvz%2Fqq    ] o.a.s.c.o.ReplicaMutator Assigning new node to shard shard=shard2
   [junit4]   2> 521848 INFO  (coreLoadExecutor-1325-thread-1-processing-n:127.0.0.1:55740_xvz%2Fqq) [n:127.0.0.1:55740_xvz%2Fqq c:collection1   x:collection1] o.a.s.c.ZkController Registering watch for external collection collection1
   [junit4]   2> 521849 INFO  (coreLoadExecutor-1325-thread-1-processing-n:127.0.0.1:55740_xvz%2Fqq) [n:127.0.0.1:55740_xvz%2Fqq c:collection1   x:collection1] o.a.s.c.c.ZkStateReader addZkWatch collection1
   [junit4]   2> 521850 INFO  (coreLoadExecutor-1325-thread-1-processing-n:127.0.0.1:55740_xvz%2Fqq) [n:127.0.0.1:55740_xvz%2Fqq c:collection1   x:collection1] o.a.s.c.c.ZkStateReader Updating collection state at /collections/collection1/state.json from ZooKeeper... 
   [junit4]   2> 521851 INFO  (coreLoadExecutor-1325-thread-1-processing-n:127.0.0.1:55740_xvz%2Fqq) [n:127.0.0.1:55740_xvz%2Fqq c:collection1   x:collection1] o.a.s.c.c.ZkStateReader Updating data for collection1 to ver 0 
   [junit4]   2> 521851 INFO  (coreLoadExecutor-1325-thread-1-processing-n:127.0.0.1:55740_xvz%2Fqq) [n:127.0.0.1:55740_xvz%2Fqq c:collection1   x:collection1] o.a.s.c.ZkController look for our core node name
   [junit4]   2> 521951 INFO  (OverseerStateUpdate-93938211563962371-127.0.0.1:46304_xvz%2Fqq-n_0000000000) [n:127.0.0.1:46304_xvz%2Fqq    ] o.a.s.c.o.ZkStateWriter going to update_collection /collections/collection1/state.json version: 0
   [junit4]   2> 521951 INFO  (zkCallback-351-thread-1-processing-n:127.0.0.1:55740_xvz%2Fqq) [n:127.0.0.1:55740_xvz%2Fqq    ] o.a.s.c.c.ZkStateReader A cluster state change: WatchedEvent state:SyncConnected type:NodeDataChanged path:/collections/collection1/state.json for collection collection1 has occurred - updating... (live nodes size: 2)
   [junit4]   2> 521952 INFO  (zkCallback-351-thread-1-processing-n:127.0.0.1:55740_xvz%2Fqq) [n:127.0.0.1:55740_xvz%2Fqq    ] o.a.s.c.c.ZkStateReader Updating data for collection1 to ver 1 
   [junit4]   2> 522851 INFO  (coreLoadExecutor-1325-thread-1-processing-n:127.0.0.1:55740_xvz%2Fqq) [n:127.0.0.1:55740_xvz%2Fqq c:collection1   x:collection1] o.a.s.c.ZkController waiting to find shard id in clusterstate for collection1
   [junit4]   2> 522852 INFO  (coreLoadExecutor-1325-thread-1-processing-n:127.0.0.1:55740_xvz%2Fqq) [n:127.0.0.1:55740_xvz%2Fqq c:collection1   x:collection1] o.a.s.c.ZkController Check for collection zkNode:collection1
   [junit4]   2> 522853 INFO  (coreLoadExecutor-1325-thread-1-processing-n:127.0.0.1:55740_xvz%2Fqq) [n:127.0.0.1:55740_xvz%2Fqq c:collection1   x:collection1] o.a.s.c.ZkController Collection zkNode exists
   [junit4]   2> 522853 INFO  (coreLoadExecutor-1325-thread-1-processing-n:127.0.0.1:55740_xvz%2Fqq) [n:127.0.0.1:55740_xvz%2Fqq c:collection1   x:collection1] o.a.s.c.c.ZkStateReader Load collection config from:/collections/collection1
   [junit4]   2> 522854 INFO  (coreLoadExecutor-1325-thread-1-processing-n:127.0.0.1:55740_xvz%2Fqq) [n:127.0.0.1:55740_xvz%2Fqq c:collection1   x:collection1] o.a.s.c.c.ZkStateReader path=/collections/collection1 configName=conf1 specified config exists in ZooKeeper
   [junit4]   2> 522854 INFO  (coreLoadExecutor-1325-thread-1-processing-n:127.0.0.1:55740_xvz%2Fqq) [n:127.0.0.1:55740_xvz%2Fqq c:collection1   x:collection1] o.a.s.c.SolrResourceLoader new SolrResourceLoader for directory: '/x1/jenkins/jenkins-slave/workspace/Lucene-Solr-Tests-trunk-Java8/solr/build/solr-core/test/J0/../../../../../../../../../../x1/jenkins/jenkins-slave/workspace/Lucene-Solr-Tests-trunk-Java8/solr/build/solr-core/test/J0/temp/solr.cloud.MultiThreadedOCPTest CB45F455B0319F04-001/shard-1-001/cores/collection1/'
   [junit4]   2> 522868 INFO  (coreLoadExecutor-1325-thread-1-processing-n:127.0.0.1:55740_xvz%2Fqq) [n:127.0.0.1:55740_xvz%2Fqq c:collection1   x:collection1] o.a.s.c.Config loaded config solrconfig.xml with version 0 
   [junit4]   2> 522875 INFO  (coreLoadExecutor-1325-thread-1-processing-n:127.0.0.1:55740_xvz%2Fqq) [n:127.0.0.1:55740_xvz%2Fqq c:collection1   x:collection1] o.a.s.c.SolrConfig current version of requestparams : -1
   [junit4]   2> 522879 INFO  (coreLoadExecutor-1325-thread-1-processing-n:127.0.0.1:55740_xvz%2Fqq) [n:127.0.0.1:55740_xvz%2Fqq c:collection1   x:collection1] o.a.s.c.SolrConfig Using Lucene MatchVersion: 6.0.0
   [junit4]   2> 522887 INFO  (coreLoadExecutor-1325-thread-1-processing-n:127.0.0.1:55740_xvz%2Fqq) [n:127.0.0.1:55740_xvz%2Fqq c:collection1   x:collection1] o.a.s.c.Config Loaded SolrConfig: solrconfig.xml
   [junit4]   2> 522888 INFO  (coreLoadExecutor-1325-thread-1-processing-n:127.0.0.1:55740_xvz%2Fqq) [n:127.0.0.1:55740_xvz%2Fqq c:collection1   x:collection1] o.a.s.s.IndexSchema Reading Solr Schema from /configs/conf1/schema.xml
   [junit4]   2> 522893 INFO  (coreLoadExecutor-1325-thread-1-processing-n:127.0.0.1:55740_xvz%2Fqq) [n:127.0.0.1:55740_xvz%2Fqq c:collection1   x:collection1] o.a.s.s.IndexSchema [collection1] Schema name=test
   [junit4]   2> 523015 INFO  (coreLoadExecutor-1325-thread-1-processing-n:127.0.0.1:55740_xvz%2Fqq) [n:127.0.0.1:55740_xvz%2Fqq c:collection1   x:collection1] o.a.s.s.OpenExchangeRatesOrgProvider Initialized with rates=open-exchange-rates.json, refreshInterval=1440.
   [junit4]   2> 523021 INFO  (coreLoadExecutor-1325-thread-1-processing-n:127.0.0.1:55740_xvz%2Fqq) [n:127.0.0.1:55740_xvz%2Fqq c:collection1   x:collection1] o.a.s.s.IndexSchema default search field in schema is text
   [junit4]   2> 523028 INFO  (coreLoadExecutor-1325-thread-1-processing-n:127.0.0.1:55740_xvz%2Fqq) [n:127.0.0.1:55740_xvz%2Fqq c:collection1   x:collection1] o.a.s.s.IndexSchema unique key field: id
   [junit4]   2> 523039 INFO  (coreLoadExecutor-1325-thread-1-processing-n:127.0.0.1:55740_xvz%2Fqq) [n:127.0.0.1:55740_xvz%2Fqq c:collection1   x:collection1] o.a.s.s.FileExchangeRateProvider Reloading exchange rates from file currency.xml
   [junit4]   2> 523044 INFO  (coreLoadExecutor-1325-thread-1-processing-n:127.0.0.1:55740_xvz%2Fqq) [n:127.0.0.1:55740_xvz%2Fqq c:collection1   x:collection1] o.a.s.s.FileExchangeRateProvider Reloading exchange rates from file currency.xml
   [junit4]   2> 523047 INFO  (coreLoadExecutor-1325-thread-1-processing-n:127.0.0.1:55740_xvz%2Fqq) [n:127.0.0.1:55740_xvz%2Fqq c:collection1   x:collection1] o.a.s.s.OpenExchangeRatesOrgProvider Reloading exchange rates from open-exchange-rates.json
   [junit4]   2> 523048 WARN  (coreLoadExecutor-1325-thread-1-processing-n:127.0.0.1:55740_xvz%2Fqq) [n:127.0.0.1:55740_xvz%2Fqq c:collection1   x:collection1] o.a.s.s.OpenExchangeRatesOrgProvider Unknown key IMPORTANT NOTE
   [junit4]   2> 523048 WARN  (coreLoadExecutor-1325-thread-1-processing-n:127.0.0.1:55740_xvz%2Fqq) [n:127.0.0.1:55740_xvz%2Fqq c:collection1   x:collection1] o.a.s.s.OpenExchangeRatesOrgProvider Expected key, got STRING
   [junit4]   2> 523048 INFO  (coreLoadExecutor-1325-thread-1-processing-n:127.0.0.1:55740_xvz%2Fqq) [n:127.0.0.1:55740_xvz%2Fqq c:collection1   x:collection1] o.a.s.s.OpenExchangeRatesOrgProvider Reloading exchange rates from open-exchange-rates.json
   [junit4]   2> 523048 WARN  (coreLoadExecutor-1325-thread-1-processing-n:127.0.0.1:55740_xvz%2Fqq) [n:127.0.0.1:55740_xvz%2Fqq c:collection1   x:collection1] o.a.s.s.OpenExchangeRatesOrgProvider Unknown key IMPORTANT NOTE
   [junit4]   2> 523050 WARN  (coreLoadExecutor-1325-thread-1-processing-n:127.0.0.1:55740_xvz%2Fqq) [n:127.0.0.1:55740_xvz%2Fqq c:collection1   x:collection1] o.a.s.s.OpenExchangeRatesOrgProvider Expected key, got STRING
   [junit4]   2> 523051 INFO  (coreLoadExecutor-1325-thread-1-processing-n:127.0.0.1:55740_xvz%2Fqq) [n:127.0.0.1:55740_xvz%2Fqq c:collection1   x:collection1] o.a.s.c.CoreContainer Creating SolrCore 'collection1' using configuration from collection collection1
   [junit4]   2> 523051 INFO  (coreLoadExecutor-1325-thread-1-processing-n:127.0.0.1:55740_xvz%2Fqq) [n:127.0.0.1:55740_xvz%2Fqq c:collection1 s:shard2 r:core_node1 x:collection1] o.a.s.c.SolrCore org.apache.solr.core.MockDirectoryFactory
   [junit4]   2> 523051 INFO  (coreLoadExecutor-1325-thread-1-processing-n:127.0.0.1:55740_xvz%2Fqq) [n:127.0.0.1:55740_xvz%2Fqq c:collection1 s:shard2 r:core_node1 x:collection1] o.a.s.c.SolrCore [[collection1] ] Opening new SolrCore at [/x1/jenkins/jenkins-slave/workspace/Lucene-Solr-Tests-trunk-Java8/solr/build/solr-core/test/J0/../../../../../../../../../../x1/jenkins/jenkins-slave/workspace/Lucene-Solr-Tests-trunk-Java8/solr/build/solr-core/test/J0/temp/solr.cloud.MultiThreadedOCPTest CB45F455B0319F04-001/shard-1-001/cores/collection1/], dataDir=[null]
   [junit4]   2> 523051 INFO  (coreLoadExecutor-1325-thread-1-processing-n:127.0.0.1:55740_xvz%2Fqq) [n:127.0.0.1:55740_xvz%2Fqq c:collection1 s:shard2 r:core_node1 x:collection1] o.a.s.c.JmxMonitoredMap JMX monitoring is enabled. Adding Solr mbeans to JMX Server: com.sun.jmx.mbeanserver.JmxMBeanServer@4cad1652
   [junit4]   2> 523052 INFO  (coreLoadExecutor-1325-thread-1-processing-n:127.0.0.1:55740_xvz%2Fqq) [n:127.0.0.1:55740_xvz%2Fqq c:collection1 s:shard2 r:core_node1 x:collection1] o.a.s.c.CachingDirectoryFactory return new directory for /x1/jenkins/jenkins-slave/workspace/Lucene-Solr-Tests-trunk-Java8/solr/build/solr-core/test/J0/../../../../../../../../../../x1/jenkins/jenkins-slave/workspace/Lucene-Solr-Tests-trunk-Java8/solr/build/solr-core/test/J0/temp/solr.cloud.MultiThreadedOCPTest CB45F455B0319F04-001/shard-1-001/cores/collection1/data
   [junit4]   2> 523058 INFO  (coreLoadExecutor-1325-thread-1-processing-n:127.0.0.1:55740_xvz%2Fqq) [n:127.0.0.1:55740_xvz%2Fqq c:collection1 s:shard2 r:core_node1 x:collection1] o.a.s.c.SolrCore New index directory detected: old=null new=/x1/jenkins/jenkins-slave/workspace/Lucene-Solr-Tests-trunk-Java8/solr/build/solr-core/test/J0/../../../../../../../../../../x1/jenkins/jenkins-slave/workspace/Lucene-Solr-Tests-trunk-Java8/solr/build/solr-core/test/J0/temp/solr.cloud.MultiThreadedOCPTest CB45F455B0319F04-001/shard-1-001/cores/collection1/data/index/
   [junit4]   2> 523058 WARN  (coreLoadExecutor-1325-thread-1-processing-n:127.0.0.1:55740_xvz%2Fqq) [n:127.0.0.1:55740_xvz%2Fqq c:collection1 s:shard2 r:core_node1 x:collection1] o.a.s.c.SolrCore [collection1] Solr index directory '/x1/jenkins/jenkins-slave/workspace/Lucene-Solr-Tests-trunk-Java8/solr/build/solr-core/test/J0/../../../../../../../../../../x1/jenkins/jenkins-slave/workspace/Lucene-Solr-Tests-trunk-Java8/solr/build/solr-core/test/J0/temp/solr.cloud.MultiThreadedOCPTest CB45F455B0319F04-001/shard-1-001/cores/collection1/data/index' doesn't exist. Creating new index...
   [junit4]   2> 523059 INFO  (coreLoadExecutor-1325-thread-1-processing-n:127.0.0.1:55740_xvz%2Fqq) [n:127.0.0.1:55740_xvz%2Fqq c:collection1 s:shard2 r:core_node1 x:collection1] o.a.s.c.CachingDirectoryFactory return new directory for /x1/jenkins/jenkins-slave/workspace/Lucene-Solr-Tests-trunk-Java8/solr/build/solr-core/test/J0/../../../../../../../../../../x1/jenkins/jenkins-slave/workspace/Lucene-Solr-Tests-trunk-Java8/solr/build/solr-core/test/J0/temp/solr.cloud.MultiThreadedOCPTest CB45F455B0319F04-001/shard-1-001/cores/collection1/data/index
   [junit4]   2> 523059 INFO  (coreLoadExecutor-1325-thread-1-processing-n:127.0.0.1:55740_xvz%2Fqq) [n:127.0.0.1:55740_xvz%2Fqq c:collection1 s:shard2 r:core_node1 x:collection1] o.a.s.u.RandomMergePolicy RandomMergePolicy wrapping class org.apache.lucene.index.TieredMergePolicy: [TieredMergePolicy: maxMergeAtOnce=42, maxMergeAtOnceExplicit=18, maxMergedSegmentMB=19.8623046875, floorSegmentMB=0.7998046875, forceMergeDeletesPctAllowed=8.468515154491655, segmentsPerTier=36.0, maxCFSSegmentSizeMB=8.796093022207999E12, noCFSRatio=0.23410487163543633
   [junit4]   2> 523060 INFO  (coreLoadExecutor-1325

[...truncated too long message...]

t4]   2> 550436 INFO  (TEST-MultiThreadedOCPTest.test-seed#[CB45F455B0319F04]) [n:127.0.0.1:44502_xvz%2Fqq c:ocptest_shardsplit s:shard2 r:core_node2 x:ocptest_shardsplit_shard2_replica1] o.a.s.c.CachingDirectoryFactory looking to close /x1/jenkins/jenkins-slave/workspace/Lucene-Solr-Tests-trunk-Java8/solr/build/solr-core/test/J0/temp/solr.cloud.MultiThreadedOCPTest CB45F455B0319F04-001/shard-4-001/cores/ocptest_shardsplit_shard2_replica1/data/index [CachedDir<<refCount=0;path=/x1/jenkins/jenkins-slave/workspace/Lucene-Solr-Tests-trunk-Java8/solr/build/solr-core/test/J0/temp/solr.cloud.MultiThreadedOCPTest CB45F455B0319F04-001/shard-4-001/cores/ocptest_shardsplit_shard2_replica1/data/index;done=false>>]
   [junit4]   2> 550436 INFO  (TEST-MultiThreadedOCPTest.test-seed#[CB45F455B0319F04]) [n:127.0.0.1:44502_xvz%2Fqq c:ocptest_shardsplit s:shard2 r:core_node2 x:ocptest_shardsplit_shard2_replica1] o.a.s.c.CachingDirectoryFactory Closing directory: /x1/jenkins/jenkins-slave/workspace/Lucene-Solr-Tests-trunk-Java8/solr/build/solr-core/test/J0/temp/solr.cloud.MultiThreadedOCPTest CB45F455B0319F04-001/shard-4-001/cores/ocptest_shardsplit_shard2_replica1/data/index
   [junit4]   2> 550436 INFO  (TEST-MultiThreadedOCPTest.test-seed#[CB45F455B0319F04]) [n:127.0.0.1:44502_xvz%2Fqq c:ocptest_shardsplit s:shard2 r:core_node2 x:ocptest_shardsplit_shard2_replica1] o.a.s.c.CachingDirectoryFactory looking to close /x1/jenkins/jenkins-slave/workspace/Lucene-Solr-Tests-trunk-Java8/solr/build/solr-core/test/J0/temp/solr.cloud.MultiThreadedOCPTest CB45F455B0319F04-001/shard-4-001/cores/ocptest_shardsplit_shard2_replica1/data [CachedDir<<refCount=0;path=/x1/jenkins/jenkins-slave/workspace/Lucene-Solr-Tests-trunk-Java8/solr/build/solr-core/test/J0/temp/solr.cloud.MultiThreadedOCPTest CB45F455B0319F04-001/shard-4-001/cores/ocptest_shardsplit_shard2_replica1/data;done=false>>]
   [junit4]   2> 550436 INFO  (TEST-MultiThreadedOCPTest.test-seed#[CB45F455B0319F04]) [n:127.0.0.1:44502_xvz%2Fqq c:ocptest_shardsplit s:shard2 r:core_node2 x:ocptest_shardsplit_shard2_replica1] o.a.s.c.CachingDirectoryFactory Closing directory: /x1/jenkins/jenkins-slave/workspace/Lucene-Solr-Tests-trunk-Java8/solr/build/solr-core/test/J0/temp/solr.cloud.MultiThreadedOCPTest CB45F455B0319F04-001/shard-4-001/cores/ocptest_shardsplit_shard2_replica1/data
   [junit4]   2> 550437 INFO  (TEST-MultiThreadedOCPTest.test-seed#[CB45F455B0319F04]) [n:127.0.0.1:44502_xvz%2Fqq c:ocptest_shardsplit s:shard2 r:core_node2 x:ocptest_shardsplit_shard2_replica1] o.a.s.c.Overseer Overseer (id=93938211563962381-127.0.0.1:44502_xvz%2Fqq-n_0000000004) closing
   [junit4]   2> 550439 INFO  (OverseerStateUpdate-93938211563962381-127.0.0.1:44502_xvz%2Fqq-n_0000000004) [n:127.0.0.1:44502_xvz%2Fqq    ] o.a.s.c.Overseer Overseer Loop exiting : 127.0.0.1:44502_xvz%2Fqq
   [junit4]   2> 551940 WARN  (zkCallback-361-thread-1-processing-n:127.0.0.1:44502_xvz%2Fqq) [n:127.0.0.1:44502_xvz%2Fqq    ] o.a.s.c.c.ZkStateReader ZooKeeper watch triggered, but Solr cannot talk to ZK
   [junit4]   2> 551941 INFO  (TEST-MultiThreadedOCPTest.test-seed#[CB45F455B0319F04]) [    ] o.e.j.s.ServerConnector Stopped ServerConnector@5664d517{HTTP/1.1}{127.0.0.1:0}
   [junit4]   2> 551942 INFO  (TEST-MultiThreadedOCPTest.test-seed#[CB45F455B0319F04]) [    ] o.e.j.s.h.ContextHandler Stopped o.e.j.s.ServletContextHandler@18942690{/xvz/qq,null,UNAVAILABLE}
   [junit4]   2> 551946 INFO  (TEST-MultiThreadedOCPTest.test-seed#[CB45F455B0319F04]) [n:127.0.0.1:44502_xvz%2Fqq c:ocptest_shardsplit s:shard2 r:core_node2 x:ocptest_shardsplit_shard2_replica1] o.a.s.c.ZkTestServer connecting to 127.0.0.1:33054 33054
   [junit4]   2> 552175 INFO  (Thread-1353) [    ] o.a.s.c.ZkTestServer connecting to 127.0.0.1:33054 33054
   [junit4]   2> 552177 WARN  (Thread-1353) [    ] o.a.s.c.ZkTestServer Watch limit violations: 
   [junit4]   2> Maximum concurrent create/delete watches above limit:
   [junit4]   2> 
   [junit4]   2> 	6	/solr/aliases.json
   [junit4]   2> 	6	/solr/clusterstate.json
   [junit4]   2> 	5	/solr/configs/conf1
   [junit4]   2> 	4	/solr/collections/ocptest1/state.json
   [junit4]   2> 	4	/solr/collections/ocptest2/state.json
   [junit4]   2> 	4	/solr/collections/collection1/state.json
   [junit4]   2> 	4	/solr/collections/ocptest4/state.json
   [junit4]   2> 	4	/solr/collections/ocptest3/state.json
   [junit4]   2> 	4	/solr/collections/ocptest_shardsplit/state.json
   [junit4]   2> 
   [junit4]   2> Maximum concurrent children watches above limit:
   [junit4]   2> 
   [junit4]   2> 	6	/solr/live_nodes
   [junit4]   2> 	5	/solr/overseer/queue
   [junit4]   2> 	5	/solr/overseer/collection-queue-work
   [junit4]   2> 
   [junit4]   2> NOTE: reproduce with: ant test  -Dtestcase=MultiThreadedOCPTest -Dtests.method=test -Dtests.seed=CB45F455B0319F04 -Dtests.multiplier=2 -Dtests.slow=true -Dtests.locale=en_IN -Dtests.timezone=Pacific/Wake -Dtests.asserts=true -Dtests.file.encoding=UTF-8
   [junit4] FAILURE 33.8s J0 | MultiThreadedOCPTest.test <<<
   [junit4]    > Throwable #1: java.lang.AssertionError: Mutual exclusion failed. Found more than one task running for the same collection
   [junit4]    > 	at __randomizedtesting.SeedInfo.seed([CB45F455B0319F04:4311CB8F1ECDF2FC]:0)
   [junit4]    > 	at org.apache.solr.cloud.MultiThreadedOCPTest.testTaskExclusivity(MultiThreadedOCPTest.java:139)
   [junit4]    > 	at org.apache.solr.cloud.MultiThreadedOCPTest.test(MultiThreadedOCPTest.java:61)
   [junit4]    > 	at org.apache.solr.BaseDistributedSearchTestCase$ShardsRepeatRule$ShardsFixedStatement.callStatement(BaseDistributedSearchTestCase.java:960)
   [junit4]    > 	at org.apache.solr.BaseDistributedSearchTestCase$ShardsRepeatRule$ShardsStatement.evaluate(BaseDistributedSearchTestCase.java:935)
   [junit4]    > 	at java.lang.Thread.run(Thread.java:745)
   [junit4]   2> 552204 INFO  (SUITE-MultiThreadedOCPTest-seed#[CB45F455B0319F04]-worker) [n:127.0.0.1:44502_xvz%2Fqq c:ocptest_shardsplit s:shard2 r:core_node2 x:ocptest_shardsplit_shard2_replica1] o.a.s.SolrTestCaseJ4 ###deleteCore
   [junit4]   2> NOTE: leaving temporary files on disk at: /x1/jenkins/jenkins-slave/workspace/Lucene-Solr-Tests-trunk-Java8/solr/build/solr-core/test/J0/temp/solr.cloud.MultiThreadedOCPTest CB45F455B0319F04-001
   [junit4]   2> Jun 03, 2015 10:03:08 PM com.carrotsearch.randomizedtesting.ThreadLeakControl checkThreadLeaks
   [junit4]   2> WARNING: Will linger awaiting termination of 1 leaked thread(s).
   [junit4]   2> NOTE: test params are: codec=FastCompressingStoredFields(storedFieldsFormat=CompressingStoredFieldsFormat(compressionMode=FAST, chunkSize=18405, maxDocsPerChunk=1, blockSize=1), termVectorsFormat=CompressingTermVectorsFormat(compressionMode=FAST, chunkSize=18405, blockSize=1)), sim=DefaultSimilarity, locale=en_IN, timezone=Pacific/Wake
   [junit4]   2> NOTE: Linux 3.13.0-52-generic amd64/Oracle Corporation 1.8.0_25 (64-bit)/cpus=4,threads=1,free=122956544,total=523763712
   [junit4]   2> NOTE: All tests run in this JVM: [TestCopyFieldCollectionResource, FastVectorHighlighterTest, PeerSyncTest, AsyncMigrateRouteKeyTest, TestLeaderElectionZkExpiry, TestRestManager, DateFieldTest, HighlighterTest, TestArbitraryIndexDir, TestExceedMaxTermLength, TestFunctionQuery, TestChildDocTransformer, DistributedQueueTest, TestSolrDeletionPolicy1, TestSolrConfigHandlerConcurrent, ConcurrentDeleteAndCreateCollectionTest, HdfsLockFactoryTest, TestRandomDVFaceting, TestReqParamsAPI, TestInfoStreamLogging, TestFieldTypeResource, TestMiniSolrCloudClusterSSL, BasicDistributedZkTest, TestSearcherReuse, TestIndexingPerformance, TestNoOpRegenerator, CoreAdminRequestStatusTest, ZkNodePropsTest, SolrIndexConfigTest, BufferStoreTest, TestCustomDocTransformer, TestRemoteStreaming, TestIBSimilarityFactory, TestSchemaNameResource, StressHdfsTest, TestJmxIntegration, ExternalFileFieldSortTest, HdfsChaosMonkeySafeLeaderTest, TestDFRSimilarityFactory, TestSchemaSimilarityResource, SignatureUpdateProcessorFactoryTest, SolrCoreTest, DistributedIntervalFacetingTest, TestSolrXml, TestRangeQuery, TestCloudInspectUtil, CurrencyFieldXmlFileTest, RequestHandlersTest, SchemaVersionSpecificBehaviorTest, URLClassifyProcessorTest, TestPostingsSolrHighlighter, TestMiniSolrCloudCluster, QueryResultKeyTest, MultiThreadedOCPTest]
   [junit4] Completed [175/504] on J0 in 34.16s, 1 test, 1 failure <<< FAILURES!

[...truncated 1015 lines...]
BUILD FAILED
/x1/jenkins/jenkins-slave/workspace/Lucene-Solr-Tests-trunk-Java8/build.xml:526: The following error occurred while executing this line:
/x1/jenkins/jenkins-slave/workspace/Lucene-Solr-Tests-trunk-Java8/build.xml:474: The following error occurred while executing this line:
/x1/jenkins/jenkins-slave/workspace/Lucene-Solr-Tests-trunk-Java8/build.xml:61: The following error occurred while executing this line:
/x1/jenkins/jenkins-slave/workspace/Lucene-Solr-Tests-trunk-Java8/extra-targets.xml:39: The following error occurred while executing this line:
/x1/jenkins/jenkins-slave/workspace/Lucene-Solr-Tests-trunk-Java8/solr/build.xml:230: The following error occurred while executing this line:
/x1/jenkins/jenkins-slave/workspace/Lucene-Solr-Tests-trunk-Java8/solr/common-build.xml:512: The following error occurred while executing this line:
/x1/jenkins/jenkins-slave/workspace/Lucene-Solr-Tests-trunk-Java8/lucene/common-build.xml:1418: The following error occurred while executing this line:
/x1/jenkins/jenkins-slave/workspace/Lucene-Solr-Tests-trunk-Java8/lucene/common-build.xml:973: There were test failures: 504 suites, 1987 tests, 1 failure, 35 ignored (25 assumptions)

Total time: 50 minutes 43 seconds
Build step 'Invoke Ant' marked build as failure
Archiving artifacts
Sending artifact delta relative to Lucene-Solr-Tests-trunk-Java8 #32
Archived 4 artifacts
Archive block size is 32768
Received 0 blocks and 289709248 bytes
Compression is 0.0%
Took 46 sec
Recording test results
Email was triggered for: Failure
Sending email for trigger: Failure



Mime
View raw message