lucene-dev mailing list archives

Site index · List index
Message view « Date » · « Thread »
Top « Date » · « Thread »
From Dawid Weiss <dawid.we...@cs.put.poznan.pl>
Subject Re: [JENKINS] Lucene-Solr-trunk-Linux (64bit/jdk1.9.0-ea-b60) - Build # 12746 - Failure!
Date Wed, 20 May 2015 10:05:54 GMT
Does not reproduce for me.

Dawid

On Tue, May 19, 2015 at 11:52 PM, Policeman Jenkins Server
<jenkins@thetaphi.de> wrote:
> Build: http://jenkins.thetaphi.de/job/Lucene-Solr-trunk-Linux/12746/
> Java: 64bit/jdk1.9.0-ea-b60 -XX:-UseCompressedOops -XX:+UseG1GC
>
> 2 tests failed.
> FAILED:  junit.framework.TestSuite.org.apache.lucene.analysis.snowball.TestSnowballVocab
>
> Error Message:
> Suite timeout exceeded (>= 7200000 msec).
>
> Stack Trace:
> java.lang.Exception: Suite timeout exceeded (>= 7200000 msec).
>         at __randomizedtesting.SeedInfo.seed([7FBAD445ED608074]:0)
>
>
> FAILED:  org.apache.lucene.analysis.snowball.TestSnowballVocab.testStemmers
>
> Error Message:
> Test abandoned because suite timeout was reached.
>
> Stack Trace:
> java.lang.Exception: Test abandoned because suite timeout was reached.
>         at __randomizedtesting.SeedInfo.seed([7FBAD445ED608074]:0)
>
>
>
>
> Build Log:
> [...truncated 3199 lines...]
>    [junit4] Suite: org.apache.lucene.analysis.snowball.TestSnowballVocab
>    [junit4]   2> mag 19, 2015 6:51:40 PM com.carrotsearch.randomizedtesting.ThreadLeakControl$2
evaluate
>    [junit4]   2> WARNING: Suite execution timed out: org.apache.lucene.analysis.snowball.TestSnowballVocab
>    [junit4]   2>    1) Thread[id=13, name=JUnit4-serializer-daemon, state=TIMED_WAITING,
group=main]
>    [junit4]   2>         at java.lang.Thread.sleep(Native Method)
>    [junit4]   2>         at com.carrotsearch.ant.tasks.junit4.events.Serializer$1.run(Serializer.java:47)
>    [junit4]   2>    2) Thread[id=1, name=main, state=WAITING, group=main]
>    [junit4]   2>         at java.lang.Object.wait(Native Method)
>    [junit4]   2>         at java.lang.Thread.join(Thread.java:1249)
>    [junit4]   2>         at java.lang.Thread.join(Thread.java:1323)
>    [junit4]   2>         at com.carrotsearch.randomizedtesting.RandomizedRunner.runSuite(RandomizedRunner.java:578)
>    [junit4]   2>         at com.carrotsearch.randomizedtesting.RandomizedRunner.run(RandomizedRunner.java:444)
>    [junit4]   2>         at com.carrotsearch.ant.tasks.junit4.slave.SlaveMain.execute(SlaveMain.java:199)
>    [junit4]   2>         at com.carrotsearch.ant.tasks.junit4.slave.SlaveMain.main(SlaveMain.java:310)
>    [junit4]   2>         at com.carrotsearch.ant.tasks.junit4.slave.SlaveMainSafe.main(SlaveMainSafe.java:12)
>    [junit4]   2>    3) Thread[id=148, name=SUITE-TestSnowballVocab-seed#[7FBAD445ED608074],
state=RUNNABLE, group=TGRP-TestSnowballVocab]
>    [junit4]   2>         at java.lang.Thread.getStackTrace(Thread.java:1556)
>    [junit4]   2>         at com.carrotsearch.randomizedtesting.ThreadLeakControl.getThreadsWithTraces(ThreadLeakControl.java:690)
>    [junit4]   2>         at com.carrotsearch.randomizedtesting.ThreadLeakControl.formatThreadStacksFull(ThreadLeakControl.java:679)
>    [junit4]   2>         at com.carrotsearch.randomizedtesting.ThreadLeakControl.access$900(ThreadLeakControl.java:62)
>    [junit4]   2>         at com.carrotsearch.randomizedtesting.ThreadLeakControl$2.evaluate(ThreadLeakControl.java:412)
>    [junit4]   2>         at com.carrotsearch.randomizedtesting.RandomizedRunner.runSuite(RandomizedRunner.java:651)
>    [junit4]   2>         at com.carrotsearch.randomizedtesting.RandomizedRunner.access$200(RandomizedRunner.java:138)
>    [junit4]   2>         at com.carrotsearch.randomizedtesting.RandomizedRunner$1.run(RandomizedRunner.java:568)
>    [junit4]   2>    4) Thread[id=149, name=TEST-TestSnowballVocab.testStemmers-seed#[7FBAD445ED608074],
state=RUNNABLE, group=TGRP-TestSnowballVocab]
>    [junit4]   2>         at org.tartarus.snowball.ext.FrenchStemmer.stem(FrenchStemmer.java:1379)
>    [junit4]   2>         at org.apache.lucene.analysis.snowball.SnowballFilter.incrementToken(SnowballFilter.java:95)
>    [junit4]   2>         at org.apache.lucene.analysis.BaseTokenStreamTestCase.checkResetException(BaseTokenStreamTestCase.java:400)
>    [junit4]   2>         at org.apache.lucene.analysis.BaseTokenStreamTestCase.assertAnalyzesTo(BaseTokenStreamTestCase.java:352)
>    [junit4]   2>         at org.apache.lucene.analysis.BaseTokenStreamTestCase.assertAnalyzesTo(BaseTokenStreamTestCase.java:362)
>    [junit4]   2>         at org.apache.lucene.analysis.BaseTokenStreamTestCase.checkOneTerm(BaseTokenStreamTestCase.java:423)
>    [junit4]   2>         at org.apache.lucene.analysis.VocabularyAssert.assertVocabulary(VocabularyAssert.java:47)
>    [junit4]   2>         at org.apache.lucene.analysis.VocabularyAssert.assertVocabulary(VocabularyAssert.java:73)
>    [junit4]   2>         at org.apache.lucene.analysis.snowball.TestSnowballVocab.assertCorrectOutput(TestSnowballVocab.java:80)
>    [junit4]   2>         at org.apache.lucene.analysis.snowball.TestSnowballVocab.testStemmers(TestSnowballVocab.java:45)
>    [junit4]   2>         at sun.reflect.NativeMethodAccessorImpl.invoke0(Native Method)
>    [junit4]   2>         at sun.reflect.NativeMethodAccessorImpl.invoke(NativeMethodAccessorImpl.java:62)
>    [junit4]   2>         at sun.reflect.DelegatingMethodAccessorImpl.invoke(DelegatingMethodAccessorImpl.java:43)
>    [junit4]   2>         at java.lang.reflect.Method.invoke(Method.java:502)
>    [junit4]   2>         at com.carrotsearch.randomizedtesting.RandomizedRunner.invoke(RandomizedRunner.java:1627)
>    [junit4]   2>         at com.carrotsearch.randomizedtesting.RandomizedRunner$6.evaluate(RandomizedRunner.java:836)
>    [junit4]   2>         at com.carrotsearch.randomizedtesting.RandomizedRunner$7.evaluate(RandomizedRunner.java:872)
>    [junit4]   2>         at com.carrotsearch.randomizedtesting.RandomizedRunner$8.evaluate(RandomizedRunner.java:886)
>    [junit4]   2>         at org.apache.lucene.util.TestRuleSetupTeardownChained$1.evaluate(TestRuleSetupTeardownChained.java:50)
>    [junit4]   2>         at org.apache.lucene.util.AbstractBeforeAfterRule$1.evaluate(AbstractBeforeAfterRule.java:46)
>    [junit4]   2>         at org.apache.lucene.util.TestRuleThreadAndTestName$1.evaluate(TestRuleThreadAndTestName.java:49)
>    [junit4]   2>         at org.apache.lucene.util.TestRuleIgnoreAfterMaxFailures$1.evaluate(TestRuleIgnoreAfterMaxFailures.java:65)
>    [junit4]   2>         at org.apache.lucene.util.TestRuleMarkFailure$1.evaluate(TestRuleMarkFailure.java:48)
>    [junit4]   2>         at com.carrotsearch.randomizedtesting.rules.StatementAdapter.evaluate(StatementAdapter.java:36)
>    [junit4]   2>         at com.carrotsearch.randomizedtesting.ThreadLeakControl$StatementRunner.run(ThreadLeakControl.java:365)
>    [junit4]   2>         at com.carrotsearch.randomizedtesting.ThreadLeakControl.forkTimeoutingTask(ThreadLeakControl.java:798)
>    [junit4]   2>         at com.carrotsearch.randomizedtesting.ThreadLeakControl$3.evaluate(ThreadLeakControl.java:458)
>    [junit4]   2>         at com.carrotsearch.randomizedtesting.RandomizedRunner.runSingleTest(RandomizedRunner.java:845)
>    [junit4]   2>         at com.carrotsearch.randomizedtesting.RandomizedRunner$3.evaluate(RandomizedRunner.java:747)
>    [junit4]   2>         at com.carrotsearch.randomizedtesting.RandomizedRunner$4.evaluate(RandomizedRunner.java:781)
>    [junit4]   2>         at com.carrotsearch.randomizedtesting.RandomizedRunner$5.evaluate(RandomizedRunner.java:792)
>    [junit4]   2>         at org.apache.lucene.util.AbstractBeforeAfterRule$1.evaluate(AbstractBeforeAfterRule.java:46)
>    [junit4]   2>         at com.carrotsearch.randomizedtesting.rules.StatementAdapter.evaluate(StatementAdapter.java:36)
>    [junit4]   2>         at org.apache.lucene.util.TestRuleStoreClassName$1.evaluate(TestRuleStoreClassName.java:42)
>    [junit4]   2>         at com.carrotsearch.randomizedtesting.rules.NoShadowingOrOverridesOnMethodsRule$1.evaluate(NoShadowingOrOverridesOnMethodsRule.java:39)
>    [junit4]   2>         at com.carrotsearch.randomizedtesting.rules.NoShadowingOrOverridesOnMethodsRule$1.evaluate(NoShadowingOrOverridesOnMethodsRule.java:39)
>    [junit4]   2>         at com.carrotsearch.randomizedtesting.rules.StatementAdapter.evaluate(StatementAdapter.java:36)
>    [junit4]   2>         at com.carrotsearch.randomizedtesting.rules.StatementAdapter.evaluate(StatementAdapter.java:36)
>    [junit4]   2>         at com.carrotsearch.randomizedtesting.rules.StatementAdapter.evaluate(StatementAdapter.java:36)
>    [junit4]   2>         at org.apache.lucene.util.TestRuleAssertionsRequired$1.evaluate(TestRuleAssertionsRequired.java:54)
>    [junit4]   2>         at org.apache.lucene.util.TestRuleMarkFailure$1.evaluate(TestRuleMarkFailure.java:48)
>    [junit4]   2>         at org.apache.lucene.util.TestRuleIgnoreAfterMaxFailures$1.evaluate(TestRuleIgnoreAfterMaxFailures.java:65)
>    [junit4]   2>         at org.apache.lucene.util.TestRuleIgnoreTestSuites$1.evaluate(TestRuleIgnoreTestSuites.java:55)
>    [junit4]   2>         at com.carrotsearch.randomizedtesting.rules.StatementAdapter.evaluate(StatementAdapter.java:36)
>    [junit4]   2>         at com.carrotsearch.randomizedtesting.ThreadLeakControl$StatementRunner.run(ThreadLeakControl.java:365)
>    [junit4]   2>         at java.lang.Thread.run(Thread.java:745)
>    [junit4]   2> NOTE: reproduce with: ant test  -Dtestcase=TestSnowballVocab -Dtests.method=testStemmers
-Dtests.seed=7FBAD445ED608074 -Dtests.multiplier=3 -Dtests.slow=true -Dtests.locale=it -Dtests.timezone=America/Cordoba
-Dtests.asserts=true -Dtests.file.encoding=US-ASCII
>    [junit4] ERROR   7200s J2 | TestSnowballVocab.testStemmers <<<
>    [junit4]    > Throwable #1: java.lang.Exception: Test abandoned because suite timeout
was reached.
>    [junit4]    >        at __randomizedtesting.SeedInfo.seed([7FBAD445ED608074]:0)
>    [junit4]   2> mag 19, 2015 6:51:40 PM com.carrotsearch.randomizedtesting.ThreadLeakControl
checkThreadLeaks
>    [junit4]   2> WARNING: Will linger awaiting termination of 1 leaked thread(s).
>    [junit4]   2> mag 19, 2015 6:52:00 PM com.carrotsearch.randomizedtesting.ThreadLeakControl
checkThreadLeaks
>    [junit4]   2> SEVERE: 1 thread leaked from SUITE scope at org.apache.lucene.analysis.snowball.TestSnowballVocab:
>    [junit4]   2>    1) Thread[id=149, name=TEST-TestSnowballVocab.testStemmers-seed#[7FBAD445ED608074],
state=RUNNABLE, group=TGRP-TestSnowballVocab]
>    [junit4]   2>         at org.tartarus.snowball.ext.FrenchStemmer.stem(FrenchStemmer.java:1379)
>    [junit4]   2>         at org.apache.lucene.analysis.snowball.SnowballFilter.incrementToken(SnowballFilter.java:95)
>    [junit4]   2>         at org.apache.lucene.analysis.BaseTokenStreamTestCase.checkResetException(BaseTokenStreamTestCase.java:400)
>    [junit4]   2>         at org.apache.lucene.analysis.BaseTokenStreamTestCase.assertAnalyzesTo(BaseTokenStreamTestCase.java:352)
>    [junit4]   2>         at org.apache.lucene.analysis.BaseTokenStreamTestCase.assertAnalyzesTo(BaseTokenStreamTestCase.java:362)
>    [junit4]   2>         at org.apache.lucene.analysis.BaseTokenStreamTestCase.checkOneTerm(BaseTokenStreamTestCase.java:423)
>    [junit4]   2>         at org.apache.lucene.analysis.VocabularyAssert.assertVocabulary(VocabularyAssert.java:47)
>    [junit4]   2>         at org.apache.lucene.analysis.VocabularyAssert.assertVocabulary(VocabularyAssert.java:73)
>    [junit4]   2>         at org.apache.lucene.analysis.snowball.TestSnowballVocab.assertCorrectOutput(TestSnowballVocab.java:80)
>    [junit4]   2>         at org.apache.lucene.analysis.snowball.TestSnowballVocab.testStemmers(TestSnowballVocab.java:45)
>    [junit4]   2>         at sun.reflect.NativeMethodAccessorImpl.invoke0(Native Method)
>    [junit4]   2>         at sun.reflect.NativeMethodAccessorImpl.invoke(NativeMethodAccessorImpl.java:62)
>    [junit4]   2>         at sun.reflect.DelegatingMethodAccessorImpl.invoke(DelegatingMethodAccessorImpl.java:43)
>    [junit4]   2>         at java.lang.reflect.Method.invoke(Method.java:502)
>    [junit4]   2>         at com.carrotsearch.randomizedtesting.RandomizedRunner.invoke(RandomizedRunner.java:1627)
>    [junit4]   2>         at com.carrotsearch.randomizedtesting.RandomizedRunner$6.evaluate(RandomizedRunner.java:836)
>    [junit4]   2>         at com.carrotsearch.randomizedtesting.RandomizedRunner$7.evaluate(RandomizedRunner.java:872)
>    [junit4]   2>         at com.carrotsearch.randomizedtesting.RandomizedRunner$8.evaluate(RandomizedRunner.java:886)
>    [junit4]   2>         at org.apache.lucene.util.TestRuleSetupTeardownChained$1.evaluate(TestRuleSetupTeardownChained.java:50)
>    [junit4]   2>         at org.apache.lucene.util.AbstractBeforeAfterRule$1.evaluate(AbstractBeforeAfterRule.java:46)
>    [junit4]   2>         at org.apache.lucene.util.TestRuleThreadAndTestName$1.evaluate(TestRuleThreadAndTestName.java:49)
>    [junit4]   2>         at org.apache.lucene.util.TestRuleIgnoreAfterMaxFailures$1.evaluate(TestRuleIgnoreAfterMaxFailures.java:65)
>    [junit4]   2>         at org.apache.lucene.util.TestRuleMarkFailure$1.evaluate(TestRuleMarkFailure.java:48)
>    [junit4]   2>         at com.carrotsearch.randomizedtesting.rules.StatementAdapter.evaluate(StatementAdapter.java:36)
>    [junit4]   2>         at com.carrotsearch.randomizedtesting.ThreadLeakControl$StatementRunner.run(ThreadLeakControl.java:365)
>    [junit4]   2>         at com.carrotsearch.randomizedtesting.ThreadLeakControl.forkTimeoutingTask(ThreadLeakControl.java:798)
>    [junit4]   2>         at com.carrotsearch.randomizedtesting.ThreadLeakControl$3.evaluate(ThreadLeakControl.java:458)
>    [junit4]   2>         at com.carrotsearch.randomizedtesting.RandomizedRunner.runSingleTest(RandomizedRunner.java:845)
>    [junit4]   2>         at com.carrotsearch.randomizedtesting.RandomizedRunner$3.evaluate(RandomizedRunner.java:747)
>    [junit4]   2>         at com.carrotsearch.randomizedtesting.RandomizedRunner$4.evaluate(RandomizedRunner.java:781)
>    [junit4]   2>         at com.carrotsearch.randomizedtesting.RandomizedRunner$5.evaluate(RandomizedRunner.java:792)
>    [junit4]   2>         at org.apache.lucene.util.AbstractBeforeAfterRule$1.evaluate(AbstractBeforeAfterRule.java:46)
>    [junit4]   2>         at com.carrotsearch.randomizedtesting.rules.StatementAdapter.evaluate(StatementAdapter.java:36)
>    [junit4]   2>         at org.apache.lucene.util.TestRuleStoreClassName$1.evaluate(TestRuleStoreClassName.java:42)
>    [junit4]   2>         at com.carrotsearch.randomizedtesting.rules.NoShadowingOrOverridesOnMethodsRule$1.evaluate(NoShadowingOrOverridesOnMethodsRule.java:39)
>    [junit4]   2>         at com.carrotsearch.randomizedtesting.rules.NoShadowingOrOverridesOnMethodsRule$1.evaluate(NoShadowingOrOverridesOnMethodsRule.java:39)
>    [junit4]   2>         at com.carrotsearch.randomizedtesting.rules.StatementAdapter.evaluate(StatementAdapter.java:36)
>    [junit4]   2>         at com.carrotsearch.randomizedtesting.rules.StatementAdapter.evaluate(StatementAdapter.java:36)
>    [junit4]   2>         at com.carrotsearch.randomizedtesting.rules.StatementAdapter.evaluate(StatementAdapter.java:36)
>    [junit4]   2>         at org.apache.lucene.util.TestRuleAssertionsRequired$1.evaluate(TestRuleAssertionsRequired.java:54)
>    [junit4]   2>         at org.apache.lucene.util.TestRuleMarkFailure$1.evaluate(TestRuleMarkFailure.java:48)
>    [junit4]   2>         at org.apache.lucene.util.TestRuleIgnoreAfterMaxFailures$1.evaluate(TestRuleIgnoreAfterMaxFailures.java:65)
>    [junit4]   2>         at org.apache.lucene.util.TestRuleIgnoreTestSuites$1.evaluate(TestRuleIgnoreTestSuites.java:55)
>    [junit4]   2>         at com.carrotsearch.randomizedtesting.rules.StatementAdapter.evaluate(StatementAdapter.java:36)
>    [junit4]   2>         at com.carrotsearch.randomizedtesting.ThreadLeakControl$StatementRunner.run(ThreadLeakControl.java:365)
>    [junit4]   2>         at java.lang.Thread.run(Thread.java:745)
>    [junit4]   2> mag 19, 2015 6:52:00 PM com.carrotsearch.randomizedtesting.ThreadLeakControl
tryToInterruptAll
>    [junit4]   2> INFO: Starting to interrupt leaked threads:
>    [junit4]   2>    1) Thread[id=149, name=TEST-TestSnowballVocab.testStemmers-seed#[7FBAD445ED608074],
state=RUNNABLE, group=TGRP-TestSnowballVocab]
>    [junit4]   2> mag 19, 2015 6:52:03 PM com.carrotsearch.randomizedtesting.ThreadLeakControl
tryToInterruptAll
>    [junit4]   2> SEVERE: There are still zombie threads that couldn't be terminated:
>    [junit4]   2>    1) Thread[id=149, name=TEST-TestSnowballVocab.testStemmers-seed#[7FBAD445ED608074],
state=RUNNABLE, group=TGRP-TestSnowballVocab]
>    [junit4]   2>         at org.tartarus.snowball.ext.FrenchStemmer.stem(FrenchStemmer.java:1379)
>    [junit4]   2>         at org.apache.lucene.analysis.snowball.SnowballFilter.incrementToken(SnowballFilter.java:95)
>    [junit4]   2>         at org.apache.lucene.analysis.BaseTokenStreamTestCase.checkResetException(BaseTokenStreamTestCase.java:400)
>    [junit4]   2>         at org.apache.lucene.analysis.BaseTokenStreamTestCase.assertAnalyzesTo(BaseTokenStreamTestCase.java:352)
>    [junit4]   2>         at org.apache.lucene.analysis.BaseTokenStreamTestCase.assertAnalyzesTo(BaseTokenStreamTestCase.java:362)
>    [junit4]   2>         at org.apache.lucene.analysis.BaseTokenStreamTestCase.checkOneTerm(BaseTokenStreamTestCase.java:423)
>    [junit4]   2>         at org.apache.lucene.analysis.VocabularyAssert.assertVocabulary(VocabularyAssert.java:47)
>    [junit4]   2>         at org.apache.lucene.analysis.VocabularyAssert.assertVocabulary(VocabularyAssert.java:73)
>    [junit4]   2>         at org.apache.lucene.analysis.snowball.TestSnowballVocab.assertCorrectOutput(TestSnowballVocab.java:80)
>    [junit4]   2>         at org.apache.lucene.analysis.snowball.TestSnowballVocab.testStemmers(TestSnowballVocab.java:45)
>    [junit4]   2>         at sun.reflect.NativeMethodAccessorImpl.invoke0(Native Method)
>    [junit4]   2>         at sun.reflect.NativeMethodAccessorImpl.invoke(NativeMethodAccessorImpl.java:62)
>    [junit4]   2>         at sun.reflect.DelegatingMethodAccessorImpl.invoke(DelegatingMethodAccessorImpl.java:43)
>    [junit4]   2>         at java.lang.reflect.Method.invoke(Method.java:502)
>    [junit4]   2>         at com.carrotsearch.randomizedtesting.RandomizedRunner.invoke(RandomizedRunner.java:1627)
>    [junit4]   2>         at com.carrotsearch.randomizedtesting.RandomizedRunner$6.evaluate(RandomizedRunner.java:836)
>    [junit4]   2>         at com.carrotsearch.randomizedtesting.RandomizedRunner$7.evaluate(RandomizedRunner.java:872)
>    [junit4]   2>         at com.carrotsearch.randomizedtesting.RandomizedRunner$8.evaluate(RandomizedRunner.java:886)
>    [junit4]   2>         at org.apache.lucene.util.TestRuleSetupTeardownChained$1.evaluate(TestRuleSetupTeardownChained.java:50)
>    [junit4]   2>         at org.apache.lucene.util.AbstractBeforeAfterRule$1.evaluate(AbstractBeforeAfterRule.java:46)
>    [junit4]   2>         at org.apache.lucene.util.TestRuleThreadAndTestName$1.evaluate(TestRuleThreadAndTestName.java:49)
>    [junit4]   2>         at org.apache.lucene.util.TestRuleIgnoreAfterMaxFailures$1.evaluate(TestRuleIgnoreAfterMaxFailures.java:65)
>    [junit4]   2>         at org.apache.lucene.util.TestRuleMarkFailure$1.evaluate(TestRuleMarkFailure.java:48)
>    [junit4]   2>         at com.carrotsearch.randomizedtesting.rules.StatementAdapter.evaluate(StatementAdapter.java:36)
>    [junit4]   2>         at com.carrotsearch.randomizedtesting.ThreadLeakControl$StatementRunner.run(ThreadLeakControl.java:365)
>    [junit4]   2>         at com.carrotsearch.randomizedtesting.ThreadLeakControl.forkTimeoutingTask(ThreadLeakControl.java:798)
>    [junit4]   2>         at com.carrotsearch.randomizedtesting.ThreadLeakControl$3.evaluate(ThreadLeakControl.java:458)
>    [junit4]   2>         at com.carrotsearch.randomizedtesting.RandomizedRunner.runSingleTest(RandomizedRunner.java:845)
>    [junit4]   2>         at com.carrotsearch.randomizedtesting.RandomizedRunner$3.evaluate(RandomizedRunner.java:747)
>    [junit4]   2>         at com.carrotsearch.randomizedtesting.RandomizedRunner$4.evaluate(RandomizedRunner.java:781)
>    [junit4]   2>         at com.carrotsearch.randomizedtesting.RandomizedRunner$5.evaluate(RandomizedRunner.java:792)
>    [junit4]   2>         at org.apache.lucene.util.AbstractBeforeAfterRule$1.evaluate(AbstractBeforeAfterRule.java:46)
>    [junit4]   2>         at com.carrotsearch.randomizedtesting.rules.StatementAdapter.evaluate(StatementAdapter.java:36)
>    [junit4]   2>         at org.apache.lucene.util.TestRuleStoreClassName$1.evaluate(TestRuleStoreClassName.java:42)
>    [junit4]   2>         at com.carrotsearch.randomizedtesting.rules.NoShadowingOrOverridesOnMethodsRule$1.evaluate(NoShadowingOrOverridesOnMethodsRule.java:39)
>    [junit4]   2>         at com.carrotsearch.randomizedtesting.rules.NoShadowingOrOverridesOnMethodsRule$1.evaluate(NoShadowingOrOverridesOnMethodsRule.java:39)
>    [junit4]   2>         at com.carrotsearch.randomizedtesting.rules.StatementAdapter.evaluate(StatementAdapter.java:36)
>    [junit4]   2>         at com.carrotsearch.randomizedtesting.rules.StatementAdapter.evaluate(StatementAdapter.java:36)
>    [junit4]   2>         at com.carrotsearch.randomizedtesting.rules.StatementAdapter.evaluate(StatementAdapter.java:36)
>    [junit4]   2>         at org.apache.lucene.util.TestRuleAssertionsRequired$1.evaluate(TestRuleAssertionsRequired.java:54)
>    [junit4]   2>         at org.apache.lucene.util.TestRuleMarkFailure$1.evaluate(TestRuleMarkFailure.java:48)
>    [junit4]   2>         at org.apache.lucene.util.TestRuleIgnoreAfterMaxFailures$1.evaluate(TestRuleIgnoreAfterMaxFailures.java:65)
>    [junit4]   2>         at org.apache.lucene.util.TestRuleIgnoreTestSuites$1.evaluate(TestRuleIgnoreTestSuites.java:55)
>    [junit4]   2>         at com.carrotsearch.randomizedtesting.rules.StatementAdapter.evaluate(StatementAdapter.java:36)
>    [junit4]   2>         at com.carrotsearch.randomizedtesting.ThreadLeakControl$StatementRunner.run(ThreadLeakControl.java:365)
>    [junit4]   2>         at java.lang.Thread.run(Thread.java:745)
>    [junit4]   2> NOTE: test params are: codec=Asserting(Lucene50): {}, docValues:{},
sim=RandomSimilarityProvider(queryNorm=true,coord=no): {}, locale=it, timezone=America/Cordoba
>    [junit4]   2> NOTE: Linux 3.13.0-52-generic amd64/Oracle Corporation 1.9.0-ea (64-bit)/cpus=12,threads=2,free=245344712,total=530579456
>    [junit4]   2> NOTE: All tests run in this JVM: [TestCondition2, TestHyphenatedWordsFilter,
TestUAX29URLEmailAnalyzer, TestFrenchLightStemFilter, TokenRangeSinkTokenizerTest, TestCJKAnalyzer,
TestOnlyInCompound, TestDutchAnalyzer, TestEmptyTokenStream, Test64kAffixes, TestIndonesianStemmer,
TestItalianLightStemFilterFactory, TestTurkishLowerCaseFilterFactory, TestRandomChains, TestBasqueAnalyzer,
TestArabicNormalizationFilter, TestNorwegianMinimalStemFilterFactory, TestCaseInsensitive,
TestGermanMinimalStemFilterFactory, TestDanishAnalyzer, TestStemmerOverrideFilter, TestKStemFilterFactory,
TestHunspellStemFilter, TestCustomAnalyzer, TestCJKWidthFilter, TestScandinavianNormalizationFilterFactory,
TestArmenianAnalyzer, TestHTMLStripCharFilterFactory, TestFullStrip, NGramTokenizerTest, TestGermanLightStemFilter,
TestDictionaryCompoundWordTokenFilterFactory, TestSynonymFilterFactory, CommonGramsFilterTest,
TestHomonyms, TestSnowballVocab]
>    [junit4]   2> NOTE: reproduce with: ant test  -Dtestcase=TestSnowballVocab -Dtests.seed=7FBAD445ED608074
-Dtests.multiplier=3 -Dtests.slow=true -Dtests.locale=it -Dtests.timezone=America/Cordoba
-Dtests.asserts=true -Dtests.file.encoding=US-ASCII
>    [junit4] ERROR   0.00s J2 | TestSnowballVocab (suite) <<<
>    [junit4]    > Throwable #1: java.lang.Exception: Suite timeout exceeded (>=
7200000 msec).
>    [junit4]    >        at __randomizedtesting.SeedInfo.seed([7FBAD445ED608074]:0)
>    [junit4] Completed [261/270] on J2 in 7223.12s, 1 test, 2 errors <<< FAILURES!
>
> [...truncated 39 lines...]
> BUILD FAILED
> /home/jenkins/workspace/Lucene-Solr-trunk-Linux/build.xml:526: The following error occurred
while executing this line:
> /home/jenkins/workspace/Lucene-Solr-trunk-Linux/build.xml:474: The following error occurred
while executing this line:
> /home/jenkins/workspace/Lucene-Solr-trunk-Linux/build.xml:61: The following error occurred
while executing this line:
> /home/jenkins/workspace/Lucene-Solr-trunk-Linux/extra-targets.xml:39: The following error
occurred while executing this line:
> /home/jenkins/workspace/Lucene-Solr-trunk-Linux/lucene/build.xml:466: The following error
occurred while executing this line:
> /home/jenkins/workspace/Lucene-Solr-trunk-Linux/lucene/common-build.xml:2145: The following
error occurred while executing this line:
> /home/jenkins/workspace/Lucene-Solr-trunk-Linux/lucene/analysis/build.xml:106: The following
error occurred while executing this line:
> /home/jenkins/workspace/Lucene-Solr-trunk-Linux/lucene/analysis/build.xml:38: The following
error occurred while executing this line:
> /home/jenkins/workspace/Lucene-Solr-trunk-Linux/lucene/module-build.xml:58: The following
error occurred while executing this line:
> /home/jenkins/workspace/Lucene-Solr-trunk-Linux/lucene/common-build.xml:1415: The following
error occurred while executing this line:
> /home/jenkins/workspace/Lucene-Solr-trunk-Linux/lucene/common-build.xml:973: There were
test failures: 270 suites, 1376 tests, 1 suite-level error, 1 error, 40 ignored
>
> Total time: 129 minutes 18 seconds
> Build step 'Invoke Ant' marked build as failure
> Archiving artifacts
> Recording test results
> Email was triggered for: Failure - Any
> Sending email for trigger: Failure - Any
>
>
>
>
> ---------------------------------------------------------------------
> To unsubscribe, e-mail: dev-unsubscribe@lucene.apache.org
> For additional commands, e-mail: dev-help@lucene.apache.org

---------------------------------------------------------------------
To unsubscribe, e-mail: dev-unsubscribe@lucene.apache.org
For additional commands, e-mail: dev-help@lucene.apache.org


Mime
View raw message