lucene-dev mailing list archives

Site index · List index
Message view « Date » · « Thread »
Top « Date » · « Thread »
From Policeman Jenkins Server <jenk...@thetaphi.de>
Subject [JENKINS] Lucene-Solr-trunk-Linux (64bit/jdk1.8.0_45) - Build # 12752 - Still Failing!
Date Wed, 20 May 2015 06:14:42 GMT
Build: http://jenkins.thetaphi.de/job/Lucene-Solr-trunk-Linux/12752/
Java: 64bit/jdk1.8.0_45 -XX:+UseCompressedOops -XX:+UseConcMarkSweepGC

1 tests failed.
FAILED:  org.apache.solr.client.solrj.impl.CloudSolrClientTest.test

Error Message:
There should be 3 documents because there should be two id=1 docs due to overwrite=false expected:<3> but was:<1>

Stack Trace:
java.lang.AssertionError: There should be 3 documents because there should be two id=1 docs due to overwrite=false expected:<3> but was:<1>
	at __randomizedtesting.SeedInfo.seed([5C6E96F65C4695B7:D43AA92CF2BAF84F]:0)
	at org.junit.Assert.fail(Assert.java:93)
	at org.junit.Assert.failNotEquals(Assert.java:647)
	at org.junit.Assert.assertEquals(Assert.java:128)
	at org.junit.Assert.assertEquals(Assert.java:472)
	at org.apache.solr.client.solrj.impl.CloudSolrClientTest.testOverwriteOption(CloudSolrClientTest.java:171)
	at org.apache.solr.client.solrj.impl.CloudSolrClientTest.test(CloudSolrClientTest.java:129)
	at sun.reflect.NativeMethodAccessorImpl.invoke0(Native Method)
	at sun.reflect.NativeMethodAccessorImpl.invoke(NativeMethodAccessorImpl.java:62)
	at sun.reflect.DelegatingMethodAccessorImpl.invoke(DelegatingMethodAccessorImpl.java:43)
	at java.lang.reflect.Method.invoke(Method.java:497)
	at com.carrotsearch.randomizedtesting.RandomizedRunner.invoke(RandomizedRunner.java:1627)
	at com.carrotsearch.randomizedtesting.RandomizedRunner$6.evaluate(RandomizedRunner.java:836)
	at com.carrotsearch.randomizedtesting.RandomizedRunner$7.evaluate(RandomizedRunner.java:872)
	at com.carrotsearch.randomizedtesting.RandomizedRunner$8.evaluate(RandomizedRunner.java:886)
	at org.junit.rules.ExpectedException$ExpectedExceptionStatement.evaluate(ExpectedException.java:110)
	at org.apache.solr.BaseDistributedSearchTestCase$ShardsRepeatRule$ShardsFixedStatement.callStatement(BaseDistributedSearchTestCase.java:960)
	at org.apache.solr.BaseDistributedSearchTestCase$ShardsRepeatRule$ShardsStatement.evaluate(BaseDistributedSearchTestCase.java:935)
	at com.carrotsearch.randomizedtesting.rules.SystemPropertiesRestoreRule$1.evaluate(SystemPropertiesRestoreRule.java:57)
	at org.apache.lucene.util.TestRuleSetupTeardownChained$1.evaluate(TestRuleSetupTeardownChained.java:50)
	at org.apache.lucene.util.AbstractBeforeAfterRule$1.evaluate(AbstractBeforeAfterRule.java:46)
	at org.apache.lucene.util.TestRuleThreadAndTestName$1.evaluate(TestRuleThreadAndTestName.java:49)
	at org.apache.lucene.util.TestRuleIgnoreAfterMaxFailures$1.evaluate(TestRuleIgnoreAfterMaxFailures.java:65)
	at org.apache.lucene.util.TestRuleMarkFailure$1.evaluate(TestRuleMarkFailure.java:48)
	at com.carrotsearch.randomizedtesting.rules.StatementAdapter.evaluate(StatementAdapter.java:36)
	at com.carrotsearch.randomizedtesting.ThreadLeakControl$StatementRunner.run(ThreadLeakControl.java:365)
	at com.carrotsearch.randomizedtesting.ThreadLeakControl.forkTimeoutingTask(ThreadLeakControl.java:798)
	at com.carrotsearch.randomizedtesting.ThreadLeakControl$3.evaluate(ThreadLeakControl.java:458)
	at com.carrotsearch.randomizedtesting.RandomizedRunner.runSingleTest(RandomizedRunner.java:845)
	at com.carrotsearch.randomizedtesting.RandomizedRunner$3.evaluate(RandomizedRunner.java:747)
	at com.carrotsearch.randomizedtesting.RandomizedRunner$4.evaluate(RandomizedRunner.java:781)
	at com.carrotsearch.randomizedtesting.RandomizedRunner$5.evaluate(RandomizedRunner.java:792)
	at com.carrotsearch.randomizedtesting.rules.StatementAdapter.evaluate(StatementAdapter.java:36)
	at com.carrotsearch.randomizedtesting.rules.SystemPropertiesRestoreRule$1.evaluate(SystemPropertiesRestoreRule.java:57)
	at org.apache.lucene.util.AbstractBeforeAfterRule$1.evaluate(AbstractBeforeAfterRule.java:46)
	at com.carrotsearch.randomizedtesting.rules.StatementAdapter.evaluate(StatementAdapter.java:36)
	at org.apache.lucene.util.TestRuleStoreClassName$1.evaluate(TestRuleStoreClassName.java:42)
	at com.carrotsearch.randomizedtesting.rules.NoShadowingOrOverridesOnMethodsRule$1.evaluate(NoShadowingOrOverridesOnMethodsRule.java:39)
	at com.carrotsearch.randomizedtesting.rules.NoShadowingOrOverridesOnMethodsRule$1.evaluate(NoShadowingOrOverridesOnMethodsRule.java:39)
	at com.carrotsearch.randomizedtesting.rules.StatementAdapter.evaluate(StatementAdapter.java:36)
	at com.carrotsearch.randomizedtesting.rules.StatementAdapter.evaluate(StatementAdapter.java:36)
	at com.carrotsearch.randomizedtesting.rules.StatementAdapter.evaluate(StatementAdapter.java:36)
	at org.apache.lucene.util.TestRuleAssertionsRequired$1.evaluate(TestRuleAssertionsRequired.java:54)
	at org.apache.lucene.util.TestRuleMarkFailure$1.evaluate(TestRuleMarkFailure.java:48)
	at org.apache.lucene.util.TestRuleIgnoreAfterMaxFailures$1.evaluate(TestRuleIgnoreAfterMaxFailures.java:65)
	at org.apache.lucene.util.TestRuleIgnoreTestSuites$1.evaluate(TestRuleIgnoreTestSuites.java:55)
	at com.carrotsearch.randomizedtesting.rules.StatementAdapter.evaluate(StatementAdapter.java:36)
	at com.carrotsearch.randomizedtesting.ThreadLeakControl$StatementRunner.run(ThreadLeakControl.java:365)
	at java.lang.Thread.run(Thread.java:745)




Build Log:
[...truncated 11273 lines...]
   [junit4] Suite: org.apache.solr.client.solrj.impl.CloudSolrClientTest
   [junit4]   2> Creating dataDir: /home/jenkins/workspace/Lucene-Solr-trunk-Linux/solr/build/solr-solrj/test/J1/temp/solr.client.solrj.impl.CloudSolrClientTest 5C6E96F65C4695B7-001/init-core-data-001
   [junit4]   2> 41440 T164 oas.SolrTestCaseJ4.buildSSLConfig Randomized ssl (true) and clientAuth (false)
   [junit4]   2> 41440 T164 oas.BaseDistributedSearchTestCase.initHostContext Setting hostContext system property: /_t/t
   [junit4]   2> 41442 T164 oasc.AbstractZkTestCase.<clinit> WARN TEST_HOME() does not exist - solrj test?
   [junit4]   2> 41463 T164 oasc.ZkTestServer.run STARTING ZK TEST SERVER
   [junit4]   2> 41465 T165 oasc.ZkTestServer$2$1.setClientPort client port:0.0.0.0/0.0.0.0:0
   [junit4]   2> 41465 T165 oasc.ZkTestServer$ZKServerMain.runFromConfig Starting server
   [junit4]   2> 41565 T164 oasc.ZkTestServer.run start zk server on port:53283
   [junit4]   2> 41595 T164 oascc.SolrZkClient.createZkCredentialsToAddAutomatically Using default ZkCredentialsProvider
   [junit4]   2> 41651 T164 oascc.ConnectionManager.waitForConnected Waiting for client to connect to ZooKeeper
   [junit4]   2> 41699 T172 oascc.ConnectionManager.process Watcher org.apache.solr.common.cloud.ConnectionManager@40828686 name:ZooKeeperConnection Watcher:127.0.0.1:53283 got event WatchedEvent state:SyncConnected type:None path:null path:null type:None
   [junit4]   2> 41700 T164 oascc.ConnectionManager.waitForConnected Client is connected to ZooKeeper
   [junit4]   2> 41700 T164 oascc.SolrZkClient.createZkACLProvider Using default ZkACLProvider
   [junit4]   2> 41702 T164 oascc.SolrZkClient.makePath makePath: /solr
   [junit4]   2> 41731 T164 oascc.SolrZkClient.createZkCredentialsToAddAutomatically Using default ZkCredentialsProvider
   [junit4]   2> 41749 T164 oascc.ConnectionManager.waitForConnected Waiting for client to connect to ZooKeeper
   [junit4]   2> 41755 T166 oazs.NIOServerCnxn.doIO WARN caught end of stream exception EndOfStreamException: Unable to read additional data from client sessionid 0x14d6ff44f4f0000, likely client has closed socket
   [junit4]   2> 	at org.apache.zookeeper.server.NIOServerCnxn.doIO(NIOServerCnxn.java:228)
   [junit4]   2> 	at org.apache.zookeeper.server.NIOServerCnxnFactory.run(NIOServerCnxnFactory.java:208)
   [junit4]   2> 	at java.lang.Thread.run(Thread.java:745)
   [junit4]   2> 
   [junit4]   2> 41760 T175 oascc.ConnectionManager.process Watcher org.apache.solr.common.cloud.ConnectionManager@5b355664 name:ZooKeeperConnection Watcher:127.0.0.1:53283/solr got event WatchedEvent state:SyncConnected type:None path:null path:null type:None
   [junit4]   2> 41760 T164 oascc.ConnectionManager.waitForConnected Client is connected to ZooKeeper
   [junit4]   2> 41761 T164 oascc.SolrZkClient.createZkACLProvider Using default ZkACLProvider
   [junit4]   2> 41765 T164 oascc.SolrZkClient.makePath makePath: /collections/collection1
   [junit4]   2> 41769 T164 oascc.SolrZkClient.makePath makePath: /collections/collection1/shards
   [junit4]   2> 41773 T164 oascc.SolrZkClient.makePath makePath: /collections/control_collection
   [junit4]   2> 41780 T164 oascc.SolrZkClient.makePath makePath: /collections/control_collection/shards
   [junit4]   2> 41783 T164 oasc.AbstractZkTestCase.putConfig put /home/jenkins/workspace/Lucene-Solr-trunk-Linux/solr/solrj/src/test-files/solrj/solr/collection1/conf/solrconfig.xml to /configs/conf1/solrconfig.xml
   [junit4]   2> 41784 T164 oascc.SolrZkClient.makePath makePath: /configs/conf1/solrconfig.xml
   [junit4]   2> 41787 T164 oasc.AbstractZkTestCase.putConfig put /home/jenkins/workspace/Lucene-Solr-trunk-Linux/solr/solrj/src/test-files/solrj/solr/collection1/conf/schema.xml to /configs/conf1/schema.xml
   [junit4]   2> 41788 T164 oascc.SolrZkClient.makePath makePath: /configs/conf1/schema.xml
   [junit4]   2> 41809 T164 oasc.AbstractZkTestCase.putConfig skipping /home/jenkins/workspace/Lucene-Solr-trunk-Linux/solr/solrj/src/test-files/solrj/solr/collection1/conf/solrconfig.snippet.randomindexconfig.xml because it doesn't exist
   [junit4]   2> 41809 T164 oasc.AbstractZkTestCase.putConfig skipping /home/jenkins/workspace/Lucene-Solr-trunk-Linux/solr/solrj/src/test-files/solrj/solr/collection1/conf/stopwords.txt because it doesn't exist
   [junit4]   2> 41810 T164 oasc.AbstractZkTestCase.putConfig skipping /home/jenkins/workspace/Lucene-Solr-trunk-Linux/solr/solrj/src/test-files/solrj/solr/collection1/conf/protwords.txt because it doesn't exist
   [junit4]   2> 41810 T164 oasc.AbstractZkTestCase.putConfig skipping /home/jenkins/workspace/Lucene-Solr-trunk-Linux/solr/solrj/src/test-files/solrj/solr/collection1/conf/currency.xml because it doesn't exist
   [junit4]   2> 41810 T164 oasc.AbstractZkTestCase.putConfig skipping /home/jenkins/workspace/Lucene-Solr-trunk-Linux/solr/solrj/src/test-files/solrj/solr/collection1/conf/enumsConfig.xml because it doesn't exist
   [junit4]   2> 41810 T164 oasc.AbstractZkTestCase.putConfig skipping /home/jenkins/workspace/Lucene-Solr-trunk-Linux/solr/solrj/src/test-files/solrj/solr/collection1/conf/open-exchange-rates.json because it doesn't exist
   [junit4]   2> 41811 T164 oasc.AbstractZkTestCase.putConfig skipping /home/jenkins/workspace/Lucene-Solr-trunk-Linux/solr/solrj/src/test-files/solrj/solr/collection1/conf/mapping-ISOLatin1Accent.txt because it doesn't exist
   [junit4]   2> 41811 T164 oasc.AbstractZkTestCase.putConfig skipping /home/jenkins/workspace/Lucene-Solr-trunk-Linux/solr/solrj/src/test-files/solrj/solr/collection1/conf/old_synonyms.txt because it doesn't exist
   [junit4]   2> 41823 T164 oasc.AbstractZkTestCase.putConfig skipping /home/jenkins/workspace/Lucene-Solr-trunk-Linux/solr/solrj/src/test-files/solrj/solr/collection1/conf/synonyms.txt because it doesn't exist
   [junit4]   2> 41833 T164 oascc.SolrZkClient.createZkCredentialsToAddAutomatically Using default ZkCredentialsProvider
   [junit4]   2> 41849 T164 oascc.ConnectionManager.waitForConnected Waiting for client to connect to ZooKeeper
   [junit4]   2> 41857 T178 oascc.ConnectionManager.process Watcher org.apache.solr.common.cloud.ConnectionManager@5d9f938a name:ZooKeeperConnection Watcher:127.0.0.1:53283/solr got event WatchedEvent state:SyncConnected type:None path:null path:null type:None
   [junit4]   2> 41858 T164 oascc.ConnectionManager.waitForConnected Client is connected to ZooKeeper
   [junit4]   2> 41858 T164 oascc.SolrZkClient.createZkACLProvider Using default ZkACLProvider
   [junit4]   2> 41874 T164 oas.SolrTestCaseJ4.writeCoreProperties Writing core.properties file to /home/jenkins/workspace/Lucene-Solr-trunk-Linux/solr/build/solr-solrj/test/J1/temp/solr.client.solrj.impl.CloudSolrClientTest 5C6E96F65C4695B7-001/control-001/cores/collection1
   [junit4]   2> 41900 T164 oejs.Server.doStart jetty-9.2.10.v20150310
   [junit4]   2> 41902 T164 oejsh.ContextHandler.doStart Started o.e.j.s.ServletContextHandler@6dc35689{/_t/t,null,AVAILABLE}
   [junit4]   2> 42065 T164 oejs.AbstractConnector.doStart Started ServerConnector@5c70bf3d{SSL-http/1.1}{127.0.0.1:34292}
   [junit4]   2> 42065 T164 oejs.Server.doStart Started @43251ms
   [junit4]   2> 42065 T164 oascse.JettySolrRunner$1.lifeCycleStarted Jetty properties: {solr.data.dir=/home/jenkins/workspace/Lucene-Solr-trunk-Linux/solr/build/solr-solrj/test/J1/temp/solr.client.solrj.impl.CloudSolrClientTest 5C6E96F65C4695B7-001/tempDir-001/control/data, hostContext=/_t/t, hostPort=34292, coreRootDirectory=/home/jenkins/workspace/Lucene-Solr-trunk-Linux/solr/build/solr-solrj/test/J1/../../../../../../../../../home/jenkins/workspace/Lucene-Solr-trunk-Linux/solr/build/solr-solrj/test/J1/temp/solr.client.solrj.impl.CloudSolrClientTest 5C6E96F65C4695B7-001/control-001/cores}
   [junit4]   2> 42068 T164 oass.SolrDispatchFilter.init SolrDispatchFilter.init()sun.misc.Launcher$AppClassLoader@659e0bfd
   [junit4]   2> 42068 T164 oasc.SolrResourceLoader.<init> new SolrResourceLoader for directory: '/home/jenkins/workspace/Lucene-Solr-trunk-Linux/solr/build/solr-solrj/test/J1/../../../../../../../../../home/jenkins/workspace/Lucene-Solr-trunk-Linux/solr/build/solr-solrj/test/J1/temp/solr.client.solrj.impl.CloudSolrClientTest 5C6E96F65C4695B7-001/control-001/'
   [junit4]   2> 42080 T164 oasc.SolrXmlConfig.fromFile Loading container configuration from /home/jenkins/workspace/Lucene-Solr-trunk-Linux/solr/build/solr-solrj/test/J1/../../../../../../../../../home/jenkins/workspace/Lucene-Solr-trunk-Linux/solr/build/solr-solrj/test/J1/temp/solr.client.solrj.impl.CloudSolrClientTest 5C6E96F65C4695B7-001/control-001/solr.xml
   [junit4]   2> 42085 T164 oasc.CorePropertiesLocator.<init> Config-defined core root directory: /home/jenkins/workspace/Lucene-Solr-trunk-Linux/solr/build/solr-solrj/test/J1/../../../../../../../../../home/jenkins/workspace/Lucene-Solr-trunk-Linux/solr/build/solr-solrj/test/J1/temp/solr.client.solrj.impl.CloudSolrClientTest 5C6E96F65C4695B7-001/control-001/cores
   [junit4]   2> 42085 T164 oasc.CoreContainer.<init> New CoreContainer 1042175509
   [junit4]   2> 42086 T164 oasc.CoreContainer.load Loading cores into CoreContainer [instanceDir=/home/jenkins/workspace/Lucene-Solr-trunk-Linux/solr/build/solr-solrj/test/J1/../../../../../../../../../home/jenkins/workspace/Lucene-Solr-trunk-Linux/solr/build/solr-solrj/test/J1/temp/solr.client.solrj.impl.CloudSolrClientTest 5C6E96F65C4695B7-001/control-001/]
   [junit4]   2> 42086 T164 oasc.CoreContainer.load loading shared library: /home/jenkins/workspace/Lucene-Solr-trunk-Linux/solr/build/solr-solrj/test/J1/../../../../../../../../../home/jenkins/workspace/Lucene-Solr-trunk-Linux/solr/build/solr-solrj/test/J1/temp/solr.client.solrj.impl.CloudSolrClientTest 5C6E96F65C4695B7-001/control-001/lib
   [junit4]   2> 42086 T164 oasc.SolrResourceLoader.addToClassLoader WARN Can't find (or read) directory to add to classloader: lib (resolved as: /home/jenkins/workspace/Lucene-Solr-trunk-Linux/solr/build/solr-solrj/test/J1/../../../../../../../../../home/jenkins/workspace/Lucene-Solr-trunk-Linux/solr/build/solr-solrj/test/J1/temp/solr.client.solrj.impl.CloudSolrClientTest 5C6E96F65C4695B7-001/control-001/lib).
   [junit4]   2> 42092 T164 oashc.HttpShardHandlerFactory.init created with socketTimeout : 90000,urlScheme : ,connTimeout : 15000,maxConnectionsPerHost : 20,maxConnections : 10000,corePoolSize : 0,maximumPoolSize : 2147483647,maxThreadIdleTime : 5,sizeOfQueue : -1,fairnessPolicy : false,useRetries : false,
   [junit4]   2> 42095 T164 oasu.UpdateShardHandler.<init> Creating UpdateShardHandler HTTP client with params: socketTimeout=340000&connTimeout=45000&retry=true
   [junit4]   2> 42097 T164 oasl.LogWatcher.createWatcher SLF4J impl is org.slf4j.impl.Log4jLoggerFactory
   [junit4]   2> 42097 T164 oasl.LogWatcher.newRegisteredLogWatcher Registering Log Listener [Log4j (org.slf4j.impl.Log4jLoggerFactory)]
   [junit4]   2> 42097 T164 oasc.CoreContainer.load Node Name: 127.0.0.1
   [junit4]   2> 42097 T164 oasc.ZkContainer.initZooKeeper Zookeeper client=127.0.0.1:53283/solr
   [junit4]   2> 42110 T164 oasc.ZkController.checkChrootPath zkHost includes chroot
   [junit4]   2> 42110 T164 oascc.SolrZkClient.createZkCredentialsToAddAutomatically Using default ZkCredentialsProvider
   [junit4]   2> 42111 T164 oascc.ConnectionManager.waitForConnected Waiting for client to connect to ZooKeeper
   [junit4]   2> 42128 T192 oascc.ConnectionManager.process Watcher org.apache.solr.common.cloud.ConnectionManager@c9605ac name:ZooKeeperConnection Watcher:127.0.0.1:53283 got event WatchedEvent state:SyncConnected type:None path:null path:null type:None
   [junit4]   2> 42131 T164 oascc.ConnectionManager.waitForConnected Client is connected to ZooKeeper
   [junit4]   2> 42132 T164 oascc.SolrZkClient.createZkACLProvider Using default ZkACLProvider
   [junit4]   2> 42143 T164 n:127.0.0.1:34292__t%2Ft oascc.ConnectionManager.waitForConnected Waiting for client to connect to ZooKeeper
   [junit4]   2> 42155 T195 n:127.0.0.1:34292__t%2Ft oascc.ConnectionManager.process Watcher org.apache.solr.common.cloud.ConnectionManager@5f72aaed name:ZooKeeperConnection Watcher:127.0.0.1:53283/solr got event WatchedEvent state:SyncConnected type:None path:null path:null type:None
   [junit4]   2> 42156 T164 n:127.0.0.1:34292__t%2Ft oascc.ConnectionManager.waitForConnected Client is connected to ZooKeeper
   [junit4]   2> 42170 T164 n:127.0.0.1:34292__t%2Ft oascc.SolrZkClient.makePath makePath: /overseer/queue
   [junit4]   2> 42180 T164 n:127.0.0.1:34292__t%2Ft oascc.SolrZkClient.makePath makePath: /overseer/collection-queue-work
   [junit4]   2> 42185 T164 n:127.0.0.1:34292__t%2Ft oascc.SolrZkClient.makePath makePath: /overseer/collection-map-running
   [junit4]   2> 42188 T164 n:127.0.0.1:34292__t%2Ft oascc.SolrZkClient.makePath makePath: /overseer/collection-map-completed
   [junit4]   2> 42202 T164 n:127.0.0.1:34292__t%2Ft oascc.SolrZkClient.makePath makePath: /overseer/collection-map-failure
   [junit4]   2> 42213 T164 n:127.0.0.1:34292__t%2Ft oascc.SolrZkClient.makePath makePath: /live_nodes
   [junit4]   2> 42216 T164 n:127.0.0.1:34292__t%2Ft oascc.SolrZkClient.makePath makePath: /aliases.json
   [junit4]   2> 42221 T164 n:127.0.0.1:34292__t%2Ft oascc.SolrZkClient.makePath makePath: /clusterstate.json
   [junit4]   2> 42222 T164 n:127.0.0.1:34292__t%2Ft oasc.ZkController.createEphemeralLiveNode Register node as live in ZooKeeper:/live_nodes/127.0.0.1:34292__t%2Ft
   [junit4]   2> 42225 T164 n:127.0.0.1:34292__t%2Ft oascc.SolrZkClient.makePath makePath: /live_nodes/127.0.0.1:34292__t%2Ft
   [junit4]   2> 42233 T164 n:127.0.0.1:34292__t%2Ft oascc.SolrZkClient.makePath makePath: /overseer_elect
   [junit4]   2> 42236 T164 n:127.0.0.1:34292__t%2Ft oascc.SolrZkClient.makePath makePath: /overseer_elect/election
   [junit4]   2> 42240 T164 n:127.0.0.1:34292__t%2Ft oasc.Overseer.close Overseer (id=null) closing
   [junit4]   2> 42262 T164 n:127.0.0.1:34292__t%2Ft oasc.OverseerElectionContext.runLeaderProcess I am going to be the leader 127.0.0.1:34292__t%2Ft
   [junit4]   2> 42262 T164 n:127.0.0.1:34292__t%2Ft oascc.SolrZkClient.makePath makePath: /overseer_elect/leader
   [junit4]   2> 42265 T164 n:127.0.0.1:34292__t%2Ft oasc.Overseer.start Overseer (id=93854262337929220-127.0.0.1:34292__t%2Ft-n_0000000000) starting
   [junit4]   2> 42273 T164 n:127.0.0.1:34292__t%2Ft oascc.SolrZkClient.makePath makePath: /overseer/queue-work
   [junit4]   2> 42296 T164 n:127.0.0.1:34292__t%2Ft oasc.OverseerAutoReplicaFailoverThread.<init> Starting OverseerAutoReplicaFailoverThread autoReplicaFailoverWorkLoopDelay=10000 autoReplicaFailoverWaitAfterExpiration=30000 autoReplicaFailoverBadNodeExpiration=60000
   [junit4]   2> 42301 T197 n:127.0.0.1:34292__t%2Ft oasc.OverseerCollectionProcessor.run Process current queue of collection creations
   [junit4]   2> 42302 T196 n:127.0.0.1:34292__t%2Ft oasc.Overseer$ClusterStateUpdater.run Starting to work on the main queue
   [junit4]   2> 42307 T164 n:127.0.0.1:34292__t%2Ft oascc.ZkStateReader.createClusterStateWatchersAndUpdate Updating cluster state from ZooKeeper... 
   [junit4]   2> 42320 T164 n:127.0.0.1:34292__t%2Ft oasc.CoreContainer.initializeAuthenticationPlugin No authentication plugin used.
   [junit4]   2> 42321 T164 n:127.0.0.1:34292__t%2Ft oasc.CoreContainer.intializeAuthorizationPlugin Security conf doesn't exist. Skipping setup for authorization module.
   [junit4]   2> 42321 T164 n:127.0.0.1:34292__t%2Ft oasc.CorePropertiesLocator.discover Looking for core definitions underneath /home/jenkins/workspace/Lucene-Solr-trunk-Linux/solr/build/solr-solrj/test/J1/../../../../../../../../../home/jenkins/workspace/Lucene-Solr-trunk-Linux/solr/build/solr-solrj/test/J1/temp/solr.client.solrj.impl.CloudSolrClientTest 5C6E96F65C4695B7-001/control-001/cores
   [junit4]   2> 42324 T164 n:127.0.0.1:34292__t%2Ft oasc.CoreDescriptor.<init> CORE DESCRIPTOR: {name=collection1, config=solrconfig.xml, transient=false, schema=schema.xml, loadOnStartup=true, instanceDir=/home/jenkins/workspace/Lucene-Solr-trunk-Linux/solr/build/solr-solrj/test/J1/../../../../../../../../../home/jenkins/workspace/Lucene-Solr-trunk-Linux/solr/build/solr-solrj/test/J1/temp/solr.client.solrj.impl.CloudSolrClientTest 5C6E96F65C4695B7-001/control-001/cores/collection1, collection=control_collection, absoluteInstDir=/home/jenkins/workspace/Lucene-Solr-trunk-Linux/solr/build/solr-solrj/test/J1/../../../../../../../../../home/jenkins/workspace/Lucene-Solr-trunk-Linux/solr/build/solr-solrj/test/J1/temp/solr.client.solrj.impl.CloudSolrClientTest 5C6E96F65C4695B7-001/control-001/cores/collection1/, coreNodeName=, dataDir=data/, shard=}
   [junit4]   2> 42325 T164 n:127.0.0.1:34292__t%2Ft oasc.CorePropertiesLocator.discoverUnder Found core collection1 in /home/jenkins/workspace/Lucene-Solr-trunk-Linux/solr/build/solr-solrj/test/J1/../../../../../../../../../home/jenkins/workspace/Lucene-Solr-trunk-Linux/solr/build/solr-solrj/test/J1/temp/solr.client.solrj.impl.CloudSolrClientTest 5C6E96F65C4695B7-001/control-001/cores/collection1/
   [junit4]   2> 42325 T164 n:127.0.0.1:34292__t%2Ft oasc.CorePropertiesLocator.discover Found 1 core definitions
   [junit4]   2> 42328 T199 n:127.0.0.1:34292__t%2Ft c:control_collection x:collection1 oasc.ZkController.publish publishing core=collection1 state=down collection=control_collection
   [junit4]   2> 42328 T199 n:127.0.0.1:34292__t%2Ft c:control_collection x:collection1 oasc.ZkController.publish numShards not found on descriptor - reading it from system property
   [junit4]   2> 42333 T199 n:127.0.0.1:34292__t%2Ft oasc.ZkController.waitForCoreNodeName look for our core node name
   [junit4]   2> 42334 T195 n:127.0.0.1:34292__t%2Ft oasc.DistributedQueue$LatchWatcher.process NodeChildrenChanged fired on path /overseer/queue state SyncConnected
   [junit4]   2> 42336 T196 n:127.0.0.1:34292__t%2Ft oasc.Overseer$ClusterStateUpdater.run processMessage: queueSize: 1, message = {
   [junit4]   2> 	  "core":"collection1",
   [junit4]   2> 	  "roles":null,
   [junit4]   2> 	  "base_url":"https://127.0.0.1:34292/_t/t",
   [junit4]   2> 	  "node_name":"127.0.0.1:34292__t%2Ft",
   [junit4]   2> 	  "numShards":"1",
   [junit4]   2> 	  "state":"down",
   [junit4]   2> 	  "shard":null,
   [junit4]   2> 	  "collection":"control_collection",
   [junit4]   2> 	  "operation":"state"} current state version: 0
   [junit4]   2> 42348 T196 n:127.0.0.1:34292__t%2Ft oasco.ReplicaMutator.updateState Update state numShards=1 message={
   [junit4]   2> 	  "core":"collection1",
   [junit4]   2> 	  "roles":null,
   [junit4]   2> 	  "base_url":"https://127.0.0.1:34292/_t/t",
   [junit4]   2> 	  "node_name":"127.0.0.1:34292__t%2Ft",
   [junit4]   2> 	  "numShards":"1",
   [junit4]   2> 	  "state":"down",
   [junit4]   2> 	  "shard":null,
   [junit4]   2> 	  "collection":"control_collection",
   [junit4]   2> 	  "operation":"state"}
   [junit4]   2> 42350 T196 n:127.0.0.1:34292__t%2Ft oasco.ClusterStateMutator.createCollection building a new cName: control_collection
   [junit4]   2> 42359 T196 n:127.0.0.1:34292__t%2Ft oasco.ReplicaMutator.updateState Assigning new node to shard shard=shard1
   [junit4]   2> 42367 T195 n:127.0.0.1:34292__t%2Ft oascc.ZkStateReader$2.process A cluster state change: WatchedEvent state:SyncConnected type:NodeDataChanged path:/clusterstate.json, has occurred - updating... (live nodes size: 1)
   [junit4]   2> 43334 T199 n:127.0.0.1:34292__t%2Ft oasc.ZkController.waitForShardId waiting to find shard id in clusterstate for collection1
   [junit4]   2> 43334 T199 n:127.0.0.1:34292__t%2Ft oasc.ZkController.createCollectionZkNode Check for collection zkNode:control_collection
   [junit4]   2> 43335 T199 n:127.0.0.1:34292__t%2Ft oasc.ZkController.createCollectionZkNode Collection zkNode exists
   [junit4]   2> 43335 T199 n:127.0.0.1:34292__t%2Ft oascc.ZkStateReader.readConfigName Load collection config from:/collections/control_collection
   [junit4]   2> 43336 T199 n:127.0.0.1:34292__t%2Ft oascc.ZkStateReader.readConfigName path=/collections/control_collection configName=conf1 specified config exists in ZooKeeper
   [junit4]   2> 43336 T199 n:127.0.0.1:34292__t%2Ft oasc.SolrResourceLoader.<init> new SolrResourceLoader for directory: '/home/jenkins/workspace/Lucene-Solr-trunk-Linux/solr/build/solr-solrj/test/J1/../../../../../../../../../home/jenkins/workspace/Lucene-Solr-trunk-Linux/solr/build/solr-solrj/test/J1/temp/solr.client.solrj.impl.CloudSolrClientTest 5C6E96F65C4695B7-001/control-001/cores/collection1/'
   [junit4]   2> 43349 T199 n:127.0.0.1:34292__t%2Ft oasc.Config.<init> loaded config solrconfig.xml with version 0 
   [junit4]   2> 43353 T199 n:127.0.0.1:34292__t%2Ft oasc.SolrConfig.refreshRequestParams current version of requestparams : -1
   [junit4]   2> 43362 T199 n:127.0.0.1:34292__t%2Ft oasc.SolrConfig.<init> Using Lucene MatchVersion: 6.0.0
   [junit4]   2> 43367 T199 n:127.0.0.1:34292__t%2Ft oasc.SolrConfig.<init> Loaded SolrConfig: solrconfig.xml
   [junit4]   2> 43370 T199 n:127.0.0.1:34292__t%2Ft oass.IndexSchema.readSchema Reading Solr Schema from /configs/conf1/schema.xml
   [junit4]   2> 43374 T199 n:127.0.0.1:34292__t%2Ft oass.IndexSchema.readSchema [collection1] Schema name=test
   [junit4]   2> 43429 T199 n:127.0.0.1:34292__t%2Ft oass.IndexSchema.readSchema default search field in schema is text
   [junit4]   2> 43430 T199 n:127.0.0.1:34292__t%2Ft oass.IndexSchema.readSchema unique key field: id
   [junit4]   2> 43431 T199 n:127.0.0.1:34292__t%2Ft oass.IndexSchema.loadCopyFields WARN Field lowerfilt1and2 is not multivalued and destination for multiple copyFields (2)
   [junit4]   2> 43431 T199 n:127.0.0.1:34292__t%2Ft oass.IndexSchema.loadCopyFields WARN Field text is not multivalued and destination for multiple copyFields (3)
   [junit4]   2> 43431 T199 n:127.0.0.1:34292__t%2Ft oasc.CoreContainer.create Creating SolrCore 'collection1' using configuration from collection control_collection
   [junit4]   2> 43432 T199 n:127.0.0.1:34292__t%2Ft x:collection1 oasc.SolrCore.initDirectoryFactory org.apache.solr.core.MockDirectoryFactory
   [junit4]   2> 43432 T199 n:127.0.0.1:34292__t%2Ft x:collection1 oasc.SolrCore.<init> [[collection1] ] Opening new SolrCore at [/home/jenkins/workspace/Lucene-Solr-trunk-Linux/solr/build/solr-solrj/test/J1/../../../../../../../../../home/jenkins/workspace/Lucene-Solr-trunk-Linux/solr/build/solr-solrj/test/J1/temp/solr.client.solrj.impl.CloudSolrClientTest 5C6E96F65C4695B7-001/control-001/cores/collection1/], dataDir=[null]
   [junit4]   2> 43432 T199 n:127.0.0.1:34292__t%2Ft x:collection1 oasc.SolrCore.initInfoRegistry JMX monitoring not detected for core: collection1
   [junit4]   2> 43433 T199 n:127.0.0.1:34292__t%2Ft x:collection1 oasc.CachingDirectoryFactory.get return new directory for /home/jenkins/workspace/Lucene-Solr-trunk-Linux/solr/build/solr-solrj/test/J1/../../../../../../../../../home/jenkins/workspace/Lucene-Solr-trunk-Linux/solr/build/solr-solrj/test/J1/temp/solr.client.solrj.impl.CloudSolrClientTest 5C6E96F65C4695B7-001/control-001/cores/collection1/data
   [junit4]   2> 43433 T199 n:127.0.0.1:34292__t%2Ft x:collection1 oasc.SolrCore.getNewIndexDir New index directory detected: old=null new=/home/jenkins/workspace/Lucene-Solr-trunk-Linux/solr/build/solr-solrj/test/J1/../../../../../../../../../home/jenkins/workspace/Lucene-Solr-trunk-Linux/solr/build/solr-solrj/test/J1/temp/solr.client.solrj.impl.CloudSolrClientTest 5C6E96F65C4695B7-001/control-001/cores/collection1/data/index/
   [junit4]   2> 43433 T199 n:127.0.0.1:34292__t%2Ft x:collection1 oasc.SolrCore.initIndex WARN [collection1] Solr index directory '/home/jenkins/workspace/Lucene-Solr-trunk-Linux/solr/build/solr-solrj/test/J1/../../../../../../../../../home/jenkins/workspace/Lucene-Solr-trunk-Linux/solr/build/solr-solrj/test/J1/temp/solr.client.solrj.impl.CloudSolrClientTest 5C6E96F65C4695B7-001/control-001/cores/collection1/data/index' doesn't exist. Creating new index...
   [junit4]   2> 43433 T199 n:127.0.0.1:34292__t%2Ft x:collection1 oasc.CachingDirectoryFactory.get return new directory for /home/jenkins/workspace/Lucene-Solr-trunk-Linux/solr/build/solr-solrj/test/J1/../../../../../../../../../home/jenkins/workspace/Lucene-Solr-trunk-Linux/solr/build/solr-solrj/test/J1/temp/solr.client.solrj.impl.CloudSolrClientTest 5C6E96F65C4695B7-001/control-001/cores/collection1/data/index
   [junit4]   2> 43434 T199 n:127.0.0.1:34292__t%2Ft x:collection1 oasc.SolrDeletionPolicy.onCommit SolrDeletionPolicy.onCommit: commits: num=1
   [junit4]   2> 		commit{dir=MockDirectoryWrapper(RAMDirectory@49e00ed5 lockFactory=org.apache.lucene.store.SingleInstanceLockFactory@5adb844a),segFN=segments_1,generation=1}
   [junit4]   2> 43434 T199 n:127.0.0.1:34292__t%2Ft x:collection1 oasc.SolrDeletionPolicy.updateCommits newest commit generation = 1
   [junit4]   2> 43436 T199 n:127.0.0.1:34292__t%2Ft x:collection1 oasc.SolrCore.loadUpdateProcessorChains no updateRequestProcessorChain defined as default, creating implicit default
   [junit4]   2> 43438 T199 n:127.0.0.1:34292__t%2Ft x:collection1 oashl.XMLLoader.init xsltCacheLifetimeSeconds=60
   [junit4]   2> 43438 T199 n:127.0.0.1:34292__t%2Ft x:collection1 oashl.XMLLoader.init xsltCacheLifetimeSeconds=60
   [junit4]   2> 43439 T199 n:127.0.0.1:34292__t%2Ft x:collection1 oashl.XMLLoader.init xsltCacheLifetimeSeconds=60
   [junit4]   2> 43440 T199 n:127.0.0.1:34292__t%2Ft x:collection1 oashl.XMLLoader.init xsltCacheLifetimeSeconds=60
   [junit4]   2> 43440 T199 n:127.0.0.1:34292__t%2Ft x:collection1 oasc.PluginBag.createPlugin requestHandler : '/replication' created with startup=lazy 
   [junit4]   2> 43441 T199 n:127.0.0.1:34292__t%2Ft x:collection1 oasc.SolrResourceLoader.findClass WARN Solr loaded a deprecated plugin/analysis class [org.apache.solr.handler.admin.AdminHandlers]. Please consult documentation how to replace it accordingly.
   [junit4]   2> 43442 T199 n:127.0.0.1:34292__t%2Ft x:collection1 oasc.SolrResourceLoader.findClass WARN Solr loaded a deprecated plugin/analysis class [org.apache.solr.handler.admin.AdminHandlers]. Please consult documentation how to replace it accordingly.
   [junit4]   2> 43442 T199 n:127.0.0.1:34292__t%2Ft x:collection1 oasc.RequestHandlers.initHandlersFromConfig Registered paths: /admin/mbeans,standard,,/update/csv,/update/json/docs,/admin/luke,/admin/segments,/get,/admin/system,/replication,/admin/properties,/config,/schema,/admin/plugins,/admin/logging,/update/json,/admin,/admin/threads,/admin/ping,/update,/admin/file
   [junit4]   2> 43442 T199 n:127.0.0.1:34292__t%2Ft x:collection1 oasc.RequestHandlers.initHandlersFromConfig WARN no default request handler is registered (either '/select' or 'standard')
   [junit4]   2> 43442 T199 n:127.0.0.1:34292__t%2Ft x:collection1 oasc.SolrCore.initStatsCache Using default statsCache cache: org.apache.solr.search.stats.LocalStatsCache
   [junit4]   2> 43443 T199 n:127.0.0.1:34292__t%2Ft x:collection1 oasu.UpdateHandler.<init> Using UpdateLog implementation: org.apache.solr.update.UpdateLog
   [junit4]   2> 43443 T199 n:127.0.0.1:34292__t%2Ft x:collection1 oasu.UpdateLog.init Initializing UpdateLog: dataDir= defaultSyncLevel=FLUSH numRecordsToKeep=100 maxNumLogsToKeep=10
   [junit4]   2> 43444 T199 n:127.0.0.1:34292__t%2Ft x:collection1 oasu.CommitTracker.<init> Hard AutoCommit: disabled
   [junit4]   2> 43444 T199 n:127.0.0.1:34292__t%2Ft x:collection1 oasu.CommitTracker.<init> Soft AutoCommit: disabled
   [junit4]   2> 43444 T199 n:127.0.0.1:34292__t%2Ft x:collection1 oasc.SolrDeletionPolicy.onInit SolrDeletionPolicy.onInit: commits: num=1
   [junit4]   2> 		commit{dir=MockDirectoryWrapper(RAMDirectory@49e00ed5 lockFactory=org.apache.lucene.store.SingleInstanceLockFactory@5adb844a),segFN=segments_1,generation=1}
   [junit4]   2> 43444 T199 n:127.0.0.1:34292__t%2Ft x:collection1 oasc.SolrDeletionPolicy.updateCommits newest commit generation = 1
   [junit4]   2> 43445 T199 n:127.0.0.1:34292__t%2Ft x:collection1 oass.SolrIndexSearcher.<init> Opening Searcher@725b6fe[collection1] main
   [junit4]   2> 43445 T199 n:127.0.0.1:34292__t%2Ft x:collection1 oascc.ZkStateReader.readConfigName Load collection config from:/collections/control_collection
   [junit4]   2> 43446 T199 n:127.0.0.1:34292__t%2Ft x:collection1 oascc.ZkStateReader.readConfigName path=/collections/control_collection configName=conf1 specified config exists in ZooKeeper
   [junit4]   2> 43446 T199 n:127.0.0.1:34292__t%2Ft x:collection1 oasr.ManagedResourceStorage.newStorageIO Setting up ZooKeeper-based storage for the RestManager with znodeBase: /configs/conf1
   [junit4]   2> 43449 T199 n:127.0.0.1:34292__t%2Ft x:collection1 oasr.ManagedResourceStorage$ZooKeeperStorageIO.configure Configured ZooKeeperStorageIO with znodeBase: /configs/conf1
   [junit4]   2> 43449 T199 n:127.0.0.1:34292__t%2Ft x:collection1 oasr.RestManager.init Initializing RestManager with initArgs: {}
   [junit4]   2> 43449 T199 n:127.0.0.1:34292__t%2Ft x:collection1 oasr.ManagedResourceStorage.load Reading _rest_managed.json using ZooKeeperStorageIO:path=/configs/conf1
   [junit4]   2> 43450 T199 n:127.0.0.1:34292__t%2Ft x:collection1 oasr.ManagedResourceStorage$ZooKeeperStorageIO.openInputStream No data found for znode /configs/conf1/_rest_managed.json
   [junit4]   2> 43450 T199 n:127.0.0.1:34292__t%2Ft x:collection1 oasr.ManagedResourceStorage.load Loaded null at path _rest_managed.json using ZooKeeperStorageIO:path=/configs/conf1
   [junit4]   2> 43450 T199 n:127.0.0.1:34292__t%2Ft x:collection1 oasr.RestManager.init Initializing 0 registered ManagedResources
   [junit4]   2> 43451 T199 n:127.0.0.1:34292__t%2Ft x:collection1 oasha.AdminHandlers.inform WARN <requestHandler name="/admin/" 
   [junit4]   2> 	 class="solr.admin.AdminHandlers" /> is deprecated . It is not required anymore
   [junit4]   2> 43451 T200 n:127.0.0.1:34292__t%2Ft x:collection1 oasc.SolrCore.registerSearcher [collection1] Registered new searcher Searcher@725b6fe[collection1] main{ExitableDirectoryReader(UninvertingDirectoryReader())}
   [junit4]   2> 43452 T199 n:127.0.0.1:34292__t%2Ft x:collection1 oasc.ZkController.getConfDirListeners watch zkdir /configs/conf1
   [junit4]   2> 43454 T199 n:127.0.0.1:34292__t%2Ft x:collection1 oasc.CoreContainer.registerCore registering core: collection1
   [junit4]   2> 43455 T203 n:127.0.0.1:34292__t%2Ft c:control_collection s:shard1 x:collection1 oasc.ZkController.register Register replica - core:collection1 address:https://127.0.0.1:34292/_t/t collection:control_collection shard:shard1
   [junit4]   2> 43456 T164 n:127.0.0.1:34292__t%2Ft oass.SolrDispatchFilter.init user.dir=/home/jenkins/workspace/Lucene-Solr-trunk-Linux/solr/build/solr-solrj/test/J1
   [junit4]   2> 43456 T164 n:127.0.0.1:34292__t%2Ft oass.SolrDispatchFilter.init SolrDispatchFilter.init() done
   [junit4]   2> 43464 T164 oascc.SolrZkClient.createZkCredentialsToAddAutomatically Using default ZkCredentialsProvider
   [junit4]   2> 43465 T164 oascc.ConnectionManager.waitForConnected Waiting for client to connect to ZooKeeper
   [junit4]   2> 43466 T206 oascc.ConnectionManager.process Watcher org.apache.solr.common.cloud.ConnectionManager@4309390d name:ZooKeeperConnection Watcher:127.0.0.1:53283/solr got event WatchedEvent state:SyncConnected type:None path:null path:null type:None
   [junit4]   2> 43467 T164 oascc.ConnectionManager.waitForConnected Client is connected to ZooKeeper
   [junit4]   2> 43467 T203 n:127.0.0.1:34292__t%2Ft c:control_collection s:shard1 x:collection1 oascc.SolrZkClient.makePath makePath: /collections/control_collection/leader_elect/shard1/election
   [junit4]   2> 43467 T164 oascc.SolrZkClient.createZkACLProvider Using default ZkACLProvider
   [junit4]   2> 43467 T164 oascc.ZkStateReader.createClusterStateWatchersAndUpdate Updating cluster state from ZooKeeper... 
   [junit4]   2> 43471 T203 n:127.0.0.1:34292__t%2Ft c:control_collection s:shard1 x:collection1 oasc.ShardLeaderElectionContext.runLeaderProcess Running the leader process for shard shard1
   [junit4]   2> 43472 T164 oasc.ChaosMonkey.monkeyLog monkey: init - expire sessions:false cause connection loss:false
   [junit4]   2> 43473 T195 n:127.0.0.1:34292__t%2Ft oasc.DistributedQueue$LatchWatcher.process NodeChildrenChanged fired on path /overseer/queue state SyncConnected
   [junit4]   2> 43473 T203 n:127.0.0.1:34292__t%2Ft c:control_collection s:shard1 x:collection1 oasc.ShardLeaderElectionContext.waitForReplicasToComeUp Enough replicas found to continue.
   [junit4]   2> 43473 T203 n:127.0.0.1:34292__t%2Ft c:control_collection s:shard1 x:collection1 oasc.ShardLeaderElectionContext.runLeaderProcess I may be the new leader - try and sync
   [junit4]   2> ASYNC  NEW_CORE C16 name=collection1 org.apache.solr.core.SolrCore@621cdace url=https://127.0.0.1:34292/_t/t/collection1 node=127.0.0.1:34292__t%2Ft C16_STATE=coll:control_collection core:collection1 props:{core=collection1, base_url=https://127.0.0.1:34292/_t/t, node_name=127.0.0.1:34292__t%2Ft, state=down}
   [junit4]   2> 43474 T203 n:127.0.0.1:34292__t%2Ft c:control_collection s:shard1 x:collection1 C16 oasc.SyncStrategy.sync Sync replicas to https://127.0.0.1:34292/_t/t/collection1/
   [junit4]   2> 43474 T203 n:127.0.0.1:34292__t%2Ft c:control_collection s:shard1 x:collection1 C16 oasc.SyncStrategy.syncReplicas Sync Success - now sync replicas to me
   [junit4]   2> 43475 T203 n:127.0.0.1:34292__t%2Ft c:control_collection s:shard1 x:collection1 C16 oasc.SyncStrategy.syncToMe https://127.0.0.1:34292/_t/t/collection1/ has no replicas
   [junit4]   2> 43476 T196 n:127.0.0.1:34292__t%2Ft oasc.Overseer$ClusterStateUpdater.run processMessage: queueSize: 1, message = {
   [junit4]   2> 	  "operation":"leader",
   [junit4]   2> 	  "shard":"shard1",
   [junit4]   2> 	  "collection":"control_collection"} current state version: 1
   [junit4]   2> 43476 T203 n:127.0.0.1:34292__t%2Ft c:control_collection s:shard1 x:collection1 oasc.ShardLeaderElectionContext.runLeaderProcess I am the new leader: https://127.0.0.1:34292/_t/t/collection1/ shard1
   [junit4]   2> 43491 T203 n:127.0.0.1:34292__t%2Ft c:control_collection s:shard1 x:collection1 oascc.SolrZkClient.makePath makePath: /collections/control_collection/leaders/shard1
   [junit4]   2> 43502 T195 n:127.0.0.1:34292__t%2Ft oasc.DistributedQueue$LatchWatcher.process NodeChildrenChanged fired on path /overseer/queue state SyncConnected
   [junit4]   2> 43503 T196 n:127.0.0.1:34292__t%2Ft oasc.Overseer$ClusterStateUpdater.run processMessage: queueSize: 1, message = {
   [junit4]   2> 	  "operation":"leader",
   [junit4]   2> 	  "shard":"shard1",
   [junit4]   2> 	  "collection":"control_collection",
   [junit4]   2> 	  "base_url":"https://127.0.0.1:34292/_t/t",
   [junit4]   2> 	  "core":"collection1",
   [junit4]   2> 	  "state":"active"} current state version: 1
   [junit4]   2> 43504 T164 oas.SolrTestCaseJ4.writeCoreProperties Writing core.properties file to /home/jenkins/workspace/Lucene-Solr-trunk-Linux/solr/build/solr-solrj/test/J1/temp/solr.client.solrj.impl.CloudSolrClientTest 5C6E96F65C4695B7-001/shard-1-001/cores/collection1
   [junit4]   2> 43505 T164 oasc.AbstractFullDistribZkTestBase.createJettys create jetty 1 in directory /home/jenkins/workspace/Lucene-Solr-trunk-Linux/solr/build/solr-solrj/test/J1/temp/solr.client.solrj.impl.CloudSolrClientTest 5C6E96F65C4695B7-001/shard-1-001
   [junit4]   2> 43506 T164 oejs.Server.doStart jetty-9.2.10.v20150310
   [junit4]   2> 43507 T164 oejsh.ContextHandler.doStart Started o.e.j.s.ServletContextHandler@dc2f023{/_t/t,null,AVAILABLE}
   [junit4]   2> 43514 T164 oejs.AbstractConnector.doStart Started ServerConnector@7b776c6{SSL-http/1.1}{127.0.0.1:36995}
   [junit4]   2> 43514 T164 oejs.Server.doStart Started @44700ms
   [junit4]   2> 43514 T164 oascse.JettySolrRunner$1.lifeCycleStarted Jetty properties: {solr.data.dir=/home/jenkins/workspace/Lucene-Solr-trunk-Linux/solr/build/solr-solrj/test/J1/temp/solr.client.solrj.impl.CloudSolrClientTest 5C6E96F65C4695B7-001/tempDir-001/jetty1, solrconfig=solrconfig.xml, hostContext=/_t/t, hostPort=36995, coreRootDirectory=/home/jenkins/workspace/Lucene-Solr-trunk-Linux/solr/build/solr-solrj/test/J1/temp/solr.client.solrj.impl.CloudSolrClientTest 5C6E96F65C4695B7-001/shard-1-001/cores}
   [junit4]   2> 43515 T164 oass.SolrDispatchFilter.init SolrDispatchFilter.init()sun.misc.Launcher$AppClassLoader@659e0bfd
   [junit4]   2> 43515 T164 oasc.SolrResourceLoader.<init> new SolrResourceLoader for directory: '/home/jenkins/workspace/Lucene-Solr-trunk-Linux/solr/build/solr-solrj/test/J1/temp/solr.client.solrj.impl.CloudSolrClientTest 5C6E96F65C4695B7-001/shard-1-001/'
   [junit4]   2> 43523 T164 oasc.SolrXmlConfig.fromFile Loading container configuration from /home/jenkins/workspace/Lucene-Solr-trunk-Linux/solr/build/solr-solrj/test/J1/temp/solr.client.solrj.impl.CloudSolrClientTest 5C6E96F65C4695B7-001/shard-1-001/solr.xml
   [junit4]   2> 43526 T164 oasc.CorePropertiesLocator.<init> Config-defined core root directory: /home/jenkins/workspace/Lucene-Solr-trunk-Linux/solr/build/solr-solrj/test/J1/temp/solr.client.solrj.impl.CloudSolrClientTest 5C6E96F65C4695B7-001/shard-1-001/cores
   [junit4]   2> 43527 T164 oasc.CoreContainer.<init> New CoreContainer 1042381502
   [junit4]   2> 43527 T164 oasc.CoreContainer.load Loading cores into CoreContainer [instanceDir=/home/jenkins/workspace/Lucene-Solr-trunk-Linux/solr/build/solr-solrj/test/J1/temp/solr.client.solrj.impl.CloudSolrClientTest 5C6E96F65C4695B7-001/shard-1-001/]
   [junit4]   2> 43527 T164 oasc.CoreContainer.load loading shared library: /home/jenkins/workspace/Lucene-Solr-trunk-Linux/solr/build/solr-solrj/test/J1/temp/solr.client.solrj.impl.CloudSolrClientTest 5C6E96F65C4695B7-001/shard-1-001/lib
   [junit4]   2> 43527 T164 oasc.SolrResourceLoader.addToClassLoader WARN Can't find (or read) directory to add to classloader: lib (resolved as: /home/jenkins/workspace/Lucene-Solr-trunk-Linux/solr/build/solr-solrj/test/J1/temp/solr.client.solrj.impl.CloudSolrClientTest 5C6E96F65C4695B7-001/shard-1-001/lib).
   [junit4]   2> 43531 T164 oashc.HttpShardHandlerFactory.init created with socketTimeout : 90000,urlScheme : ,connTimeout : 15000,maxConnectionsPerHost : 20,maxConnections : 10000,corePoolSize : 0,maximumPoolSize : 2147483647,maxThreadIdleTime : 5,sizeOfQueue : -1,fairnessPolicy : false,useRetries : false,
   [junit4]   2> 43533 T164 oasu.UpdateShardHandler.<init> Creating UpdateShardHandler HTTP client with params: socketTimeout=340000&connTimeout=45000&retry=true
   [junit4]   2> 43534 T164 oasl.LogWatcher.createWatcher SLF4J impl is org.slf4j.impl.Log4jLoggerFactory
   [junit4]   2> 43535 T164 oasl.LogWatcher.newRegisteredLogWatcher Registering Log Listener [Log4j (org.slf4j.impl.Log4jLoggerFactory)]
   [junit4]   2> 43535 T164 oasc.CoreContainer.load Node Name: 127.0.0.1
   [junit4]   2> 43535 T164 oasc.ZkContainer.initZooKeeper Zookeeper client=127.0.0.1:53283/solr
   [junit4]   2> 43535 T164 oasc.ZkController.checkChrootPath zkHost includes chroot
   [junit4]   2> 43535 T164 oascc.SolrZkClient.createZkCredentialsToAddAutomatically Using default ZkCredentialsProvider
   [junit4]   2> 43536 T164 oascc.ConnectionManager.waitForConnected Waiting for client to connect to ZooKeeper
   [junit4]   2> 43538 T220 oascc.ConnectionManager.process Watcher org.apache.solr.common.cloud.ConnectionManager@32ac31b6 name:ZooKeeperConnection Watcher:127.0.0.1:53283 got event WatchedEvent state:SyncConnected type:None path:null path:null type:None
   [junit4]   2> 43538 T164 oascc.ConnectionManager.waitForConnected Client is connected to ZooKeeper
   [junit4]   2> 43538 T164 oascc.SolrZkClient.createZkACLProvider Using default ZkACLProvider
   [junit4]   2> 43540 T164 n:127.0.0.1:36995__t%2Ft oascc.ConnectionManager.waitForConnected Waiting for client to connect to ZooKeeper
   [junit4]   2> 43542 T223 n:127.0.0.1:36995__t%2Ft oascc.ConnectionManager.process Watcher org.apache.solr.common.cloud.ConnectionManager@506e11b1 name:ZooKeeperConnection Watcher:127.0.0.1:53283/solr got event WatchedEvent state:SyncConnected type:None path:null path:null type:None
   [junit4]   2> 43542 T164 n:127.0.0.1:36995__t%2Ft oascc.ConnectionManager.waitForConnected Client is connected to ZooKeeper
   [junit4]   2> 43547 T164 n:127.0.0.1:36995__t%2Ft oascc.ZkStateReader.createClusterStateWatchersAndUpdate Updating cluster state from ZooKeeper... 
   [junit4]   2> 43606 T206 oascc.ZkStateReader$2.process A cluster state change: WatchedEvent state:SyncConnected type:NodeDataChanged path:/clusterstate.json, has occurred - updating... (live nodes size: 1)
   [junit4]   2> 43606 T223 n:127.0.0.1:36995__t%2Ft oascc.ZkStateReader$2.process A cluster state change: WatchedEvent state:SyncConnected type:NodeDataChanged path:/clusterstate.json, has occurred - updating... (live nodes size: 1)
   [junit4]   2> 43606 T195 n:127.0.0.1:34292__t%2Ft oascc.ZkStateReader$2.process A cluster state change: WatchedEvent state:SyncConnected type:NodeDataChanged path:/clusterstate.json, has occurred - updating... (live nodes size: 1)
   [junit4]   2> 43653 T203 n:127.0.0.1:34292__t%2Ft c:control_collection s:shard1 x:collection1 oasc.ZkController.register We are https://127.0.0.1:34292/_t/t/collection1/ and leader is https://127.0.0.1:34292/_t/t/collection1/
   [junit4]   2> 43653 T203 n:127.0.0.1:34292__t%2Ft c:control_collection s:shard1 x:collection1 oasc.ZkController.register No LogReplay needed for core=collection1 baseURL=https://127.0.0.1:34292/_t/t
   [junit4]   2> 43653 T203 n:127.0.0.1:34292__t%2Ft c:control_collection s:shard1 x:collection1 oasc.ZkController.checkRecovery I am the leader, no recovery necessary
   [junit4]   2> 43653 T203 n:127.0.0.1:34292__t%2Ft c:control_collection s:shard1 x:collection1 oasc.ZkController.publish publishing core=collection1 state=active collection=control_collection
   [junit4]   2> 43653 T203 n:127.0.0.1:34292__t%2Ft c:control_collection s:shard1 x:collection1 oasc.ZkController.publish numShards not found on descriptor - reading it from system property
   [junit4]   2> 43655 T195 n:127.0.0.1:34292__t%2Ft oasc.DistributedQueue$LatchWatcher.process NodeChildrenChanged fired on path /overseer/queue state SyncConnected
   [junit4]   2> 43655 T196 n:127.0.0.1:34292__t%2Ft oasc.Overseer$ClusterStateUpdater.run processMessage: queueSize: 1, message = {
   [junit4]   2> 	  "core":"collection1",
   [junit4]   2> 	  "core_node_name":"core_node1",
   [junit4]   2> 	  "roles":null,
   [junit4]   2> 	  "base_url":"https://127.0.0.1:34292/_t/t",
   [junit4]   2> 	  "node_name":"127.0.0.1:34292__t%2Ft",
   [junit4]   2> 	  "numShards":"2",
   [junit4]   2> 	  "state":"active",
   [junit4]   2> 	  "shard":"shard1",
   [junit4]   2> 	  "collection":"control_collection",
   [junit4]   2> 	  "operation":"state"} current state version: 2
   [junit4]   2> 43656 T196 n:127.0.0.1:34292__t%2Ft oasco.ReplicaMutator.updateState Update state numShards=2 message={
   [junit4]   2> 	  "core":"collection1",
   [junit4]   2> 	  "core_node_name":"core_node1",
   [junit4]   2> 	  "roles":null,
   [junit4]   2> 	  "base_url":"https://127.0.0.1:34292/_t/t",
   [junit4]   2> 	  "node_name":"127.0.0.1:34292__t%2Ft",
   [junit4]   2> 	  "numShards":"2",
   [junit4]   2> 	  "state":"active",
   [junit4]   2> 	  "shard":"shard1",
   [junit4]   2> 	  "collection":"control_collection",
   [junit4]   2> 	  "operation":"state"}
   [junit4]   2> 43759 T206 oascc.ZkStateReader$2.process A cluster state change: WatchedEvent state:SyncConnected type:NodeDataChanged path:/clusterstate.json, has occurred - updating... (live nodes size: 1)
   [junit4]   2> 43759 T223 n:127.0.0.1:36995__t%2Ft oascc.ZkStateReader$2.process A cluster state change: WatchedEvent state:SyncConnected type:NodeDataChanged path:/clusterstate.json, has occurred - updating... (live nodes size: 1)
   [junit4]   2> 43759 T195 n:127.0.0.1:34292__t%2Ft oascc.ZkStateReader$2.process A cluster state change: WatchedEvent state:SyncConnected type:NodeDataChanged path:/clusterstate.json, has occurred - updating... (live nodes size: 1)
   [junit4]   2> 44555 T164 n:127.0.0.1:36995__t%2Ft oasc.ZkController.createEphemeralLiveNode Register node as live in ZooKeeper:/live_nodes/127.0.0.1:36995__t%2Ft
   [junit4]   2> 44555 T164 n:127.0.0.1:36995__t%2Ft oascc.SolrZkClient.makePath makePath: /live_nodes/127.0.0.1:36995__t%2Ft
   [junit4]   2> 44557 T164 n:127.0.0.1:36995__t%2Ft oasc.Overseer.close Overseer (id=null) closing
   [junit4]   2> 44560 T164 n:127.0.0.1:36995__t%2Ft oasc.CoreContainer.initializeAuthenticationPlugin No authentication plugin used.
   [junit4]   2> 44560 T164 n:127.0.0.1:36995__t%2Ft oasc.CoreContainer.intializeAuthorizationPlugin Security conf doesn't exist. Skipping setup for authorization module.
   [junit4]   2> 44560 T164 n:127.0.0.1:36995__t%2Ft oasc.CorePropertiesLocator.discover Looking for core definitions underneath /home/jenkins/workspace/Lucene-Solr-trunk-Linux/solr/build/solr-solrj/test/J1/temp/solr.client.solrj.impl.CloudSolrClientTest 5C6E96F65C4695B7-001/shard-1-001/cores
   [junit4]   2> 44561 T164 n:127.0.0.1:36995__t%2Ft oasc.CoreDescriptor.<init> CORE DESCRIPTOR: {name=collection1, config=solrconfig.xml, transient=false, schema=schema.xml, loadOnStartup=true, instanceDir=/home/jenkins/workspace/Lucene-Solr-trunk-Linux/solr/build/solr-solrj/test/J1/temp/solr.client.solrj.impl.CloudSolrClientTest 5C6E96F65C4695B7-001/shard-1-001/cores/collection1, collection=collection1, absoluteInstDir=/home/jenkins/workspace/Lucene-Solr-trunk-Linux/solr/build/solr-solrj/test/J1/temp/solr.client.solrj.impl.CloudSolrClientTest 5C6E96F65C4695B7-001/shard-1-001/cores/collection1/, coreNodeName=, dataDir=data/, shard=}
   [junit4]   2> 44561 T164 n:127.0.0.1:36995__t%2Ft oasc.CorePropertiesLocator.discoverUnder Found core collection1 in /home/jenkins/workspace/Lucene-Solr-trunk-Linux/solr/build/solr-solrj/test/J1/temp/solr.client.solrj.impl.CloudSolrClientTest 5C6E96F65C4695B7-001/shard-1-001/cores/collection1/
   [junit4]   2> 44561 T164 n:127.0.0.1:36995__t%2Ft oasc.CorePropertiesLocator.discover Found 1 core definitions
   [junit4]   2> 44563 T224 n:127.0.0.1:36995__t%2Ft c:collection1 x:collection1 oasc.ZkController.publish publishing core=collection1 state=down collection=collection1
   [junit4]   2> 44563 T224 n:127.0.0.1:36995__t%2Ft c:collection1 x:collection1 oasc.ZkController.publish numShards not found on descriptor - reading it from system property
   [junit4]   2> 44564 T224 n:127.0.0.1:36995__t%2Ft oasc.ZkController.waitForCoreNodeName look for our core node name
   [junit4]   2> 44564 T195 n:127.0.0.1:34292__t%2Ft oasc.DistributedQueue$LatchWatcher.process NodeChildrenChanged fired on path /overseer/queue state SyncConnected
   [junit4]   2> 44564 T196 n:127.0.0.1:34292__t%2Ft oasc.Overseer$ClusterStateUpdater.run processMessage: queueSize: 1, message = {
   [junit4]   2> 	  "core":"collection1",
   [junit4]   2> 	  "roles":null,
   [junit4]   2> 	  "base_url":"https://127.0.0.1:36995/_t/t",
   [junit4]   2> 	  "node_name":"127.0.0.1:36995__t%2Ft",
   [junit4]   2> 	  "numShards":"2",
   [junit4]   2> 	  "state":"down",
   [junit4]   2> 	  "shard":null,
   [junit4]   2> 	  "collection":"collection1",
   [junit4]   2> 	  "operation":"state"} current state version: 3
   [junit4]   2> 44565 T196 n:127.0.0.1:34292__t%2Ft oasco.ReplicaMutator.updateState Update state numShards=2 message={
   [junit4]   2> 	  "core":"collection1",
   [junit4]   2> 	  "roles":null,
   [junit4]   2> 	  "base_url":"https://127.0.0.1:36995/_t/t",
   [junit4]   2> 	  "node_name":"127.0.0.1:36995__t%2Ft",
   [junit4]   2> 	  "numShards":"2",
   [junit4]   2> 	  "state":"down",
   [junit4]   2> 	  "shard":null,
   [junit4]   2> 	  "collection":"collection1",
   [junit4]   2> 	  "operation":"state"}
   [junit4]   2> 44565 T196 n:127.0.0.1:34292__t%2Ft oasco.ClusterStateMutator.createCollection building a new cName: collection1
   [junit4]   2> 44566 T196 n:127.0.0.1:34292__t%2Ft oasco.ReplicaMutator.updateState Assigning new node to shard shard=shard2
   [junit4]   2> 44669 T223 n:127.0.0.1:36995__t%2Ft oascc.ZkStateReader$2.process A cluster state change: WatchedEvent state:SyncConnected type:NodeDataChanged path:/clusterstate.json, has occurred - updating... (live nodes size: 2)
   [junit4]   2> 44669 T206 oascc.ZkStateReader$2.process A cluster state change: WatchedEvent state:SyncConnected type:NodeDataChanged path:/clusterstate.json, has occurred - updating... (live nodes size: 2)
   [junit4]   2> 44669 T195 n:127.0.0.1:34292__t%2Ft oascc.ZkStateReader$2.process A cluster state change: WatchedEvent state:SyncConnected type:NodeDataChanged path:/clusterstate.json, has occurred - updating... (live nodes size: 2)
   [junit4]   2> 45564 T224 n:127.0.0.1:36995__t%2Ft oasc.ZkController.waitForShardId waiting to find shard id in clusterstate for collection1
   [junit4]   2> 45564 T224 n:127.0.0.1:36995__t%2Ft oasc.ZkController.createCollectionZkNode Check for collection zkNode:collection1
   [junit4]   2> 45565 T224 n:127.0.0.1:36995__t%2Ft oasc.ZkController.createCollectionZkNode Collection zkNode exists
   [junit4]   2> 45565 T224 n:127.0.0.1:36995__t%2Ft oascc.ZkStateReader.readConfigName Load collection config from:/collections/collection1
   [junit4]   2> 45567 T224 n:127.0.0.1:36995__t%2Ft oascc.ZkStateReader.readConfigName path=/collections/collection1 configName=conf1 specified config exists in ZooKeeper
   [junit4]   2> 45567 T224 n:127.0.0.1:36995__t%2Ft oasc.SolrResourceLoader.<init> new SolrResourceLoader for directory: '/home/jenkins/workspace/Lucene-Solr-trunk-Linux/solr/build/solr-solrj/test/J1/temp/solr.client.solrj.impl.CloudSolrClientTest 5C6E96F65C4695B7-001/shard-1-001/cores/collection1/'
   [junit4]   2> 45574 T224 n:127.0.0.1:36995__t%2Ft oasc.Config.<init> loaded config solrconfig.xml with version 0 
   [junit4]   2> 45577 T224 n:127.0.0.1:36995__t%2Ft oasc.SolrConfig.refreshRequestParams current version of requestparams : -1
   [junit4]   2> 45579 T224 n:127.0.0.1:36995__t%2Ft oasc.SolrConfig.<init> Using Lucene MatchVersion: 6.0.0
   [junit4]   2> 45583 T224 n:127.0.0.1:36995__t%2Ft oasc.SolrConfig.<init> Loaded SolrConfig: solrconfig.xml
   [junit4]   2> 45584 T224 n:127.0.0.1:36995__t%2Ft oass.IndexSchema.readSchema Reading Solr Schema from /configs/conf1/schema.xml
   [junit4]   2> 45590 T224 n:127.0.0.1:36995__t%2Ft oass.IndexSchema.readSchema [collection1] Schema name=test
   [junit4]   2> 45665 T224 n:127.0.0.1:36995__t%2Ft oass.IndexSchema.readSchema default search field in schema is text
   [junit4]   2> 45666 T224 n:127.0.0.1:36995__t%2Ft oass.IndexSchema.readSchema unique key field: id
   [junit4]   2> 45667 T224 n:127.0.0.1:36995__t%2Ft oass.IndexSchema.loadCopyFields WARN Field lowerfilt1and2 is not multivalued and destination for multiple copyFields (2)
   [junit4]   2> 45667 T224 n:127.0.0.1:36995__t%2Ft oass.IndexSchema.loadCopyFields WARN Field text is not multivalued and destination for multiple copyFields (3)
   [junit4]   2> 45667 T224 n:127.0.0.1:36995__t%2Ft oasc.CoreContainer.create Creating SolrCore 'collection1' using configuration from collection collection1
   [junit4]   2> 45667 T224 n:127.0.0.1:36995__t%2Ft x:collection1 oasc.SolrCore.initDirectoryFactory org.apache.solr.core.MockDirectoryFactory
   [junit4]   2> 45668 T224 n:127.0.0.1:36995__t%2Ft x:collection1 oasc.SolrCore.<init> [[collection1] ] Opening new SolrCore at [/home/jenkins/workspace/Lucene-Solr-trunk-Linux/solr/build/solr-solrj/test/J1/temp/solr.client.solrj.impl.CloudSolrClientTest 5C6E96F65C4695B7-001/shard-1-001/cores/collection1/], dataDir=[null]
   [junit4]   2> 45668 T224 n:127.0.0.1:36995__t%2Ft x:collection1 oasc.SolrCore.initInfoRegistry JMX monitoring not detected for core: collection1
   [junit4]   2> 45668 T224 n:127.0.0.1:36995__t%2Ft x:collection1 oasc.CachingDirectoryFactory.get return new directory for /home/jenkins/workspace/Lucene-Solr-trunk-Linux/solr/build/solr-solrj/test/J1/temp/solr.client.solrj.impl.CloudSolrClientTest 5C6E96F65C4695B7-001/shard-1-001/cores/collection1/data
   [junit4]   2> 45668 T224 n:127.0.0.1:36995__t%2Ft x:collection1 oasc.SolrCore.getNewIndexDir New index directory detected: old=null new=/home/jenkins/workspace/Lucene-Solr-trunk-Linux/solr/build/solr-solrj/test/J1/temp/solr.client.solrj.impl.CloudSolrClientTest 5C6E96F65C4695B7-001/shard-1-001/cores/collection1/data/index/
   [junit4]   2> 45668 T224 n:127.0.0.1:36995__t%2Ft x:collection1 oasc.SolrCore.initIndex WARN [collection1] Solr index directory '/home/jenkins/workspace/Lucene-Solr-trunk-Linux/solr/build/solr-solrj/test/J1/temp/solr.client.solrj.impl.CloudSolrClientTest 5C6E96F65C4695B7-001/shard-1-001/cores/collection1/data/index' doesn't exist. Creating new index...
   [junit4]   2> 45669 T224 n:127.0.0.1:36995__t%2Ft x:collection1 oasc.CachingDirectoryFactory.get return new directory for /home/jenkins/workspace/Lucene-Solr-trunk-Linux/solr/build/solr-solrj/test/J1/temp/solr.client.solrj.impl.CloudSolrClientTest 5C6E96F65C4695B7-001/shard-1-001/cores/collection1/data/index
   [junit4]   2> 45669 T224 n:127.0.0.1:36995__t%2Ft x:collection1 oasc.SolrDeletionPolicy.onCommit SolrDeletionPolicy.onCommit: commits: num=1
   [junit4]   2> 		commit{dir=MockDirectoryWrapper(RAMDirectory@551ec7f0 lockFactory=org.apache.lucene.store.SingleInstanceLockFactory@7e9d272a),segFN=segments_1,generation=1}
   [junit4]   2> 45670 T224 n:127.0.0.1:36995__t%2Ft x:collection1 oasc.SolrDeletionPolicy.updateCommits newest commit generation = 1
   [junit4]   2> 45671 T224 n:127.0.0.1:36995__t%2Ft x:collection1 oasc.SolrCore.loadUpdateProcessorChains no updateRequestProcessorChain defined as default, creating implicit default
   [junit4]   2> 45673 T224 n:127.0.0.1:36995__t%2Ft x:collection1 oashl.XMLLoader.init xsltCacheLifetimeSeconds=60
   [junit4]   2> 45673 T224 n:127.0.0.1:36995__t%2Ft x:collection1 oashl.XMLLoader.init xsltCacheLifetimeSeconds=60
   [junit4]   2> 45674 T224 n:127.0.0.1:36995__t%2Ft x:collection1 oashl.XMLLoader.init xsltCacheLifetimeSeconds=60
   [junit4]   2> 45674 T224 n:127.0.0.1:36995__t%2Ft x:collection1 oashl.XMLLoader.init xsltCacheLifetimeSeconds=60
   [junit4]   2> 45674 T224 n:127.0.0.1:36995__t%2Ft x:collection1 oasc.PluginBag.createPlugin requestHandler : '/replication' created with startup=lazy 
   [junit4]   2> 45675 T224 n:127.0.0.1:36995__t%2Ft x:collection1 oasc.SolrResourceLoader.findClass WARN Solr loaded a deprecated plugin/analysis class [org.apache.solr.handler.admin.AdminHandlers]. Please consult documentation how to replace it accordingly.
   [junit4]   2> 45675 T224 n:127.0.0.1:36995__t%2Ft x:collection1 oasc.SolrResourceLoader.findClass WARN Solr loaded a deprecated plugin/analysis class [org.apache.solr.handler.admin.AdminHandlers]. Please consult documentation how to replace it accordingly.
   [junit4]   2> 45675 T224 n:127.0.0.1:36995__t%2Ft x:collection1 oasc.RequestHandlers.initHandlersFromConfig Registered paths: /admin/mbeans,standard,,/update/csv,/update/json/docs,/admin/luke,/admin/segments,/get,/admin/system,/replication,/admin/properties,/config,/schema,/admin/plugins,/admin/logging,/update/json,/admin,/admin/threads,/admin/ping,/update,/admin/file
   [junit4]   2> 45675 T224 n:127.0.0.1:36995__t%2Ft x:collection1 oasc.RequestHandlers.initHandlersFromConfig WARN no default request handler is registered (either '/select' or 'standard')
   [junit4]   2> 45676 T224 n:127.0.0.1:36995__t%2Ft x:collection1 oasc.SolrCore.initStatsCache Using default statsCache cache: org.apache.solr.search.stats.LocalStatsCache
   [junit4]   2> 45676 T224 n:127.0.0.1:36995__t%2Ft x:collection1 oasu.UpdateHandler.<init> Using UpdateLog implementation: org.apache.solr.update.UpdateLog
   [junit4]   2> 45676 T224 n:127.0.0.1:36995__t%2Ft x:collection1 oasu.UpdateLog.init Initializing UpdateLog: dataDir= defaultSyncLevel=FLUSH numRecordsToKeep=100 maxNumLogsToKeep=10
   [junit4]   2> 45676 T224 n:127.0.0.1:36995__t%2Ft x:collection1 oasu.CommitTracker.<init> Hard AutoCommit: disabled
   [junit4]   2> 45676 T224 n:127.0.0.1:36995__t%2Ft x:collection1 oasu.CommitTracker.<init> Soft AutoCommit: disabled
   [junit4]   2> 45677 T224 n:127.0.0.1:36995__t%2Ft x:collection1 oasc.SolrDeletionPolicy.onInit SolrDeletionPolicy.onInit: commits: num=1
   [junit4]   2> 		commit{dir=MockDirectoryWrapper(RAMDirectory@551ec7f0 lockFactory=org.apache.lucene.store.SingleInstanceLockFactory@7e9d272a),segFN=segments_1,generation=1}
   [junit4]   2> 45677 T224 n:127.0.0.1:36995__t%2Ft x:collection1 oasc.SolrDeletionPolicy.updateCommits newest commit generation = 1
   [junit4]   2> 45677 T224 n:127.0.0.1:36995__t%2Ft x:collection1 oass.SolrIndexSearcher.<init> Opening Searcher@7f344aad[collection1] main
   [junit4]   2> 45677 T224 n:127.0.0.1:36995__t%2Ft x:collection1 oascc.ZkStateReader.readConfigName Load collection config from:/collections/collection1
   [junit4]   2> 45679 T224 n:127.0.0.1:36995__t%2Ft x:collection1 oascc.ZkStateReader.readConfigName path=/collections/collection1 configName=conf1 specified config exists in ZooKeeper
   [junit4]   2> 45679 T224 n:127.0.0.1:36995__t%2Ft x:collection1 oasr.ManagedResourceStorage.newStorageIO Setting up ZooKeeper-based storage for the RestManager with znodeBase: /configs/conf1
   [junit4]   2> 45680 T224 n:127.0.0.1:36995__t%2Ft x:collection1 oasr.ManagedResourceStorage$ZooKeeperStorageIO.configure Configured ZooKeeperStorageIO with znodeBase: /configs/conf1
   [junit4]   2> 45680 T224 n:127.0.0.1:36995__t%2Ft x:collection1 oasr.RestManager.init Initializing RestManager with initArgs: {}
   [junit4]   2> 45680 T224 n:127.0.0.1:36995__t%2Ft x:collection1 oasr.ManagedResourceStorage.load Reading _rest_managed.json using ZooKeeperStorageIO:path=/configs/conf1
   [junit4]   2> 45681 T224 n:127.0.0.1:36995__t%2Ft x:collection1 oasr.ManagedResourceStorage$ZooKeeperStorageIO.openInputStream No data found for znode /configs/conf1/_rest_managed.json
   [junit4]   2> 45681 T224 n:127.0.0.1:36995__t%2Ft x:collection1 oasr.ManagedResourceStorage.load Loaded null at path _rest_managed.json using ZooKeeperStorageIO:path=/configs/conf1
   [junit4]   2> 45681 T224 n:127.0.0.1:36995__t%2Ft x:collection1 oasr.RestManager.init Initializing 0 registered ManagedResources
   [junit4]   2> 45682 T224 n:127.0.0.1:36995__t%2Ft x:collection1 oasha.AdminHandlers.inform WARN <requestHandler name="/admin/" 
   [junit4]   2> 	 class="solr.admin.AdminHandlers" /> is deprecated . It is not required anymore
   [junit4]   2> 45682 T224 n:127.0.0.1:36995__t%2Ft x:collection1 oasc.ZkController.getConfDirListeners watch zkdir /configs/conf1
   [junit4]   2> 45682 T225 n:127.0.0.1:36995__t%2Ft x:collection1 oasc.SolrCore.registerSearcher [collection1] Registered new searcher Searcher@7f344aad[collection1] main{ExitableDirectoryReader(UninvertingDirectoryReader())}
   [junit4]   2> 45682 T224 n:127.0.0.1:36995__t%2Ft x:collection1 oasc.CoreContainer.registerCore registering core: collection1
   [junit4]   2> 45684 T228 n:127.0.0.1:36995__t%2Ft c:collection1 s:shard2 x:collection1 oasc.ZkController.register Register replica - core:collection1 address:https://127.0.0.1:36995/_t/t collection:collection1 shard:shard2
   [junit4]   2> 45684 T164 n:127.0.0.1:36995__t%2Ft oass.SolrDispatchFilter.init user.dir=/home/jenkins/workspace/Lucene-Solr-trunk-Linux/solr/build/solr-solrj/test/J1
   [junit4]   2> 45684 T164 n:127.0.0.1:36995__t%2Ft oass.SolrDispatchFilter.init SolrDispatchFilter.init() done
   [junit4]   2> 45700 T164 oas.SolrTestCaseJ4.writeCoreProperties Writing core.properties file to /home/jenkins/workspace/Lucene-Solr-trunk-Linux/solr/build/solr-solrj/test/J1/temp/solr.client.solrj.impl.CloudSolrClientTest 5C6E96F65C4695B7-001/shard-2-001/cores/collection1
   [junit4]   2> 45701 T164 oasc.AbstractFullDistribZkTestBase.createJettys create jetty 2 in directory /home/jenkins/workspace/Lucene-Solr-trunk-Linux/solr/build/solr-solrj/test/J1/temp/solr.client.solrj.impl.CloudSolrClientTest 5C6E96F65C4695B7-001/shard-2-001
   [junit4]   2> 45702 T228 n:127.0.0.1:36995__t%2Ft c:collection1 s:shard2 x:collection1 oascc.SolrZkClient.makePath makePath: /collections/collection1/leader_elect/shard2/election
   [junit4]   2> 45702 T164 oejs.Server.doStart jetty-9.2.10.v20150310
   [junit4]   2> 45713 T164 oejsh.ContextHandler.doStart Started o.e.j.s.ServletContextHandler@22336b2a{/_t/t,null,AVAILABLE}
   [junit4]   2> 45721 T228 n:127.0.0.1:36995__t%2Ft c:collection1 s:shard2 x:collection1 oasc.ShardLeaderElectionContext.runLeaderProcess Running the leader process for shard shard2
   [junit4]   2> 45722 T195 n:127.0.0.1:34292__t%2Ft oasc.DistributedQueue$LatchWatcher.process NodeChildrenChanged fired on path /overseer/queue state SyncConnected
   [junit4]   2> 45723 T228 n:127.0.0.1:36995__t%2Ft c:collection1 s:shard2 x:collection1 oasc.ShardLeaderElectionContext.waitForReplicasToComeUp Enough replicas found to continue.
   [junit4]   2> 45723 T228 n:127.0.0.1:36995__t%2Ft c:collection1 s:shard2 x:collection1 oasc.ShardLeaderElectionContext.runLeaderProcess I may be the new leader - try and sync
   [junit4]   2> ASYNC  NEW_CORE C17 name=collection1 org.apache.solr.core.SolrCore@23658ca3 url=https://127.0.0.1:36995/_t/t/collection1 node=127.0.0.1:36995__t%2Ft C17_STATE=coll:collection1 core:collection1 props:{core=collection1, base_url=https://127.0.0.1:36995/_t/t, node_name=127.0.0.1:36995__t%2Ft, state=down}
   [junit4]   2> 45723 T228 n:127.0.0.1:36995__t%2Ft c:collection1 s:shard2 x:collection1 C17 oasc.SyncStrategy.sync Sync replicas to https://127.0.0.1:36995/_t/t/collection1/
   [junit4]   2> 45724 T228 n:127.0.0.1:36995__t%2Ft c:collection1 s:shard2 x:collection1 C17 oasc.SyncStrategy.syncReplicas Sync Success - now sync replicas to me
   [junit4]   2> 45724 T228 n:127.0.0.1:36995__t%2Ft c:collection1 s:shard2 x:collection1 C17 oasc.SyncStrategy.syncToMe https://127.0.0.1:36995/_t/t/collection1/ has no replicas
   [junit4]   2> 45724 T228 n:127.0.0.1:36995__t%2Ft c:collection1 s:shard2 x:collection1 oasc.ShardLeaderElectionContext.runLeaderProcess I am the new leader: https://127.0.0.1:36995/_t/t/collection1/ shard2
   [junit4]   2> 45724 T196 n:127.0.0.1:34292__t%2Ft oasc.Overseer$ClusterStateUpdater.run processMessage: queueSize: 1, message = {
   [junit4]   2> 	  "operation":"leader",
   [junit4]   2> 	  "shard":"shard2",
   [junit4]   2> 	  "collection":"collection1"} current state version: 4
   [junit4]   2> 45724 T228 n:127.0.0.1:36995__t%2Ft c:collection1 s:shard2 x:collection1 oascc.SolrZkClient.makePath makePath: /collections/collection1/leaders/shard2
   [junit4]   2> 45729 T195 n:127.0.0.1:34292__t%2Ft oasc.DistributedQueue$LatchWatcher.process NodeChildrenChanged fired on path /overseer/queue state SyncConnected
   [junit4]   2> 45730 T196 n:127.0.0.1:34292__t%2Ft oasc.Overseer$ClusterStateUpdater.run processMessage: queueSize: 1, message = {
   [junit4]   2> 	  "operation":"leader",
   [junit4]   2> 	  "shard":"shard2",
   [junit4]   2> 	  "collection":"collection1",
   [junit4]   2> 	  "base_url":"https://127.0.0.1:36995/_t/t",
   [junit4]   2> 	  "core":"collection1",
   [junit4]   2> 	  "state":"active"} current state version: 4
   [junit4]   2> 45736 T164 oejs.AbstractConnector.doStart Started ServerConnector@367691bd{SSL-http/1.1}{127.0.0.1:33989}
   [junit4]   2> 45736 T164 oejs.Server.doStart Started @46922ms
   [junit4]   2> 45736 T164 oascse.JettySolrRunner$1.lifeCycleStarted Jetty properties: {solr.data.dir=/home/jenkins/workspace/Lucene-Solr-trunk-Linux/solr/build/solr-solrj/test/J1/temp/solr.client.solrj.impl.CloudSolrClientTest 5C6E96F65C4695B7-001/tempDir-001/jetty2, solrconfig=solrconfig.xml, hostContext=/_t/t, hostPort=33989, coreRootDirectory=/home/jenkins/workspace/Lucene-Solr-trunk-Linux/solr/build/solr-solrj/test/J1/temp/solr.client.solrj.impl.CloudSolrClientTest 5C6E96F65C4695B7-001/shard-2-001/cores}
   [junit4]   2> 45739 T164 oass.SolrDispatchFilter.init SolrDispatchFilter.init()sun.misc.Launcher$AppClassLoader@659e0bfd
   [junit4]   2> 45739 T164 oasc.SolrResourceLoader.<init> new SolrResourceLoader for directory: '/home/jenkins/workspace/Lucene-Solr-trunk-Linux/solr/build/solr-solrj/test/J1/temp/solr.client.solrj.impl.CloudSolrClientTest 5C6E96F65C4695B7-001/shard-2-001/'
   [junit4]   2> 45751 T164 oasc.SolrXmlConfig.fromFile Loading container configuration from /home/jenkins/workspace/Lucene-Solr-trunk-Linux/solr/build/solr-solrj/test/J1/temp/solr.client.solrj.impl.CloudSolrClientTest 5C6E96F65C4695B7-001/shard-2-001/solr.xml
   [junit4]   2> 45757 T164 oasc.CorePropertiesLocator.<init> Config-defined core root directory: /home/jenkins/workspace/Lucene-Solr-trunk-Linux/solr/build/solr-solrj/test/J1/temp/solr.client.solrj.impl.CloudSolrClientTest 5C6E96F65C4695B7-001/shard-2-001/cores
   [junit4]   2> 45758 T164 oasc.CoreContainer.<init> New CoreContainer 213603226
   [junit4]   2> 45758 T164 oasc.CoreContainer.load Loading cores into CoreContainer [instanceDir=/home/jenkins/workspace/Lucene-Solr-trunk-Linux/solr/build/solr-solrj/test/J1/temp/solr.client.solrj.impl.CloudSolrClientTest 5C6E96F65C4695B7-001/shard-2-001/]
   [junit4]   2> 45758 T164 oasc.CoreContainer.load loading shared library: /home/jenkins/workspace/Lucene-Solr-trunk-Linux/solr/build/solr-solrj/test/J1/temp/solr.client.solrj.impl.CloudSolrClientTest 5C6E96F65C4695B7-001/shard-2-001/lib
   [junit4]   2> 45758 T164 oasc.SolrResourceLoader.addToClassLoader WARN Can't find (or read) directory to add to classloader: lib (resolved as: /home/jenkins/workspace/Lucene-Solr-trunk-Linux/solr/build/solr-solrj/test/J1/temp/solr.client.solrj.impl.CloudSolrClientTest 5C6E96F65C4695B7-001/shard-2-001/lib).
   [junit4]   2> 45765 T164 oashc.HttpShardHandlerFactory.init created with socketTimeout : 90000,urlScheme : ,connTimeout : 15000,maxConnectionsPerHost : 20,maxConnections : 10000,corePoolSize : 0,maximumPoolSize : 2147483647,maxThreadIdleTime : 5,sizeOfQueue : -1,fairnessPolicy : false,useRetries : false,
   [junit4]   2> 45767 T164 oasu.UpdateShardHandler.<init> Creating UpdateShardHandler HTTP client with params: socketTimeout=340000&connTimeout=45000&retry=true
   [junit4]   2> 45769 T164 oasl.LogWatcher.createWatcher SLF4J impl is org.slf4j.impl.Log4jLoggerFactory
   [junit4]   2> 45769 T164 oasl.LogWatcher.newRegisteredLogWatcher Registering Log Listener [Log4j (org.slf4j.impl.Log4jLoggerFactory)]
   [junit4]   2> 45769 T164 oasc.CoreContainer.load Node Name: 127.0.0.1
   [junit4]   2> 45770 T164 oasc.ZkContainer.initZooKeeper Zookeeper client=127.0.0.1:53283/solr
   [junit4]   2> 45770 T164 oasc.ZkController.checkChrootPath zkHost includes chroot
   [junit4]   2> 45770 T164 oascc.SolrZkClient.createZkCredentialsToAddAutomatically Using default ZkCredentialsProvider
   [junit4]   2> 45773 T164 oascc.ConnectionManager.waitForConnected Waiting for client to connect to ZooKeeper
   [junit4]   2> 45775 T242 oascc.ConnectionManager.process Watcher org.apache.solr.common.cloud.ConnectionManager@8942c23 name:ZooKeeperConnection Watcher:127.0.0.1:53283 got event WatchedEvent state:SyncConnected type:None path:null path:null type:None
   [junit4]   2> 45775 T164 oascc.ConnectionManager.waitForConnected Client is connected to ZooKeeper
   [junit4]   2> 45776 T164 oascc.SolrZkClient.createZkACLProvider Using default ZkACLProvider
   [junit4]   2> 45778 T164 n:127.0.0.1:33989__t%2Ft oascc.ConnectionManager.waitForConnected Waiting for client to connect to ZooKeeper
   [junit4]   2> 45780 T245 n:127.0.0.1:33989__t%2Ft oascc.ConnectionManager.process Watcher org.apache.solr.common.cloud.ConnectionManager@4bd83aca name:ZooKeeperConnection Watcher:127.0.0.1:53283/solr got event WatchedEvent state:SyncConnected type:None path:null path:null type:None
   [junit4]   2> 45780 T164 n:127.0.0.1:33989__t%2Ft oascc.ConnectionManager.waitForConnected Client is connected to ZooKeeper
   [junit4]   2> 45784 T164 n:127.0.0.1:33989__t%2Ft oascc.ZkStateReader.createClusterStateWatchersAndUpdate Updating cluster state from ZooKeeper... 
   [junit4]   2> 45834 T223 n:127.0.0.1:36995__t%2Ft oascc.ZkStateReader$2.process A cluster state change: WatchedEvent state:SyncConnected type:NodeDataChanged path:/clusterstate.json, has occurred - updating... (live nodes size: 2)
   [junit4]   2> 45834 T206 oascc.ZkStateReader$2.process A cluster state change: WatchedEvent state:SyncConnected type:NodeDataChanged path:/clusterstate.json, has occurred - updating... (live nodes size: 2)
   [junit4]   2> 45834 T245 n:127.0.0.1:33989__t%2Ft oascc.ZkStateReader$2.process A cluster state change: WatchedEvent state:SyncConnected type:NodeDataChanged path:/clusterstate.json, has occurred - updating... (live nodes size: 2)
   [junit4]   2> 45834 T195 n:127.0.0.1:34292__t%2Ft oascc.ZkStateReader$2.process A cluster state change: WatchedEvent state:SyncConnected type:NodeDataChanged path:/clusterstate.json, has occurred - updating... (live nodes size: 2)
   [junit4]   2> 45880 T228 n:127.0.0.1:36995__t%2Ft c:collection1 s:shard2 x:collection1 oasc.ZkController.register We are https://127.0.0.1:36995/_t/t/collection1/ and leader is https://127.0.0.1:36995/_t/t/collection1/
   [junit4]   2> 45881 T228 n:127.0.0.1:36995__t%2Ft c:collection1 s:shard2 x:collection1 oasc.ZkController.register No LogReplay needed for core=collection1 baseURL=https://127.0.0.1:36995/_t/t
   [junit4]   2> 45881 T228 n:127.0.0.1:36995__t%2Ft c:collection1 s:shard2 x:collection1 oasc.ZkController.checkRecovery I am the leader, no recovery necessary
   [junit4]   2> 45881 T228 n:127.0.0.1:36995__t%2Ft c:collection1 s:shard2 x:collection1 oasc.ZkController.publish publishing core=collection1 state=active collection=collection1
   [junit4]   2> 45881 T228 n:127.0.0.1:36995__t%2Ft c:collection1 s:shard2 x:collection1 oasc.ZkController.publish numShards not found on descriptor - reading it from system property
   [junit4]   2> 45882 T195 n:127.0.0.1:34292__t%2Ft oasc.DistributedQueue$LatchWatcher.process NodeChildrenChanged fired on path /overseer/queue state SyncConnected
   [junit4]   2> 45883 T196 n:127.0.0.1:34292__t%2Ft oasc.Overseer$ClusterStateUpdater.run processMessage: queueSize: 1, message = {
   [junit4]   2> 	  "core":"collection1",
   [junit4]   2> 	  "core_node_name":"core_node1",
   [junit4]   2> 	  "roles":null,
   [junit4]   2> 	  "base_url":"https://127.0.0.1:36995/_t/t",
   [junit4]   2> 	  "node_name":"127.0.0.1:36995__t%2Ft",
   [junit4]   2> 	  "numShards":"2",
   [junit4]   2> 	  "state":"active",
   [junit4]   2> 	  "shard":"shard2",
   [junit4]   2> 	  "collection":"collection1",
   [junit4]   2> 	  "operation":"state"} current state version: 5
   [junit4]   2> 45884 T196 n:127.0.0.1:34292__t%2Ft oasco.ReplicaMutator.updateState Update state numShards=2 message={
   [junit4]   2> 	  "core":"collection1",
   [junit4]   2> 	  "core_node_name":"core_node1",
   [junit4]   2> 	  "roles":null,
   [junit4]   2> 	  "base_url":"https://127.0.0.1:36995/_t/t",
   [junit4]   2> 	  "node_name":"127.0.0.1:36995__t%2Ft",
   [junit4]   2> 	  "numShards":"2",
   [junit4]   2> 	  "state":"active",
   [junit4]   2> 	  "shard":"shard2",
   [junit4]   2> 	  "collection":"collection1",
   [junit4]   2> 	  "operation":"state"}
   [junit4]   2> 45988 T206 oascc.ZkStateReader$2.process A cluster state change: WatchedEvent state:SyncConnected type:NodeDataChanged path:/clusterstate.json, has occurred - updating... (live nodes size: 2)
   [junit4]   2> 45988 T195 n:127.0.0.1:34292__t%2Ft oascc.ZkStateReader$2.process A cluster state change: WatchedEvent state:SyncConnected type:NodeDataChanged path:/clusterstate.json, has occurred - updating... (live nodes size: 2)
   [junit4]   2> 45989 T245 n:127.0.0.1:33989__t%2Ft oascc.ZkStateReader$2.process A cluster state change: WatchedEvent state:SyncConnected type:NodeDataChanged path:/clusterstate.json, has occurred - updating... (live nodes size: 2)
   [junit4]   2> 45989 T223 n:127.0.0.1:36995__t%2Ft oascc.ZkStateReader$2.process A cluster state change: WatchedEvent state:SyncConnected type:NodeDataChanged path:/clusterstate.json, has occurred - updating... (live nodes size: 2)
   [junit4]   2> 46787 T164 n:127.0.0.1:33989__t%2Ft oasc.ZkController.createEphemeralLiveNode Register node as live in ZooKeeper:/live_nodes/127.0.0.1:33989__t%2Ft
   [junit4]   2> 46788 T164 n:127.0.0.1:33989__t%2Ft oascc.SolrZkClient.makePath makePath: /live_nodes/127.0.0.1:33989__t%2Ft
   [junit4]   2> 46791 T164 n:127.0.0.1:33989__t%2Ft oasc.Overseer.close Overseer (id=null) closing
   [junit4]   2> 46792 T164 n:127.0.0.1:33989__t%2Ft oasc.CoreContainer.initializeAuthenticationPlugin No authentication plugin used.
   [junit4]   2> 46792 T164 n:127.0.0.1:33989__t%2Ft oasc.CoreContainer.intializeAuthorizationPlugin Security conf doesn't exist. Skipping setup for authorization module.
   [junit4]   2> 46793 T164 n:127.0.0.1:33989__t%2Ft oasc.CorePropertiesLocator.discover Looking for core definitions underneath /home/jenkins/workspace/Lucene-Solr-trunk-Linux/solr/build/solr-solrj/test/J1/temp/solr.client.solrj.impl.CloudSolrClientTest 5C6E96F65C4695B7-001/shard-2-001/cores
   [junit4]   2> 46794 T164 n:127.0.0.1:33989__t%2Ft oasc.CoreDescriptor.<init> CORE DESCRIPTOR: {name=collection1, config=solrconfig.xml, transient=false, schema=schema.xml, loadOnStartup=true, instanceDir=/home/jenkins/workspace/Lucene-Solr-trunk-Linux/solr/build/solr-solrj/test/J1/temp/solr.client.solrj.impl.CloudSolrClientTest 5C6E96F65C4695B7-001/shard-2-001/cores/collection1, collection=collection1, absoluteInstDir=/home/jenkins/workspace/Lucene-Solr-trunk-Linux/solr/build/solr-solrj/test/J1/temp/solr.client.solrj.impl.CloudSolrClientTest 5C6E96F65C4695B7-001/shard-2-001/cores/collection1/, coreNodeName=, dataDir=data/, shard=}
   [junit4]   2> 46794 T164 n:127.0.0.1:33989__t%2Ft oasc.CorePropertiesLocator.discoverUnder Found core collection1 in /home/jenkins/workspace/Lucene-Solr-trunk-Linux/solr/build/solr-solrj/test/J1/temp/solr.client.solrj.impl.CloudSolrClientTest 5C6E96F65C4695B7-001/shard-2-001/cores/collection1/
   [junit4]   2> 46794 T164 n:127.0.0.1:33989__t%2Ft oasc.CorePropertiesLocator.discover Found 1 core definitions
   [junit4]   2> 46795 T246 n:127.0.0.1:33989__t%2Ft c:collection1 x:collection1 oasc.ZkController.publish publishing core=collection1 state=down collection=collection1
   [junit4]   2> 46795 T246 n:127.0.0.1:33989__t%2Ft c:collection1 x:collection1 oasc.ZkController.publish numShards not found on descriptor - reading it from system property
   [junit4]   2> 46796 T195 n:127.0.0.1:34292__t%2Ft oasc.DistributedQueue$LatchWatcher.process NodeChildrenChanged fired on path /overseer/queue state SyncConnected
   [junit4]   2> 46796 T246 n:127.0.0.1:33989__t%2Ft oasc.ZkController.waitForCoreNodeName look for our core node name
   [junit4]   2> 46796 T196 n:127.0.0.1:34292__t%2Ft oasc.Overseer$ClusterStateUpdater.run processMessage: queueSize: 1, message = {
   [junit4]   2> 	  "core":"collection1",
   [junit4]   2> 	  "roles":null,
   [junit4]   2> 	  "base_url":"https://127.0.0.1:33989/_t/t",
   [junit4]   2> 	  "node_name":"127.0.0.1:33989__t%2Ft",
   [junit4]   2> 	  "numShards":"2",
   [junit4]   2> 	  "state":"down",
   [junit4]   2> 	  "shard":null,
   [junit4]   2> 	  "collection":"collection1",
   [junit4]   2> 	  "operation":"state"} current state version: 6
   [junit4]   2> 46797 T196 n:127.0.0.1:34292__t%2Ft oasco.ReplicaMutator.updateState Update state numShards=2 message={
   [junit4]   2> 	  "core":"collection1",
   [junit4]   2> 	  "roles":null,
   [junit4]   2> 	  "base_url":"https://127.0.0.1:33989/_t/t",
   [junit4]   2> 	  "node_name":"127.0.0.1:33989__t%2Ft",
   [junit4]   2> 	  "numShards":"2",
   [junit4]   2> 	  "state":"down",
   [junit4]   2> 	  "shard":null,
   [junit4]   2> 	  "collection":"collection1",
   [junit4]   2> 	  "operation":"state"}
   [junit4]   2> 46797 T196 n:127.0.0.1:34292__t%2Ft oasco.ReplicaMutator.updateState Collection already exists with numShards=2
   [junit4]   2> 46797 T196 n:127.0.0.1:34292__t%2Ft oasco.ReplicaMutator.updateState Assigning new node to shard shard=shard1
   [junit4]   2> 46899 T206 oascc.ZkStateReader$2.process A cluster state change: WatchedEvent state:SyncConnected type:NodeDataChanged path:/clusterstate.json, has occurred - updating... (live nodes size: 3)
   [junit4]   2> 46899 T223 n:127.0.0.1:36995__t%2Ft oascc.ZkStateReader$2.process A cluster state change: WatchedEvent state:SyncConnected type:NodeDataChanged path:/clusterstate.json, has occurred - updating... (live nodes size: 3)
   [junit4]   2> 46899 T245 n:127.0.0.1:33989__t%2Ft oascc.ZkStateReader$2.process A cluster state change: WatchedEvent state:SyncConnected type:NodeDataChanged path:/clusterstate.json, has occurred - updating... (live nodes size: 3)
   [junit4]   2> 46899 T195 n:127.0.0.1:34292__t%2Ft oascc.ZkStateReader$2.process A cluster state change: WatchedEvent state:SyncConnected type:NodeDataChanged path:/clusterstate.json, has occurred - updating... (live nodes size: 3)
   [junit4]   2> 47796 T246 n:127.0.0.1:33989__t%2Ft oasc.ZkController.waitForShardId waiting to find shard id in clusterstate for collection1
   [junit4]   2> 47796 T246 n:127.0.0.1:33989__t%2Ft oasc.ZkController.createCollectionZkNode Check for collection zkNode:collection1
   [junit4]   2> 47797 T246 n:127.0.0.1:33989__t%2Ft oasc.ZkController.createCollectionZkNode Collection zkNode exists
   [junit4]   2> 47797 T246 n:127.0.0.1:33989__t%2Ft oascc.ZkStateReader.readConfigName Load collection config from:/collections/collection1
   [junit4]   2> 47797 T246 n:127.0.0.1:33989__t%2Ft oascc.ZkStateReader.readConfigName path=/collections/collection1 configName=conf1 specified config exists in ZooKeeper
   [junit4]   2> 47797 T246 n:127.0.0.1:33989__t%2Ft oasc.SolrResourceLoader.<init> new SolrResourceLoader for directory: '/home/jenkins/workspace/Lucene-Solr-trunk-Linux/solr/build/solr-solrj/test/J1/temp/solr.client.solrj.impl.CloudSolrClientTest 5C6E96F65C4695B7-001/shard-2-001/cores/collection1/'
   [junit4]   2> 47805 T246 n:127.0.0.1:33989__t%2Ft oasc.Config.<init> loaded config solrconfig.xml with version 0 
   [junit4]   2> 47808 T246 n:127.0.0.1:33989__t%2Ft oasc.SolrConfig.refreshRequestParams current version of requestparams : -1
   [junit4]   2> 47809 T246 n:127.0.0.1:33989__t%2Ft oasc.SolrConfig.<init> Using Lucene MatchVersion: 6.0.0
   [junit4]   2> 47813 T246 n:127.0.0.1:33989__t%2Ft oasc.SolrConfig.<init> Loaded SolrConfig: solrconfig.xml
   [junit4]   2> 47813 T246 n:127.0.0.1:33989__t%2Ft oass.IndexSchema.readSchema Reading Solr Schema from /configs/conf1/schema.xml
   [junit4]   2> 47816 T246 n:127.0.0.1:33989__t%2Ft oass.IndexSchema.readSchema [collection1] Schema name=test
   [junit4]   2> 47876 T246 n:127.0.0.1:33989__t%2Ft oass.IndexSchema.readSchema default search field in schema is text
   [junit4]   2> 47877 T246 n:127.0.0.1:33989__t%2Ft oass.IndexSchema.readSchema unique key field: id
   [junit4]   2> 47878 T246 n:127.0.0.1:33989__t%2Ft oass.IndexSchema.loadCopyFields WARN Field lowerfilt1and2 is not multivalued and destination for multiple copyFields (2)
   [junit4]   2> 47878 T246 n:127.0.0.1:33989__t%2Ft oass.IndexSchema.loadCopyFields WARN Field text is not multivalued and destination for multiple copyFields (3)
   [junit4]   2> 47879 T246 n:127.0.0.1:33989__t%2Ft oasc.CoreContainer.create Creating SolrCore 'collection1' using configuration from collection collection1
   [junit4]   2> 47879 T246 n:127.0.0.1:33989__t%2Ft x:collection1 oasc.SolrCore.initDirectoryFactory org.apache.solr.core.MockDirectoryFactory
   [junit4]   2> 47879 T246 n:127.0.0.1:33989__t%2Ft x:collection1 oasc.SolrCore.<init> [[collection1] ] Opening new SolrCore at [/home/jenkins/workspace/Lucene-Solr-trunk-Linux/solr/build/solr-solrj/test/J1/temp/solr.client.solrj.impl.CloudSolrClientTest 5C6E96F65C4695B7-001/shard-2-001/cores/collection1/], dataDir=[null]
   [junit4]   2> 47880 T246 n:127.0.0.1:33989__t%2Ft x:collection1 oasc.SolrCore.initInfoRegistry JMX monitoring not detected for core: collection1
   [junit4]   2> 47880 T246 n:127.0.0.1:33989__t%2Ft x:collection1 oasc.CachingDirectoryFactory.get return new directory for /home/jenkins/workspace/Lucene-Solr-trunk-Linux/solr/build/solr-solrj/test/J1/temp/solr.client.solrj.impl.CloudSolrClientTest 5C6E96F65C4695B7-001/shard-2-001/cores/collection1/data
   [junit4]   2> 47880 T246 n:127.0.0.1:33989__t%2Ft x:collection1 oasc.SolrCore.getNewIndexDir New index directory detected: old=null new=/home/jenkins/workspace/Lucene-Solr-trunk-Linux/solr/build/solr-solrj/test/J1/temp/solr.client.solrj.impl.CloudSolrClientTest 5C6E96F65C4695B7-001/shard-2-001/cores/collection1/data/index/
   [junit4]   2> 47881 T246 n:127.0.0.1:33989__t%2Ft x:collection1 oasc.SolrCore.initIndex WARN [collection1] Solr index directory '/home/jenkins/workspace/Lucene-Solr-trunk-Linux/solr/build/solr-solrj/test/J1/temp/solr.client.solrj.impl.CloudSolrClientTest 5C6E96F65C4695B7-001/shard-2-001/cores/collection1/data/index' doesn't exist. Creating new index...
   [junit4]   2> 47881 T246 n:127.0.0.1:33989__t%2Ft x:collection1 oasc.CachingDirectoryFactory.get return new directory for /home/jenkins/workspace/Lucene-Solr-trunk-Linux/solr/build/solr-solrj/test/J1/temp/solr.client.solrj.impl.CloudSolrClientTest 5C6E96F65C4695B7-001/shard-2-001/cores/collection1/data/index
   [junit4]   2> 47882 T246 n:127.0.0.1:33989__t%2Ft x:collection1 oasc.SolrDeletionPolicy.onCommit SolrDeletionPolicy.onCommit: commits: num=1
   [junit4]   2> 		commit{dir=MockDirectoryWrapper(RAMDirectory@49f187ea lockFactory=org.apache.lucene.store.SingleInstanceLockFactory@1b5b9f3),segFN=segments_1,generation=1}
   [junit4]   2> 47882 T246 n:127.0.0.1:33989__t%2Ft x:collection1 oasc.SolrDeletionPolicy.updateCommits newest commit generation = 1
   [junit4]   2> 47883 T246 n:127.0.0.1:33989__t%2Ft x:collection1 oasc.SolrCore.loadUpdateProcessorChains no updateRequestProcessorChain defined as default, creating implicit default
   [junit4]   2> 47885 T246 n:127.0.0.1:33989__t%2Ft x:collection1 oashl.XMLLoader.init xsltCacheLifetimeSeconds=60
   [junit4]   2> 47886 T246 n:127.0.0.1:33989__t%2Ft x:collection1 oashl.XMLLoader.init xsltCacheLifetimeSeconds=60
   [junit4]   2> 47886 T246 n:127.0.0.1:33989__t%2Ft x:collection1 oashl.XMLLoader.init xsltCacheLifetimeSeconds=60
   [junit4]   2> 47887 T246 n:127.0.0.1:33989__t%2Ft x:collection1 oashl.XMLLoader.init xsltCacheLifetimeSeconds=60
   [junit4]   2> 47887 T246 n:127.0.0.1:33989__t%2Ft x:collection1 oasc.PluginBag.createPlugin requestHandler : '/replication' created with startup=lazy 
   [junit4]   2> 47889 T246 n:127.0.0.1:33989__t%2Ft x:collection1 oasc.SolrResourceLoader.findClass WARN Solr loaded a deprecated plugin/analysis class [org.apache.solr.handler.admin.AdminHandlers]. Please consult documentation how to replace it accordingly.
   [junit4]   2> 47889 T246 n:127.0.0.1:33989__t%2Ft x:collection1 oasc.SolrResourceLoader.findClass WARN Solr loaded a deprecated plugin/analysis class [org.apache.solr.handler.admin.AdminHandlers]. Please consult documentation how to replace it accordingly.
   [junit4]   2> 47889 T246 n:127.0.0.1:33989__t%2Ft x:collection1 oasc.RequestHandlers.initHandlersFromConfig Registered paths: /admin/mbeans,standard,,/update/csv,/update/json/docs,/admin/luke,/admin/segments,/get,/admin/system,/replication,/admin/properties,/config,/schema,/admin/plugins,/admin/logging,/update/json,/admin,/admin/threads,/admin/ping,/update,/admin/file
   [junit4]   2> 47889 T246 n:127.0.0.1:33989__t%2Ft x:collection1 oasc.RequestHandlers.initHandlersFromConfig WARN no default request handler is registered (either '/select' or 'standard')
   [junit4]   2> 47890 T246 n:127.0.0.1:33989__t%2Ft x:collection1 oasc.SolrCore.initStatsCache Using default statsCache cache: org.apache.solr.search.stats.LocalStatsCache
   [junit4]   2> 47890 T246 n:127.0.0.1:33989__t%2Ft x:collection1 oasu.UpdateHandler.<init> Using UpdateLog implementation: org.apache.solr.update.UpdateLog
   [junit4]   2> 47890 T246 n:127.0.0.1:33989__t%2Ft x:collection1 oasu.UpdateLog.init Initializing UpdateLog: dataDir= defaultSyncLevel=FLUSH numRecordsToKeep=100 maxNumLogsToKeep=10
   [junit4]   2> 47891 T246 n:127.0.0.1:33989__t%2Ft x:collection1 oasu.CommitTracker.<init> Hard AutoCommit: disabled
   [junit4]   2> 47891 T246 n:127.0.0.1:33989__t%2Ft x:collection1 oasu.CommitTracker.<init> Soft AutoCommit: disabled
   [junit4]   2> 47892 T246 n:127.0.0.1:33989

[...truncated too long message...]

tUpdateHandler2{commits=0,autocommits=0,soft autocommits=0,optimizes=0,rollbacks=0,expungeDeletes=0,docsPending=0,adds=0,deletesById=0,deletesByQuery=0,errors=0,cumulative_adds=0,cumulative_deletesById=0,cumulative_deletesByQuery=0,cumulative_errors=0,transaction_logs_total_size=0,transaction_logs_total_number=0}
   [junit4]   2> 129299 T654 n:127.0.0.1:50560__t%2Ft oasu.SolrCoreState.decrefSolrCoreState Closing SolrCoreState
   [junit4]   2> 129299 T654 n:127.0.0.1:50560__t%2Ft oasu.DefaultSolrCoreState.closeIndexWriter SolrCoreState ref count has reached 0 - closing IndexWriter
   [junit4]   2> 129299 T654 n:127.0.0.1:50560__t%2Ft oasu.DefaultSolrCoreState.closeIndexWriter closing IndexWriter with IndexWriterCloser
   [junit4]   2> 129300 T654 n:127.0.0.1:50560__t%2Ft oasc.SolrCore.closeSearcher [collection1] Closing main searcher on request.
   [junit4]   2> 129300 T654 n:127.0.0.1:50560__t%2Ft oasc.CachingDirectoryFactory.close Closing MockDirectoryFactory - 2 directories currently being tracked
   [junit4]   2> 129301 T654 n:127.0.0.1:50560__t%2Ft oasc.CachingDirectoryFactory.closeCacheValue looking to close /home/jenkins/workspace/Lucene-Solr-trunk-Linux/solr/build/solr-solrj/test/J1/../../../../../../../../../home/jenkins/workspace/Lucene-Solr-trunk-Linux/solr/build/solr-solrj/test/J1/temp/solr.client.solrj.impl.CloudSolrClientTest 5C6E96F65C4695B7-001/shard-3-003/cores/collection1/data/index [CachedDir<<refCount=0;path=/home/jenkins/workspace/Lucene-Solr-trunk-Linux/solr/build/solr-solrj/test/J1/../../../../../../../../../home/jenkins/workspace/Lucene-Solr-trunk-Linux/solr/build/solr-solrj/test/J1/temp/solr.client.solrj.impl.CloudSolrClientTest 5C6E96F65C4695B7-001/shard-3-003/cores/collection1/data/index;done=false>>]
   [junit4]   2> 129301 T654 n:127.0.0.1:50560__t%2Ft oasc.CachingDirectoryFactory.close Closing directory: /home/jenkins/workspace/Lucene-Solr-trunk-Linux/solr/build/solr-solrj/test/J1/../../../../../../../../../home/jenkins/workspace/Lucene-Solr-trunk-Linux/solr/build/solr-solrj/test/J1/temp/solr.client.solrj.impl.CloudSolrClientTest 5C6E96F65C4695B7-001/shard-3-003/cores/collection1/data/index
   [junit4]   2> 129301 T654 n:127.0.0.1:50560__t%2Ft oasc.CachingDirectoryFactory.closeCacheValue looking to close /home/jenkins/workspace/Lucene-Solr-trunk-Linux/solr/build/solr-solrj/test/J1/../../../../../../../../../home/jenkins/workspace/Lucene-Solr-trunk-Linux/solr/build/solr-solrj/test/J1/temp/solr.client.solrj.impl.CloudSolrClientTest 5C6E96F65C4695B7-001/shard-3-003/cores/collection1/data [CachedDir<<refCount=0;path=/home/jenkins/workspace/Lucene-Solr-trunk-Linux/solr/build/solr-solrj/test/J1/../../../../../../../../../home/jenkins/workspace/Lucene-Solr-trunk-Linux/solr/build/solr-solrj/test/J1/temp/solr.client.solrj.impl.CloudSolrClientTest 5C6E96F65C4695B7-001/shard-3-003/cores/collection1/data;done=false>>]
   [junit4]   2> 129301 T654 n:127.0.0.1:50560__t%2Ft oasc.CachingDirectoryFactory.close Closing directory: /home/jenkins/workspace/Lucene-Solr-trunk-Linux/solr/build/solr-solrj/test/J1/../../../../../../../../../home/jenkins/workspace/Lucene-Solr-trunk-Linux/solr/build/solr-solrj/test/J1/temp/solr.client.solrj.impl.CloudSolrClientTest 5C6E96F65C4695B7-001/shard-3-003/cores/collection1/data
   [junit4]   2> 129301 T654 n:127.0.0.1:50560__t%2Ft oasc.LeaderElector$ElectionWatcher.process WARN  org.apache.zookeeper.KeeperException$SessionExpiredException: KeeperErrorCode = Session expired for /collections/collection1/leader_elect/shard2/election/93854266831405067-core_node3-n_0000000002
   [junit4]   2> 	at org.apache.zookeeper.KeeperException.create(KeeperException.java:127)
   [junit4]   2> 	at org.apache.zookeeper.KeeperException.create(KeeperException.java:51)
   [junit4]   2> 	at org.apache.zookeeper.ZooKeeper.delete(ZooKeeper.java:873)
   [junit4]   2> 	at org.apache.solr.common.cloud.SolrZkClient$2.execute(SolrZkClient.java:244)
   [junit4]   2> 	at org.apache.solr.common.cloud.SolrZkClient$2.execute(SolrZkClient.java:241)
   [junit4]   2> 	at org.apache.solr.common.cloud.ZkCmdExecutor.retryOperation(ZkCmdExecutor.java:61)
   [junit4]   2> 	at org.apache.solr.common.cloud.SolrZkClient.delete(SolrZkClient.java:241)
   [junit4]   2> 	at org.apache.solr.cloud.ElectionContext.cancelElection(ElectionContext.java:80)
   [junit4]   2> 	at org.apache.solr.cloud.ShardLeaderElectionContext.runLeaderProcess(ElectionContext.java:240)
   [junit4]   2> 	at org.apache.solr.cloud.LeaderElector.runIamLeaderProcess(LeaderElector.java:198)
   [junit4]   2> 	at org.apache.solr.cloud.LeaderElector.checkIfIamLeader(LeaderElector.java:159)
   [junit4]   2> 	at org.apache.solr.cloud.LeaderElector.joinElection(LeaderElector.java:348)
   [junit4]   2> 	at org.apache.solr.cloud.LeaderElector.joinElection(LeaderElector.java:256)
   [junit4]   2> 	at org.apache.solr.cloud.ShardLeaderElectionContext.rejoinLeaderElection(ElectionContext.java:492)
   [junit4]   2> 	at org.apache.solr.cloud.ShardLeaderElectionContext.runLeaderProcess(ElectionContext.java:248)
   [junit4]   2> 	at org.apache.solr.cloud.LeaderElector.runIamLeaderProcess(LeaderElector.java:198)
   [junit4]   2> 	at org.apache.solr.cloud.LeaderElector.checkIfIamLeader(LeaderElector.java:159)
   [junit4]   2> 	at org.apache.solr.cloud.LeaderElector.access$200(LeaderElector.java:56)
   [junit4]   2> 	at org.apache.solr.cloud.LeaderElector$ElectionWatcher.process(LeaderElector.java:390)
   [junit4]   2> 	at org.apache.solr.common.cloud.SolrZkClient$3$1.run(SolrZkClient.java:264)
   [junit4]   2> 	at java.util.concurrent.Executors$RunnableAdapter.call(Executors.java:511)
   [junit4]   2> 	at java.util.concurrent.FutureTask.run(FutureTask.java:266)
   [junit4]   2> 	at org.apache.solr.common.util.ExecutorUtil$MDCAwareThreadPoolExecutor$1.run(ExecutorUtil.java:148)
   [junit4]   2> 	at java.util.concurrent.ThreadPoolExecutor.runWorker(ThreadPoolExecutor.java:1142)
   [junit4]   2> 	at java.util.concurrent.ThreadPoolExecutor$Worker.run(ThreadPoolExecutor.java:617)
   [junit4]   2> 	at java.lang.Thread.run(Thread.java:745)
   [junit4]   2> 
   [junit4]   2> 129303 T164 oejs.AbstractConnector.doStop Stopped ServerConnector@faa4f7a{SSL-http/1.1}{127.0.0.1:0}
   [junit4]   2> 129303 T164 oejsh.ContextHandler.doStop Stopped o.e.j.s.ServletContextHandler@15645893{/_t/t,null,UNAVAILABLE}
   [junit4]   2> 129304 T164 c:control_collection s:shard1 x:collection1 oasc.ChaosMonkey.monkeyLog monkey: stop shard! 53975
   [junit4]   2> 129305 T164 c:control_collection s:shard1 x:collection1 oasc.ZkTestServer.send4LetterWord connecting to 127.0.0.1:47977 47977
   [junit4]   2> 129312 T552 c:control_collection s:shard1 x:collection1 oasc.ZkTestServer.send4LetterWord connecting to 127.0.0.1:47977 47977
   [junit4]   2> 129313 T552 c:control_collection s:shard1 x:collection1 oasc.ZkTestServer$ZKServerMain.runFromConfig WARN Watch limit violations: 
   [junit4]   2> 	Maximum concurrent create/delete watches above limit:
   [junit4]   2> 	
   [junit4]   2> 		5	/solr/aliases.json
   [junit4]   2> 		5	/solr/clusterstate.json
   [junit4]   2> 		4	/solr/configs/conf1
   [junit4]   2> 	
   [junit4]   2> 	Maximum concurrent children watches above limit:
   [junit4]   2> 	
   [junit4]   2> 		5	/solr/live_nodes
   [junit4]   2> 		4	/solr/overseer/queue
   [junit4]   2> 		4	/solr/overseer/collection-queue-work
   [junit4]   2> 	
   [junit4]   2> 129314 T164 c:control_collection s:shard1 x:collection1 oas.SolrTestCaseJ4.deleteCore ###deleteCore
   [junit4]   2> NOTE: leaving temporary files on disk at: /home/jenkins/workspace/Lucene-Solr-trunk-Linux/solr/build/solr-solrj/test/J1/temp/solr.client.solrj.impl.CloudSolrClientTest 5C6E96F65C4695B7-001
   [junit4]   2> 87877 T163 ccr.ThreadLeakControl.checkThreadLeaks WARNING Will linger awaiting termination of 2 leaked thread(s).
   [junit4]   2> NOTE: test params are: codec=CheapBastard, sim=RandomSimilarityProvider(queryNorm=true,coord=crazy): {}, locale=ja_JP_JP_#u-ca-japanese, timezone=America/Anguilla
   [junit4]   2> NOTE: Linux 3.13.0-52-generic amd64/Oracle Corporation 1.8.0_45 (64-bit)/cpus=12,threads=1,free=411460000,total=508887040
   [junit4]   2> NOTE: All tests run in this JVM: [NoOpResponseParserTest, TestSolrProperties, GetByIdTest, FieldAnalysisResponseTest, DocumentAnalysisResponseTest, SolrPingTest, QueryResponseTest, SolrQueryTest, SolrDocumentTest, SolrExampleStreamingTest, SolrExampleEmbeddedTest, TestBatchUpdate, TestSpellCheckResponse, TestEmbeddedSolrServer, TestJavaBinCodec, TestDocumentObjectBinder, ModifiableSolrParamsTest, TestFastInputStream, SolrExceptionTest, ClientUtilsTest, CloudSolrClientTest]
   [junit4] Completed [60/60] on J1 in 88.65s, 3 tests, 1 failure <<< FAILURES!

[...truncated 11 lines...]
BUILD FAILED
/home/jenkins/workspace/Lucene-Solr-trunk-Linux/build.xml:526: The following error occurred while executing this line:
/home/jenkins/workspace/Lucene-Solr-trunk-Linux/build.xml:474: The following error occurred while executing this line:
/home/jenkins/workspace/Lucene-Solr-trunk-Linux/build.xml:61: The following error occurred while executing this line:
/home/jenkins/workspace/Lucene-Solr-trunk-Linux/extra-targets.xml:39: The following error occurred while executing this line:
/home/jenkins/workspace/Lucene-Solr-trunk-Linux/solr/build.xml:242: The following error occurred while executing this line:
/home/jenkins/workspace/Lucene-Solr-trunk-Linux/solr/common-build.xml:512: The following error occurred while executing this line:
/home/jenkins/workspace/Lucene-Solr-trunk-Linux/lucene/common-build.xml:1415: The following error occurred while executing this line:
/home/jenkins/workspace/Lucene-Solr-trunk-Linux/lucene/common-build.xml:973: There were test failures: 60 suites, 391 tests, 1 failure

Total time: 46 minutes 15 seconds
Build step 'Invoke Ant' marked build as failure
Archiving artifacts
Recording test results
Email was triggered for: Failure - Any
Sending email for trigger: Failure - Any



Mime
View raw message