lucene-dev mailing list archives

Site index · List index
Message view « Date » · « Thread »
Top « Date » · « Thread »
From Policeman Jenkins Server <jenk...@thetaphi.de>
Subject [JENKINS] Lucene-Solr-trunk-Windows (32bit/jdk1.8.0_45) - Build # 4859 - Failure!
Date Wed, 27 May 2015 09:58:58 GMT
Build: http://jenkins.thetaphi.de/job/Lucene-Solr-trunk-Windows/4859/
Java: 32bit/jdk1.8.0_45 -server -XX:+UseG1GC

1 tests failed.
FAILED:  org.apache.solr.cloud.MultiThreadedOCPTest.test

Error Message:
Captured an uncaught exception in thread: Thread[id=9599, name=parallelCoreAdminExecutor-4953-thread-15, state=RUNNABLE, group=TGRP-MultiThreadedOCPTest]

Stack Trace:
com.carrotsearch.randomizedtesting.UncaughtExceptionError: Captured an uncaught exception in thread: Thread[id=9599, name=parallelCoreAdminExecutor-4953-thread-15, state=RUNNABLE, group=TGRP-MultiThreadedOCPTest]
	at __randomizedtesting.SeedInfo.seed([FF25C44C4CBB8E2A:7771FB96E247E3D2]:0)
Caused by: java.lang.AssertionError: Too many closes on SolrCore
	at __randomizedtesting.SeedInfo.seed([FF25C44C4CBB8E2A]:0)
	at org.apache.solr.core.SolrCore.close(SolrCore.java:1150)
	at org.apache.solr.common.util.IOUtils.closeQuietly(IOUtils.java:31)
	at org.apache.solr.core.CoreContainer.create(CoreContainer.java:652)
	at org.apache.solr.core.CoreContainer.create(CoreContainer.java:611)
	at org.apache.solr.handler.admin.CoreAdminHandler.handleCreateAction(CoreAdminHandler.java:628)
	at org.apache.solr.handler.admin.CoreAdminHandler.handleRequestInternal(CoreAdminHandler.java:213)
	at org.apache.solr.handler.admin.CoreAdminHandler$ParallelCoreAdminHandlerThread.run(CoreAdminHandler.java:1249)
	at org.apache.solr.common.util.ExecutorUtil$MDCAwareThreadPoolExecutor$1.run(ExecutorUtil.java:148)
	at java.util.concurrent.ThreadPoolExecutor.runWorker(ThreadPoolExecutor.java:1142)
	at java.util.concurrent.ThreadPoolExecutor$Worker.run(ThreadPoolExecutor.java:617)
	at java.lang.Thread.run(Thread.java:745)




Build Log:
[...truncated 10605 lines...]
   [junit4] Suite: org.apache.solr.cloud.MultiThreadedOCPTest
   [junit4]   2> Creating dataDir: C:\Users\JenkinsSlave\workspace\Lucene-Solr-trunk-Windows\solr\build\solr-core\test\J1\temp\solr.cloud.MultiThreadedOCPTest FF25C44C4CBB8E2A-001\init-core-data-001
   [junit4]   2> 1768625 T9263 oas.SolrTestCaseJ4.buildSSLConfig Randomized ssl (false) and clientAuth (true)
   [junit4]   2> 1768626 T9263 oas.BaseDistributedSearchTestCase.initHostContext Setting hostContext system property: /
   [junit4]   2> 1768627 T9263 oasc.ZkTestServer.run STARTING ZK TEST SERVER
   [junit4]   2> 1768628 T9264 oasc.ZkTestServer$2$1.setClientPort client port:0.0.0.0/0.0.0.0:0
   [junit4]   2> 1768629 T9264 oasc.ZkTestServer$ZKServerMain.runFromConfig Starting server
   [junit4]   2> 1768701 T9263 oasc.ZkTestServer.run start zk server on port:57319
   [junit4]   2> 1768729 T9263 oasc.AbstractZkTestCase.putConfig put C:\Users\JenkinsSlave\workspace\Lucene-Solr-trunk-Windows\solr\core\src\test-files\solr\collection1\conf\solrconfig-tlog.xml to /configs/conf1/solrconfig.xml
   [junit4]   2> 1768737 T9263 oasc.AbstractZkTestCase.putConfig put C:\Users\JenkinsSlave\workspace\Lucene-Solr-trunk-Windows\solr\core\src\test-files\solr\collection1\conf\schema.xml to /configs/conf1/schema.xml
   [junit4]   2> 1768742 T9263 oasc.AbstractZkTestCase.putConfig put C:\Users\JenkinsSlave\workspace\Lucene-Solr-trunk-Windows\solr\core\src\test-files\solr\collection1\conf\solrconfig.snippet.randomindexconfig.xml to /configs/conf1/solrconfig.snippet.randomindexconfig.xml
   [junit4]   2> 1768746 T9263 oasc.AbstractZkTestCase.putConfig put C:\Users\JenkinsSlave\workspace\Lucene-Solr-trunk-Windows\solr\core\src\test-files\solr\collection1\conf\stopwords.txt to /configs/conf1/stopwords.txt
   [junit4]   2> 1768749 T9263 oasc.AbstractZkTestCase.putConfig put C:\Users\JenkinsSlave\workspace\Lucene-Solr-trunk-Windows\solr\core\src\test-files\solr\collection1\conf\protwords.txt to /configs/conf1/protwords.txt
   [junit4]   2> 1768753 T9263 oasc.AbstractZkTestCase.putConfig put C:\Users\JenkinsSlave\workspace\Lucene-Solr-trunk-Windows\solr\core\src\test-files\solr\collection1\conf\currency.xml to /configs/conf1/currency.xml
   [junit4]   2> 1768759 T9263 oasc.AbstractZkTestCase.putConfig put C:\Users\JenkinsSlave\workspace\Lucene-Solr-trunk-Windows\solr\core\src\test-files\solr\collection1\conf\enumsConfig.xml to /configs/conf1/enumsConfig.xml
   [junit4]   2> 1768764 T9263 oasc.AbstractZkTestCase.putConfig put C:\Users\JenkinsSlave\workspace\Lucene-Solr-trunk-Windows\solr\core\src\test-files\solr\collection1\conf\open-exchange-rates.json to /configs/conf1/open-exchange-rates.json
   [junit4]   2> 1768770 T9263 oasc.AbstractZkTestCase.putConfig put C:\Users\JenkinsSlave\workspace\Lucene-Solr-trunk-Windows\solr\core\src\test-files\solr\collection1\conf\mapping-ISOLatin1Accent.txt to /configs/conf1/mapping-ISOLatin1Accent.txt
   [junit4]   2> 1768775 T9263 oasc.AbstractZkTestCase.putConfig put C:\Users\JenkinsSlave\workspace\Lucene-Solr-trunk-Windows\solr\core\src\test-files\solr\collection1\conf\old_synonyms.txt to /configs/conf1/old_synonyms.txt
   [junit4]   2> 1768778 T9263 oasc.AbstractZkTestCase.putConfig put C:\Users\JenkinsSlave\workspace\Lucene-Solr-trunk-Windows\solr\core\src\test-files\solr\collection1\conf\synonyms.txt to /configs/conf1/synonyms.txt
   [junit4]   2> 1769095 T9263 oas.SolrTestCaseJ4.writeCoreProperties Writing core.properties file to C:\Users\JenkinsSlave\workspace\Lucene-Solr-trunk-Windows\solr\build\solr-core\test\J1\temp\solr.cloud.MultiThreadedOCPTest FF25C44C4CBB8E2A-001\control-001\cores\collection1
   [junit4]   2> 1769104 T9263 oejs.Server.doStart jetty-9.2.10.v20150310
   [junit4]   2> 1769115 T9263 oejsh.ContextHandler.doStart Started o.e.j.s.ServletContextHandler@60a3c6{/,null,AVAILABLE}
   [junit4]   2> 1769121 T9263 oejs.AbstractConnector.doStart Started ServerConnector@1b79d44{HTTP/1.1}{127.0.0.1:57326}
   [junit4]   2> 1769121 T9263 oejs.Server.doStart Started @1775600ms
   [junit4]   2> 1769121 T9263 oascse.JettySolrRunner$1.lifeCycleStarted Jetty properties: {hostContext=/, hostPort=57326, coreRootDirectory=C:\Users\JenkinsSlave\workspace\Lucene-Solr-trunk-Windows\solr\build\solr-core\test\J1\..\..\..\..\..\..\..\..\..\Users\JenkinsSlave\workspace\Lucene-Solr-trunk-Windows\solr\build\solr-core\test\J1\temp\solr.cloud.MultiThreadedOCPTest FF25C44C4CBB8E2A-001\control-001\cores}
   [junit4]   2> 1769121 T9263 oass.SolrDispatchFilter.init SolrDispatchFilter.init()sun.misc.Launcher$AppClassLoader@e2f2a
   [junit4]   2> 1769122 T9263 oasc.SolrResourceLoader.<init> new SolrResourceLoader for directory: 'C:\Users\JenkinsSlave\workspace\Lucene-Solr-trunk-Windows\solr\build\solr-core\test\J1\..\..\..\..\..\..\..\..\..\Users\JenkinsSlave\workspace\Lucene-Solr-trunk-Windows\solr\build\solr-core\test\J1\temp\solr.cloud.MultiThreadedOCPTest FF25C44C4CBB8E2A-001\control-001\'
   [junit4]   2> 1769158 T9263 oasc.SolrXmlConfig.fromFile Loading container configuration from C:\Users\JenkinsSlave\workspace\Lucene-Solr-trunk-Windows\solr\build\solr-core\test\J1\..\..\..\..\..\..\..\..\..\Users\JenkinsSlave\workspace\Lucene-Solr-trunk-Windows\solr\build\solr-core\test\J1\temp\solr.cloud.MultiThreadedOCPTest FF25C44C4CBB8E2A-001\control-001\solr.xml
   [junit4]   2> 1769168 T9263 oasc.CorePropertiesLocator.<init> Config-defined core root directory: C:\Users\JenkinsSlave\workspace\Lucene-Solr-trunk-Windows\solr\build\solr-core\test\J1\..\..\..\..\..\..\..\..\..\Users\JenkinsSlave\workspace\Lucene-Solr-trunk-Windows\solr\build\solr-core\test\J1\temp\solr.cloud.MultiThreadedOCPTest FF25C44C4CBB8E2A-001\control-001\cores
   [junit4]   2> 1769168 T9263 oasc.CoreContainer.<init> New CoreContainer 2291434
   [junit4]   2> 1769168 T9263 oasc.CoreContainer.load Loading cores into CoreContainer [instanceDir=C:\Users\JenkinsSlave\workspace\Lucene-Solr-trunk-Windows\solr\build\solr-core\test\J1\..\..\..\..\..\..\..\..\..\Users\JenkinsSlave\workspace\Lucene-Solr-trunk-Windows\solr\build\solr-core\test\J1\temp\solr.cloud.MultiThreadedOCPTest FF25C44C4CBB8E2A-001\control-001\]
   [junit4]   2> 1769168 T9263 oasc.CoreContainer.load loading shared library: C:\Users\JenkinsSlave\workspace\Lucene-Solr-trunk-Windows\solr\build\solr-core\test\J1\..\..\..\..\..\..\..\..\..\Users\JenkinsSlave\workspace\Lucene-Solr-trunk-Windows\solr\build\solr-core\test\J1\temp\solr.cloud.MultiThreadedOCPTest FF25C44C4CBB8E2A-001\control-001\lib
   [junit4]   2> 1769169 T9263 oasc.SolrResourceLoader.addToClassLoader WARN Can't find (or read) directory to add to classloader: lib (resolved as: C:\Users\JenkinsSlave\workspace\Lucene-Solr-trunk-Windows\solr\build\solr-core\test\J1\..\..\..\..\..\..\..\..\..\Users\JenkinsSlave\workspace\Lucene-Solr-trunk-Windows\solr\build\solr-core\test\J1\temp\solr.cloud.MultiThreadedOCPTest FF25C44C4CBB8E2A-001\control-001\lib).
   [junit4]   2> 1769178 T9263 oashc.HttpShardHandlerFactory.init created with socketTimeout : 90000,urlScheme : ,connTimeout : 15000,maxConnectionsPerHost : 20,maxConnections : 10000,corePoolSize : 0,maximumPoolSize : 2147483647,maxThreadIdleTime : 5,sizeOfQueue : -1,fairnessPolicy : false,useRetries : false,
   [junit4]   2> 1769180 T9263 oasu.UpdateShardHandler.<init> Creating UpdateShardHandler HTTP client with params: socketTimeout=340000&connTimeout=45000&retry=true
   [junit4]   2> 1769180 T9263 oasl.LogWatcher.createWatcher SLF4J impl is org.slf4j.impl.Log4jLoggerFactory
   [junit4]   2> 1769180 T9263 oasl.LogWatcher.newRegisteredLogWatcher Registering Log Listener [Log4j (org.slf4j.impl.Log4jLoggerFactory)]
   [junit4]   2> 1769180 T9263 oasc.CoreContainer.load Node Name: 127.0.0.1
   [junit4]   2> 1769180 T9263 oasc.ZkContainer.initZooKeeper Zookeeper client=127.0.0.1:57319/solr
   [junit4]   2> 1769181 T9263 oasc.ZkController.checkChrootPath zkHost includes chroot
   [junit4]   2> 1769239 T9263 n:127.0.0.1:57326_ oasc.ZkController.createEphemeralLiveNode Register node as live in ZooKeeper:/live_nodes/127.0.0.1:57326_
   [junit4]   2> 1769250 T9263 n:127.0.0.1:57326_ oasc.Overseer.close Overseer (id=null) closing
   [junit4]   2> 1769251 T9263 n:127.0.0.1:57326_ oasc.OverseerElectionContext.runLeaderProcess I am going to be the leader 127.0.0.1:57326_
   [junit4]   2> 1769254 T9263 n:127.0.0.1:57326_ oasc.Overseer.start Overseer (id=93894735644524547-127.0.0.1:57326_-n_0000000000) starting
   [junit4]   2> 1769318 T9263 n:127.0.0.1:57326_ oasc.OverseerAutoReplicaFailoverThread.<init> Starting OverseerAutoReplicaFailoverThread autoReplicaFailoverWorkLoopDelay=10000 autoReplicaFailoverWaitAfterExpiration=30000 autoReplicaFailoverBadNodeExpiration=60000
   [junit4]   2> 1769319 T9292 n:127.0.0.1:57326_ oasc.Overseer$ClusterStateUpdater.run Starting to work on the main queue
   [junit4]   2> 1769320 T9293 n:127.0.0.1:57326_ oasc.OverseerCollectionProcessor.run Process current queue of collection creations
   [junit4]   2> 1769332 T9263 n:127.0.0.1:57326_ oasc.CoreContainer.initializeAuthenticationPlugin No authentication plugin used.
   [junit4]   2> 1769333 T9263 n:127.0.0.1:57326_ oasc.CoreContainer.intializeAuthorizationPlugin Security conf doesn't exist. Skipping setup for authorization module.
   [junit4]   2> 1769337 T9263 n:127.0.0.1:57326_ oasc.CorePropertiesLocator.discover Looking for core definitions underneath C:\Users\JenkinsSlave\workspace\Lucene-Solr-trunk-Windows\solr\build\solr-core\test\J1\..\..\..\..\..\..\..\..\..\Users\JenkinsSlave\workspace\Lucene-Solr-trunk-Windows\solr\build\solr-core\test\J1\temp\solr.cloud.MultiThreadedOCPTest FF25C44C4CBB8E2A-001\control-001\cores
   [junit4]   2> 1769338 T9263 n:127.0.0.1:57326_ oasc.CoreDescriptor.<init> CORE DESCRIPTOR: {name=collection1, config=solrconfig.xml, transient=false, schema=schema.xml, loadOnStartup=true, instanceDir=C:\Users\JenkinsSlave\workspace\Lucene-Solr-trunk-Windows\solr\build\solr-core\test\J1\..\..\..\..\..\..\..\..\..\Users\JenkinsSlave\workspace\Lucene-Solr-trunk-Windows\solr\build\solr-core\test\J1\temp\solr.cloud.MultiThreadedOCPTest FF25C44C4CBB8E2A-001\control-001\cores\collection1, collection=control_collection, absoluteInstDir=C:\Users\JenkinsSlave\workspace\Lucene-Solr-trunk-Windows\solr\build\solr-core\test\J1\..\..\..\..\..\..\..\..\..\Users\JenkinsSlave\workspace\Lucene-Solr-trunk-Windows\solr\build\solr-core\test\J1\temp\solr.cloud.MultiThreadedOCPTest FF25C44C4CBB8E2A-001\control-001\cores\collection1\, coreNodeName=, dataDir=data\, shard=}
   [junit4]   2> 1769340 T9263 n:127.0.0.1:57326_ oasc.CorePropertiesLocator.discoverUnder Found core collection1 in C:\Users\JenkinsSlave\workspace\Lucene-Solr-trunk-Windows\solr\build\solr-core\test\J1\..\..\..\..\..\..\..\..\..\Users\JenkinsSlave\workspace\Lucene-Solr-trunk-Windows\solr\build\solr-core\test\J1\temp\solr.cloud.MultiThreadedOCPTest FF25C44C4CBB8E2A-001\control-001\cores\collection1\
   [junit4]   2> 1769340 T9263 n:127.0.0.1:57326_ oasc.CorePropertiesLocator.discover Found 1 core definitions
   [junit4]   2> 1769341 T9295 n:127.0.0.1:57326_ c:control_collection x:collection1 oasc.ZkController.publish publishing core=collection1 state=down collection=control_collection
   [junit4]   2> 1769341 T9295 n:127.0.0.1:57326_ c:control_collection x:collection1 oasc.ZkController.publish numShards not found on descriptor - reading it from system property
   [junit4]   2> 1769342 T9291 n:127.0.0.1:57326_ oasc.DistributedQueue$LatchWatcher.process NodeChildrenChanged fired on path /overseer/queue state SyncConnected
   [junit4]   2> 1769342 T9295 n:127.0.0.1:57326_ oasc.ZkController.waitForCoreNodeName look for our core node name
   [junit4]   2> 1769346 T9292 n:127.0.0.1:57326_ oasc.Overseer$ClusterStateUpdater.run processMessage: queueSize: 1, message = {
   [junit4]   2> 	  "core":"collection1",
   [junit4]   2> 	  "roles":null,
   [junit4]   2> 	  "base_url":"http://127.0.0.1:57326",
   [junit4]   2> 	  "node_name":"127.0.0.1:57326_",
   [junit4]   2> 	  "numShards":"1",
   [junit4]   2> 	  "state":"down",
   [junit4]   2> 	  "shard":null,
   [junit4]   2> 	  "collection":"control_collection",
   [junit4]   2> 	  "operation":"state"} current state version: 0
   [junit4]   2> 1769348 T9292 n:127.0.0.1:57326_ oasco.ReplicaMutator.updateState Update state numShards=1 message={
   [junit4]   2> 	  "core":"collection1",
   [junit4]   2> 	  "roles":null,
   [junit4]   2> 	  "base_url":"http://127.0.0.1:57326",
   [junit4]   2> 	  "node_name":"127.0.0.1:57326_",
   [junit4]   2> 	  "numShards":"1",
   [junit4]   2> 	  "state":"down",
   [junit4]   2> 	  "shard":null,
   [junit4]   2> 	  "collection":"control_collection",
   [junit4]   2> 	  "operation":"state"}
   [junit4]   2> 1769348 T9292 n:127.0.0.1:57326_ oasco.ClusterStateMutator.createCollection building a new cName: control_collection
   [junit4]   2> 1769348 T9292 n:127.0.0.1:57326_ oasco.ReplicaMutator.updateState Assigning new node to shard shard=shard1
   [junit4]   2> 1770083 T9295 n:127.0.0.1:57326_ oasc.ZkController.waitForShardId waiting to find shard id in clusterstate for collection1
   [junit4]   2> 1770083 T9295 n:127.0.0.1:57326_ oasc.ZkController.createCollectionZkNode Check for collection zkNode:control_collection
   [junit4]   2> 1770084 T9295 n:127.0.0.1:57326_ oasc.ZkController.createCollectionZkNode Collection zkNode exists
   [junit4]   2> 1770085 T9295 n:127.0.0.1:57326_ oasc.SolrResourceLoader.<init> new SolrResourceLoader for directory: 'C:\Users\JenkinsSlave\workspace\Lucene-Solr-trunk-Windows\solr\build\solr-core\test\J1\..\..\..\..\..\..\..\..\..\Users\JenkinsSlave\workspace\Lucene-Solr-trunk-Windows\solr\build\solr-core\test\J1\temp\solr.cloud.MultiThreadedOCPTest FF25C44C4CBB8E2A-001\control-001\cores\collection1\'
   [junit4]   2> 1770122 T9295 n:127.0.0.1:57326_ oasc.Config.<init> loaded config solrconfig.xml with version 0 
   [junit4]   2> 1770156 T9295 n:127.0.0.1:57326_ oasc.SolrConfig.refreshRequestParams current version of requestparams : -1
   [junit4]   2> 1770159 T9295 n:127.0.0.1:57326_ oasc.SolrConfig.<init> Using Lucene MatchVersion: 6.0.0
   [junit4]   2> 1770167 T9295 n:127.0.0.1:57326_ oasc.SolrConfig.<init> Loaded SolrConfig: solrconfig.xml
   [junit4]   2> 1770170 T9295 n:127.0.0.1:57326_ oass.IndexSchema.readSchema Reading Solr Schema from /configs/conf1/schema.xml
   [junit4]   2> 1770177 T9295 n:127.0.0.1:57326_ oass.IndexSchema.readSchema [collection1] Schema name=test
   [junit4]   2> 1770368 T9295 n:127.0.0.1:57326_ oass.OpenExchangeRatesOrgProvider.init Initialized with rates=open-exchange-rates.json, refreshInterval=1440.
   [junit4]   2> 1770376 T9295 n:127.0.0.1:57326_ oass.IndexSchema.readSchema default search field in schema is text
   [junit4]   2> 1770377 T9295 n:127.0.0.1:57326_ oass.IndexSchema.readSchema unique key field: id
   [junit4]   2> 1770390 T9295 n:127.0.0.1:57326_ oass.FileExchangeRateProvider.reload Reloading exchange rates from file currency.xml
   [junit4]   2> 1770393 T9295 n:127.0.0.1:57326_ oass.FileExchangeRateProvider.reload Reloading exchange rates from file currency.xml
   [junit4]   2> 1770395 T9295 n:127.0.0.1:57326_ oass.OpenExchangeRatesOrgProvider.reload Reloading exchange rates from open-exchange-rates.json
   [junit4]   2> 1770398 T9295 n:127.0.0.1:57326_ oass.OpenExchangeRatesOrgProvider$OpenExchangeRates.<init> WARN Unknown key IMPORTANT NOTE
   [junit4]   2> 1770398 T9295 n:127.0.0.1:57326_ oass.OpenExchangeRatesOrgProvider$OpenExchangeRates.<init> WARN Expected key, got STRING
   [junit4]   2> 1770398 T9295 n:127.0.0.1:57326_ oass.OpenExchangeRatesOrgProvider.reload Reloading exchange rates from open-exchange-rates.json
   [junit4]   2> 1770400 T9295 n:127.0.0.1:57326_ oass.OpenExchangeRatesOrgProvider$OpenExchangeRates.<init> WARN Unknown key IMPORTANT NOTE
   [junit4]   2> 1770400 T9295 n:127.0.0.1:57326_ oass.OpenExchangeRatesOrgProvider$OpenExchangeRates.<init> WARN Expected key, got STRING
   [junit4]   2> 1770400 T9295 n:127.0.0.1:57326_ oasc.CoreContainer.create Creating SolrCore 'collection1' using configuration from collection control_collection
   [junit4]   2> 1770400 T9295 n:127.0.0.1:57326_ x:collection1 oasc.SolrCore.initDirectoryFactory org.apache.solr.core.MockDirectoryFactory
   [junit4]   2> 1770400 T9295 n:127.0.0.1:57326_ x:collection1 oasc.SolrCore.<init> [[collection1] ] Opening new SolrCore at [C:\Users\JenkinsSlave\workspace\Lucene-Solr-trunk-Windows\solr\build\solr-core\test\J1\..\..\..\..\..\..\..\..\..\Users\JenkinsSlave\workspace\Lucene-Solr-trunk-Windows\solr\build\solr-core\test\J1\temp\solr.cloud.MultiThreadedOCPTest FF25C44C4CBB8E2A-001\control-001\cores\collection1\], dataDir=[null]
   [junit4]   2> 1770400 T9295 n:127.0.0.1:57326_ x:collection1 oasc.JmxMonitoredMap.<init> JMX monitoring is enabled. Adding Solr mbeans to JMX Server: com.sun.jmx.mbeanserver.JmxMBeanServer@4fa910
   [junit4]   2> 1770401 T9295 n:127.0.0.1:57326_ x:collection1 oasc.CachingDirectoryFactory.get return new directory for C:\Users\JenkinsSlave\workspace\Lucene-Solr-trunk-Windows\solr\build\solr-core\test\J1\..\..\..\..\..\..\..\..\..\Users\JenkinsSlave\workspace\Lucene-Solr-trunk-Windows\solr\build\solr-core\test\J1\temp\solr.cloud.MultiThreadedOCPTest FF25C44C4CBB8E2A-001\control-001\cores\collection1\data\
   [junit4]   2> 1770401 T9295 n:127.0.0.1:57326_ x:collection1 oasc.SolrCore.getNewIndexDir New index directory detected: old=null new=C:\Users\JenkinsSlave\workspace\Lucene-Solr-trunk-Windows\solr\build\solr-core\test\J1\..\..\..\..\..\..\..\..\..\Users\JenkinsSlave\workspace\Lucene-Solr-trunk-Windows\solr\build\solr-core\test\J1\temp\solr.cloud.MultiThreadedOCPTest FF25C44C4CBB8E2A-001\control-001\cores\collection1\data\index/
   [junit4]   2> 1770401 T9295 n:127.0.0.1:57326_ x:collection1 oasc.SolrCore.initIndex WARN [collection1] Solr index directory 'C:\Users\JenkinsSlave\workspace\Lucene-Solr-trunk-Windows\solr\build\solr-core\test\J1\..\..\..\..\..\..\..\..\..\Users\JenkinsSlave\workspace\Lucene-Solr-trunk-Windows\solr\build\solr-core\test\J1\temp\solr.cloud.MultiThreadedOCPTest FF25C44C4CBB8E2A-001\control-001\cores\collection1\data\index' doesn't exist. Creating new index...
   [junit4]   2> 1770402 T9295 n:127.0.0.1:57326_ x:collection1 oasc.CachingDirectoryFactory.get return new directory for C:\Users\JenkinsSlave\workspace\Lucene-Solr-trunk-Windows\solr\build\solr-core\test\J1\..\..\..\..\..\..\..\..\..\Users\JenkinsSlave\workspace\Lucene-Solr-trunk-Windows\solr\build\solr-core\test\J1\temp\solr.cloud.MultiThreadedOCPTest FF25C44C4CBB8E2A-001\control-001\cores\collection1\data\index
   [junit4]   2> 1770403 T9295 n:127.0.0.1:57326_ x:collection1 oasu.RandomMergePolicy.<init> RandomMergePolicy wrapping class org.apache.lucene.index.LogByteSizeMergePolicy: [LogByteSizeMergePolicy: minMergeSize=1677721, mergeFactor=36, maxMergeSize=2147483648, maxMergeSizeForForcedMerge=9223372036854775807, calibrateSizeByDeletes=true, maxMergeDocs=2147483647, maxCFSSegmentSizeMB=8.796093022207999E12, noCFSRatio=1.0]
   [junit4]   2> 1770403 T9295 n:127.0.0.1:57326_ x:collection1 oasc.SolrDeletionPolicy.onCommit SolrDeletionPolicy.onCommit: commits: num=1
   [junit4]   2> 		commit{dir=MockDirectoryWrapper(RAMDirectory@15f8161 lockFactory=org.apache.lucene.store.SingleInstanceLockFactory@24f153),segFN=segments_1,generation=1}
   [junit4]   2> 1770403 T9295 n:127.0.0.1:57326_ x:collection1 oasc.SolrDeletionPolicy.updateCommits newest commit generation = 1
   [junit4]   2> 1770407 T9295 n:127.0.0.1:57326_ x:collection1 oasup.UpdateRequestProcessorChain.init creating updateRequestProcessorChain "nodistrib"
   [junit4]   2> 1770407 T9295 n:127.0.0.1:57326_ x:collection1 oasup.UpdateRequestProcessorChain.init creating updateRequestProcessorChain "dedupe"
   [junit4]   2> 1770408 T9295 n:127.0.0.1:57326_ x:collection1 oasup.UpdateRequestProcessorChain.init inserting DistributedUpdateProcessorFactory into updateRequestProcessorChain "dedupe"
   [junit4]   2> 1770408 T9295 n:127.0.0.1:57326_ x:collection1 oasup.UpdateRequestProcessorChain.init creating updateRequestProcessorChain "stored_sig"
   [junit4]   2> 1770408 T9295 n:127.0.0.1:57326_ x:collection1 oasup.UpdateRequestProcessorChain.init inserting DistributedUpdateProcessorFactory into updateRequestProcessorChain "stored_sig"
   [junit4]   2> 1770408 T9295 n:127.0.0.1:57326_ x:collection1 oasup.UpdateRequestProcessorChain.init creating updateRequestProcessorChain "distrib-dup-test-chain-explicit"
   [junit4]   2> 1770408 T9295 n:127.0.0.1:57326_ x:collection1 oasup.UpdateRequestProcessorChain.init creating updateRequestProcessorChain "distrib-dup-test-chain-implicit"
   [junit4]   2> 1770408 T9295 n:127.0.0.1:57326_ x:collection1 oasup.UpdateRequestProcessorChain.init inserting DistributedUpdateProcessorFactory into updateRequestProcessorChain "distrib-dup-test-chain-implicit"
   [junit4]   2> 1770409 T9295 n:127.0.0.1:57326_ x:collection1 oasc.SolrCore.loadUpdateProcessorChains no updateRequestProcessorChain defined as default, creating implicit default
   [junit4]   2> 1770413 T9295 n:127.0.0.1:57326_ x:collection1 oashl.XMLLoader.init xsltCacheLifetimeSeconds=60
   [junit4]   2> 1770416 T9295 n:127.0.0.1:57326_ x:collection1 oashl.XMLLoader.init xsltCacheLifetimeSeconds=60
   [junit4]   2> 1770417 T9295 n:127.0.0.1:57326_ x:collection1 oashl.XMLLoader.init xsltCacheLifetimeSeconds=60
   [junit4]   2> 1770419 T9295 n:127.0.0.1:57326_ x:collection1 oashl.XMLLoader.init xsltCacheLifetimeSeconds=60
   [junit4]   2> 1770422 T9295 n:127.0.0.1:57326_ x:collection1 oasc.RequestHandlers.initHandlersFromConfig Registered paths: /admin/mbeans,standard,/update/csv,/update/json/docs,/admin/luke,/admin/segments,/get,/admin/system,/replication,/admin/properties,/config,/schema,/admin/plugins,/admin/logging,/update/json,/admin/threads,/admin/ping,/update,/admin/file
   [junit4]   2> 1770423 T9295 n:127.0.0.1:57326_ x:collection1 oasc.SolrCore.initStatsCache Using default statsCache cache: org.apache.solr.search.stats.LocalStatsCache
   [junit4]   2> 1770424 T9295 n:127.0.0.1:57326_ x:collection1 oasu.UpdateHandler.<init> Using UpdateLog implementation: org.apache.solr.update.UpdateLog
   [junit4]   2> 1770425 T9295 n:127.0.0.1:57326_ x:collection1 oasu.UpdateLog.init Initializing UpdateLog: dataDir= defaultSyncLevel=FLUSH numRecordsToKeep=100 maxNumLogsToKeep=10 numVersionBuckets=65536
   [junit4]   2> 1770427 T9295 n:127.0.0.1:57326_ x:collection1 oasu.CommitTracker.<init> Hard AutoCommit: disabled
   [junit4]   2> 1770427 T9295 n:127.0.0.1:57326_ x:collection1 oasu.CommitTracker.<init> Soft AutoCommit: disabled
   [junit4]   2> 1770428 T9295 n:127.0.0.1:57326_ x:collection1 oasu.RandomMergePolicy.<init> RandomMergePolicy wrapping class org.apache.lucene.index.TieredMergePolicy: [TieredMergePolicy: maxMergeAtOnce=34, maxMergeAtOnceExplicit=42, maxMergedSegmentMB=50.3740234375, floorSegmentMB=1.0234375, forceMergeDeletesPctAllowed=0.9885171520723401, segmentsPerTier=50.0, maxCFSSegmentSizeMB=8.796093022207999E12, noCFSRatio=1.0
   [junit4]   2> 1770429 T9295 n:127.0.0.1:57326_ x:collection1 oasc.SolrDeletionPolicy.onInit SolrDeletionPolicy.onInit: commits: num=1
   [junit4]   2> 		commit{dir=MockDirectoryWrapper(RAMDirectory@15f8161 lockFactory=org.apache.lucene.store.SingleInstanceLockFactory@24f153),segFN=segments_1,generation=1}
   [junit4]   2> 1770429 T9295 n:127.0.0.1:57326_ x:collection1 oasc.SolrDeletionPolicy.updateCommits newest commit generation = 1
   [junit4]   2> 1770429 T9295 n:127.0.0.1:57326_ x:collection1 oass.SolrIndexSearcher.<init> Opening Searcher@162a125[collection1] main
   [junit4]   2> 1770437 T9295 n:127.0.0.1:57326_ x:collection1 oasr.ManagedResourceStorage.newStorageIO Setting up ZooKeeper-based storage for the RestManager with znodeBase: /configs/conf1
   [junit4]   2> 1770437 T9295 n:127.0.0.1:57326_ x:collection1 oasr.ManagedResourceStorage$ZooKeeperStorageIO.configure Configured ZooKeeperStorageIO with znodeBase: /configs/conf1
   [junit4]   2> 1770437 T9295 n:127.0.0.1:57326_ x:collection1 oasr.RestManager.init Initializing RestManager with initArgs: {}
   [junit4]   2> 1770437 T9295 n:127.0.0.1:57326_ x:collection1 oasr.ManagedResourceStorage.load Reading _rest_managed.json using ZooKeeperStorageIO:path=/configs/conf1
   [junit4]   2> 1770442 T9295 n:127.0.0.1:57326_ x:collection1 oasr.ManagedResourceStorage$ZooKeeperStorageIO.openInputStream No data found for znode /configs/conf1/_rest_managed.json
   [junit4]   2> 1770442 T9295 n:127.0.0.1:57326_ x:collection1 oasr.ManagedResourceStorage.load Loaded null at path _rest_managed.json using ZooKeeperStorageIO:path=/configs/conf1
   [junit4]   2> 1770442 T9295 n:127.0.0.1:57326_ x:collection1 oasr.RestManager.init Initializing 0 registered ManagedResources
   [junit4]   2> 1770442 T9295 n:127.0.0.1:57326_ x:collection1 oash.ReplicationHandler.inform Commits will be reserved for  10000
   [junit4]   2> 1770442 T9295 n:127.0.0.1:57326_ x:collection1 oasc.ZkController.getConfDirListeners watch zkdir /configs/conf1
   [junit4]   2> 1770443 T9296 n:127.0.0.1:57326_ x:collection1 oasc.SolrCore.registerSearcher [collection1] Registered new searcher Searcher@162a125[collection1] main{ExitableDirectoryReader(UninvertingDirectoryReader())}
   [junit4]   2> 1770444 T9295 n:127.0.0.1:57326_ x:collection1 oasu.UpdateLog.onFirstSearcher On first searcher opened, looking up max value of version field
   [junit4]   2> 1770444 T9295 n:127.0.0.1:57326_ x:collection1 oasu.VersionInfo.getMaxVersionFromIndex Refreshing highest value of _version_ for 65536 version buckets from index
   [junit4]   2> 1770444 T9295 n:127.0.0.1:57326_ x:collection1 oasu.VersionInfo.getMaxVersionFromIndex No terms found for _version_, cannot seed version bucket highest value from index
   [junit4]   2> 1770444 T9295 n:127.0.0.1:57326_ x:collection1 oasu.UpdateLog.seedBucketsWithHighestVersion Could not find max version in index or recent updates, using new clock 1502315772201926656
   [junit4]   2> 1770444 T9295 n:127.0.0.1:57326_ x:collection1 oasu.UpdateLog.seedBucketsWithHighestVersion Took 0 ms to seed version buckets with highest version 1502315772201926656
   [junit4]   2> 1770444 T9295 n:127.0.0.1:57326_ x:collection1 oasc.CoreContainer.registerCore registering core: collection1
   [junit4]   2> 1770445 T9299 n:127.0.0.1:57326_ c:control_collection s:shard1 x:collection1 oasc.ZkController.register Register replica - core:collection1 address:http://127.0.0.1:57326 collection:control_collection shard:shard1
   [junit4]   2> 1770447 T9263 n:127.0.0.1:57326_ oass.SolrDispatchFilter.init user.dir=C:\Users\JenkinsSlave\workspace\Lucene-Solr-trunk-Windows\solr\build\solr-core\test\J1
   [junit4]   2> 1770447 T9263 n:127.0.0.1:57326_ oass.SolrDispatchFilter.init SolrDispatchFilter.init() done
   [junit4]   2> 1770454 T9299 n:127.0.0.1:57326_ c:control_collection s:shard1 x:collection1 oasc.ShardLeaderElectionContext.runLeaderProcess Running the leader process for shard shard1
   [junit4]   2> 1770454 T9291 n:127.0.0.1:57326_ oasc.DistributedQueue$LatchWatcher.process NodeChildrenChanged fired on path /overseer/queue state SyncConnected
   [junit4]   2> 1770454 T9299 n:127.0.0.1:57326_ c:control_collection s:shard1 x:collection1 oasc.ShardLeaderElectionContext.waitForReplicasToComeUp Enough replicas found to continue.
   [junit4]   2> 1770455 T9299 n:127.0.0.1:57326_ c:control_collection s:shard1 x:collection1 oasc.ShardLeaderElectionContext.runLeaderProcess I may be the new leader - try and sync
   [junit4]   2> ASYNC  NEW_CORE C1618 name=collection1 org.apache.solr.core.SolrCore@1b06b89 url=http://127.0.0.1:57326/collection1 node=127.0.0.1:57326_ C1618_STATE=coll:control_collection core:collection1 props:{core=collection1, base_url=http://127.0.0.1:57326, node_name=127.0.0.1:57326_, state=down}
   [junit4]   2> 1770455 T9299 n:127.0.0.1:57326_ c:control_collection s:shard1 x:collection1 C1618 oasc.SyncStrategy.sync Sync replicas to http://127.0.0.1:57326/collection1/
   [junit4]   2> 1770455 T9292 n:127.0.0.1:57326_ oasc.Overseer$ClusterStateUpdater.run processMessage: queueSize: 1, message = {
   [junit4]   2> 	  "operation":"leader",
   [junit4]   2> 	  "shard":"shard1",
   [junit4]   2> 	  "collection":"control_collection"} current state version: 1
   [junit4]   2> 1770455 T9299 n:127.0.0.1:57326_ c:control_collection s:shard1 x:collection1 C1618 oasc.SyncStrategy.syncReplicas Sync Success - now sync replicas to me
   [junit4]   2> 1770456 T9299 n:127.0.0.1:57326_ c:control_collection s:shard1 x:collection1 C1618 oasc.SyncStrategy.syncToMe http://127.0.0.1:57326/collection1/ has no replicas
   [junit4]   2> 1770457 T9299 n:127.0.0.1:57326_ c:control_collection s:shard1 x:collection1 oasc.ShardLeaderElectionContext.runLeaderProcess I am the new leader: http://127.0.0.1:57326/collection1/ shard1
   [junit4]   2> 1770468 T9263 oasc.ChaosMonkey.monkeyLog monkey: init - expire sessions:false cause connection loss:false
   [junit4]   2> 1770468 T9263 oasc.AbstractFullDistribZkTestBase.createJettys Creating collection1 with stateFormat=2
   [junit4]   2> 1770476 T9291 n:127.0.0.1:57326_ oasc.DistributedQueue$LatchWatcher.process NodeChildrenChanged fired on path /overseer/queue state SyncConnected
   [junit4]   2> 1770477 T9292 n:127.0.0.1:57326_ oasc.Overseer$ClusterStateUpdater.run processMessage: queueSize: 1, message = {
   [junit4]   2> 	  "operation":"leader",
   [junit4]   2> 	  "shard":"shard1",
   [junit4]   2> 	  "collection":"control_collection",
   [junit4]   2> 	  "base_url":"http://127.0.0.1:57326",
   [junit4]   2> 	  "core":"collection1",
   [junit4]   2> 	  "state":"active"} current state version: 2
   [junit4]   2> 1770482 T9292 n:127.0.0.1:57326_ oasc.Overseer$ClusterStateUpdater.run processMessage: queueSize: 1, message = {
   [junit4]   2> 	  "operation":"create",
   [junit4]   2> 	  "name":"collection1",
   [junit4]   2> 	  "numShards":"2",
   [junit4]   2> 	  "stateFormat":"2"} current state version: 2
   [junit4]   2> 1770484 T9292 n:127.0.0.1:57326_ oasco.ClusterStateMutator.createCollection building a new cName: collection1
   [junit4]   2> 1770517 T9299 n:127.0.0.1:57326_ c:control_collection s:shard1 x:collection1 oasc.ZkController.register We are http://127.0.0.1:57326/collection1/ and leader is http://127.0.0.1:57326/collection1/
   [junit4]   2> 1770518 T9299 n:127.0.0.1:57326_ c:control_collection s:shard1 x:collection1 oasc.ZkController.register No LogReplay needed for core=collection1 baseURL=http://127.0.0.1:57326
   [junit4]   2> 1770518 T9299 n:127.0.0.1:57326_ c:control_collection s:shard1 x:collection1 oasc.ZkController.checkRecovery I am the leader, no recovery necessary
   [junit4]   2> 1770518 T9299 n:127.0.0.1:57326_ c:control_collection s:shard1 x:collection1 oasc.ZkController.publish publishing core=collection1 state=active collection=control_collection
   [junit4]   2> 1770518 T9299 n:127.0.0.1:57326_ c:control_collection s:shard1 x:collection1 oasc.ZkController.publish numShards not found on descriptor - reading it from system property
   [junit4]   2> 1770518 T9291 n:127.0.0.1:57326_ oasc.DistributedQueue$LatchWatcher.process NodeChildrenChanged fired on path /overseer/queue state SyncConnected
   [junit4]   2> 1770521 T9292 n:127.0.0.1:57326_ oasco.ZkStateWriter.writePendingUpdates going to create_collection /collections/collection1/state.json
   [junit4]   2> 1770528 T9292 n:127.0.0.1:57326_ oasc.Overseer$ClusterStateUpdater.run processMessage: queueSize: 1, message = {
   [junit4]   2> 	  "core":"collection1",
   [junit4]   2> 	  "core_node_name":"core_node1",
   [junit4]   2> 	  "roles":null,
   [junit4]   2> 	  "base_url":"http://127.0.0.1:57326",
   [junit4]   2> 	  "node_name":"127.0.0.1:57326_",
   [junit4]   2> 	  "numShards":"2",
   [junit4]   2> 	  "state":"active",
   [junit4]   2> 	  "shard":"shard1",
   [junit4]   2> 	  "collection":"control_collection",
   [junit4]   2> 	  "operation":"state"} current state version: 4
   [junit4]   2> 1770528 T9292 n:127.0.0.1:57326_ oasco.ReplicaMutator.updateState Update state numShards=2 message={
   [junit4]   2> 	  "core":"collection1",
   [junit4]   2> 	  "core_node_name":"core_node1",
   [junit4]   2> 	  "roles":null,
   [junit4]   2> 	  "base_url":"http://127.0.0.1:57326",
   [junit4]   2> 	  "node_name":"127.0.0.1:57326_",
   [junit4]   2> 	  "numShards":"2",
   [junit4]   2> 	  "state":"active",
   [junit4]   2> 	  "shard":"shard1",
   [junit4]   2> 	  "collection":"control_collection",
   [junit4]   2> 	  "operation":"state"}
   [junit4]   2> 1770530 T9291 n:127.0.0.1:57326_ oasc.DistributedQueue$LatchWatcher.process NodeChildrenChanged fired on path /overseer/queue state SyncConnected
   [junit4]   2> 1770776 T9263 oas.SolrTestCaseJ4.writeCoreProperties Writing core.properties file to C:\Users\JenkinsSlave\workspace\Lucene-Solr-trunk-Windows\solr\build\solr-core\test\J1\temp\solr.cloud.MultiThreadedOCPTest FF25C44C4CBB8E2A-001\shard-1-001\cores\collection1
   [junit4]   2> 1770779 T9263 oasc.AbstractFullDistribZkTestBase.createJettys create jetty 1 in directory C:\Users\JenkinsSlave\workspace\Lucene-Solr-trunk-Windows\solr\build\solr-core\test\J1\temp\solr.cloud.MultiThreadedOCPTest FF25C44C4CBB8E2A-001\shard-1-001
   [junit4]   2> 1770790 T9263 oejs.Server.doStart jetty-9.2.10.v20150310
   [junit4]   2> 1770806 T9263 oejsh.ContextHandler.doStart Started o.e.j.s.ServletContextHandler@5cbbbe{/,null,AVAILABLE}
   [junit4]   2> 1770807 T9263 oejs.AbstractConnector.doStart Started ServerConnector@f76565{HTTP/1.1}{127.0.0.1:57341}
   [junit4]   2> 1770807 T9263 oejs.Server.doStart Started @1778523ms
   [junit4]   2> 1770807 T9263 oascse.JettySolrRunner$1.lifeCycleStarted Jetty properties: {solrconfig=solrconfig.xml, hostContext=/, hostPort=57341, coreRootDirectory=C:\Users\JenkinsSlave\workspace\Lucene-Solr-trunk-Windows\solr\build\solr-core\test\J1\temp\solr.cloud.MultiThreadedOCPTest FF25C44C4CBB8E2A-001\shard-1-001\cores}
   [junit4]   2> 1770807 T9263 oass.SolrDispatchFilter.init SolrDispatchFilter.init()sun.misc.Launcher$AppClassLoader@e2f2a
   [junit4]   2> 1770807 T9263 oasc.SolrResourceLoader.<init> new SolrResourceLoader for directory: 'C:\Users\JenkinsSlave\workspace\Lucene-Solr-trunk-Windows\solr\build\solr-core\test\J1\temp\solr.cloud.MultiThreadedOCPTest FF25C44C4CBB8E2A-001\shard-1-001\'
   [junit4]   2> 1770849 T9263 oasc.SolrXmlConfig.fromFile Loading container configuration from C:\Users\JenkinsSlave\workspace\Lucene-Solr-trunk-Windows\solr\build\solr-core\test\J1\temp\solr.cloud.MultiThreadedOCPTest FF25C44C4CBB8E2A-001\shard-1-001\solr.xml
   [junit4]   2> 1770856 T9263 oasc.CorePropertiesLocator.<init> Config-defined core root directory: C:\Users\JenkinsSlave\workspace\Lucene-Solr-trunk-Windows\solr\build\solr-core\test\J1\temp\solr.cloud.MultiThreadedOCPTest FF25C44C4CBB8E2A-001\shard-1-001\cores
   [junit4]   2> 1770856 T9263 oasc.CoreContainer.<init> New CoreContainer 25961107
   [junit4]   2> 1770856 T9263 oasc.CoreContainer.load Loading cores into CoreContainer [instanceDir=C:\Users\JenkinsSlave\workspace\Lucene-Solr-trunk-Windows\solr\build\solr-core\test\J1\temp\solr.cloud.MultiThreadedOCPTest FF25C44C4CBB8E2A-001\shard-1-001\]
   [junit4]   2> 1770856 T9263 oasc.CoreContainer.load loading shared library: C:\Users\JenkinsSlave\workspace\Lucene-Solr-trunk-Windows\solr\build\solr-core\test\J1\temp\solr.cloud.MultiThreadedOCPTest FF25C44C4CBB8E2A-001\shard-1-001\lib
   [junit4]   2> 1770856 T9263 oasc.SolrResourceLoader.addToClassLoader WARN Can't find (or read) directory to add to classloader: lib (resolved as: C:\Users\JenkinsSlave\workspace\Lucene-Solr-trunk-Windows\solr\build\solr-core\test\J1\temp\solr.cloud.MultiThreadedOCPTest FF25C44C4CBB8E2A-001\shard-1-001\lib).
   [junit4]   2> 1770873 T9263 oashc.HttpShardHandlerFactory.init created with socketTimeout : 90000,urlScheme : ,connTimeout : 15000,maxConnectionsPerHost : 20,maxConnections : 10000,corePoolSize : 0,maximumPoolSize : 2147483647,maxThreadIdleTime : 5,sizeOfQueue : -1,fairnessPolicy : false,useRetries : false,
   [junit4]   2> 1770877 T9263 oasu.UpdateShardHandler.<init> Creating UpdateShardHandler HTTP client with params: socketTimeout=340000&connTimeout=45000&retry=true
   [junit4]   2> 1770878 T9263 oasl.LogWatcher.createWatcher SLF4J impl is org.slf4j.impl.Log4jLoggerFactory
   [junit4]   2> 1770879 T9263 oasl.LogWatcher.newRegisteredLogWatcher Registering Log Listener [Log4j (org.slf4j.impl.Log4jLoggerFactory)]
   [junit4]   2> 1770880 T9263 oasc.CoreContainer.load Node Name: 127.0.0.1
   [junit4]   2> 1770880 T9263 oasc.ZkContainer.initZooKeeper Zookeeper client=127.0.0.1:57319/solr
   [junit4]   2> 1770880 T9263 oasc.ZkController.checkChrootPath zkHost includes chroot
   [junit4]   2> 1771659 T9263 n:127.0.0.1:57341_ oasc.ZkController.createEphemeralLiveNode Register node as live in ZooKeeper:/live_nodes/127.0.0.1:57341_
   [junit4]   2> 1771683 T9263 n:127.0.0.1:57341_ oasc.Overseer.close Overseer (id=null) closing
   [junit4]   2> 1771687 T9263 n:127.0.0.1:57341_ oasc.CoreContainer.initializeAuthenticationPlugin No authentication plugin used.
   [junit4]   2> 1771687 T9263 n:127.0.0.1:57341_ oasc.CoreContainer.intializeAuthorizationPlugin Security conf doesn't exist. Skipping setup for authorization module.
   [junit4]   2> 1771689 T9263 n:127.0.0.1:57341_ oasc.CorePropertiesLocator.discover Looking for core definitions underneath C:\Users\JenkinsSlave\workspace\Lucene-Solr-trunk-Windows\solr\build\solr-core\test\J1\temp\solr.cloud.MultiThreadedOCPTest FF25C44C4CBB8E2A-001\shard-1-001\cores
   [junit4]   2> 1771690 T9263 n:127.0.0.1:57341_ oasc.CoreDescriptor.<init> CORE DESCRIPTOR: {name=collection1, config=solrconfig.xml, transient=false, schema=schema.xml, loadOnStartup=true, instanceDir=C:\Users\JenkinsSlave\workspace\Lucene-Solr-trunk-Windows\solr\build\solr-core\test\J1\temp\solr.cloud.MultiThreadedOCPTest FF25C44C4CBB8E2A-001\shard-1-001\cores\collection1, collection=collection1, absoluteInstDir=C:\Users\JenkinsSlave\workspace\Lucene-Solr-trunk-Windows\solr\build\solr-core\test\J1\temp\solr.cloud.MultiThreadedOCPTest FF25C44C4CBB8E2A-001\shard-1-001\cores\collection1\, coreNodeName=, dataDir=data\, shard=}
   [junit4]   2> 1771690 T9263 n:127.0.0.1:57341_ oasc.CorePropertiesLocator.discoverUnder Found core collection1 in C:\Users\JenkinsSlave\workspace\Lucene-Solr-trunk-Windows\solr\build\solr-core\test\J1\temp\solr.cloud.MultiThreadedOCPTest FF25C44C4CBB8E2A-001\shard-1-001\cores\collection1\
   [junit4]   2> 1771691 T9263 n:127.0.0.1:57341_ oasc.CorePropertiesLocator.discover Found 1 core definitions
   [junit4]   2> 1771696 T9323 n:127.0.0.1:57341_ c:collection1 x:collection1 oasc.ZkController.publish publishing core=collection1 state=down collection=collection1
   [junit4]   2> 1771697 T9323 n:127.0.0.1:57341_ c:collection1 x:collection1 oasc.ZkController.publish numShards not found on descriptor - reading it from system property
   [junit4]   2> 1771700 T9291 n:127.0.0.1:57326_ oasc.DistributedQueue$LatchWatcher.process NodeChildrenChanged fired on path /overseer/queue state SyncConnected
   [junit4]   2> 1771701 T9323 n:127.0.0.1:57341_ oasc.ZkController.preRegister Registering watch for external collection collection1
   [junit4]   2> 1771703 T9292 n:127.0.0.1:57326_ oasc.Overseer$ClusterStateUpdater.run processMessage: queueSize: 1, message = {
   [junit4]   2> 	  "core":"collection1",
   [junit4]   2> 	  "roles":null,
   [junit4]   2> 	  "base_url":"http://127.0.0.1:57341",
   [junit4]   2> 	  "node_name":"127.0.0.1:57341_",
   [junit4]   2> 	  "numShards":"2",
   [junit4]   2> 	  "state":"down",
   [junit4]   2> 	  "shard":null,
   [junit4]   2> 	  "collection":"collection1",
   [junit4]   2> 	  "operation":"state"} current state version: 5
   [junit4]   2> 1771704 T9323 n:127.0.0.1:57341_ oasc.ZkController.waitForCoreNodeName look for our core node name
   [junit4]   2> 1771705 T9292 n:127.0.0.1:57326_ oasco.ReplicaMutator.updateState Update state numShards=2 message={
   [junit4]   2> 	  "core":"collection1",
   [junit4]   2> 	  "roles":null,
   [junit4]   2> 	  "base_url":"http://127.0.0.1:57341",
   [junit4]   2> 	  "node_name":"127.0.0.1:57341_",
   [junit4]   2> 	  "numShards":"2",
   [junit4]   2> 	  "state":"down",
   [junit4]   2> 	  "shard":null,
   [junit4]   2> 	  "collection":"collection1",
   [junit4]   2> 	  "operation":"state"}
   [junit4]   2> 1771705 T9292 n:127.0.0.1:57326_ oasco.ReplicaMutator.updateState Collection already exists with numShards=2
   [junit4]   2> 1771705 T9292 n:127.0.0.1:57326_ oasco.ReplicaMutator.updateState Assigning new node to shard shard=shard2
   [junit4]   2> 1771709 T9292 n:127.0.0.1:57326_ oasco.ZkStateWriter.writePendingUpdates going to update_collection /collections/collection1/state.json version: 0
   [junit4]   2> 1772467 T9323 n:127.0.0.1:57341_ oasc.ZkController.waitForShardId waiting to find shard id in clusterstate for collection1
   [junit4]   2> 1772467 T9323 n:127.0.0.1:57341_ oasc.ZkController.createCollectionZkNode Check for collection zkNode:collection1
   [junit4]   2> 1772468 T9323 n:127.0.0.1:57341_ oasc.ZkController.createCollectionZkNode Collection zkNode exists
   [junit4]   2> 1772470 T9323 n:127.0.0.1:57341_ oasc.SolrResourceLoader.<init> new SolrResourceLoader for directory: 'C:\Users\JenkinsSlave\workspace\Lucene-Solr-trunk-Windows\solr\build\solr-core\test\J1\temp\solr.cloud.MultiThreadedOCPTest FF25C44C4CBB8E2A-001\shard-1-001\cores\collection1\'
   [junit4]   2> 1772485 T9323 n:127.0.0.1:57341_ oasc.Config.<init> loaded config solrconfig.xml with version 0 
   [junit4]   2> 1772497 T9323 n:127.0.0.1:57341_ oasc.SolrConfig.refreshRequestParams current version of requestparams : -1
   [junit4]   2> 1772501 T9323 n:127.0.0.1:57341_ oasc.SolrConfig.<init> Using Lucene MatchVersion: 6.0.0
   [junit4]   2> 1772509 T9323 n:127.0.0.1:57341_ oasc.SolrConfig.<init> Loaded SolrConfig: solrconfig.xml
   [junit4]   2> 1772516 T9323 n:127.0.0.1:57341_ oass.IndexSchema.readSchema Reading Solr Schema from /configs/conf1/schema.xml
   [junit4]   2> 1772517 T9323 n:127.0.0.1:57341_ oass.IndexSchema.readSchema [collection1] Schema name=test
   [junit4]   2> 1772632 T9323 n:127.0.0.1:57341_ oass.OpenExchangeRatesOrgProvider.init Initialized with rates=open-exchange-rates.json, refreshInterval=1440.
   [junit4]   2> 1772642 T9323 n:127.0.0.1:57341_ oass.IndexSchema.readSchema default search field in schema is text
   [junit4]   2> 1772644 T9323 n:127.0.0.1:57341_ oass.IndexSchema.readSchema unique key field: id
   [junit4]   2> 1772720 T9323 n:127.0.0.1:57341_ oass.FileExchangeRateProvider.reload Reloading exchange rates from file currency.xml
   [junit4]   2> 1772724 T9323 n:127.0.0.1:57341_ oass.FileExchangeRateProvider.reload Reloading exchange rates from file currency.xml
   [junit4]   2> 1772727 T9323 n:127.0.0.1:57341_ oass.OpenExchangeRatesOrgProvider.reload Reloading exchange rates from open-exchange-rates.json
   [junit4]   2> 1772732 T9323 n:127.0.0.1:57341_ oass.OpenExchangeRatesOrgProvider$OpenExchangeRates.<init> WARN Unknown key IMPORTANT NOTE
   [junit4]   2> 1772732 T9323 n:127.0.0.1:57341_ oass.OpenExchangeRatesOrgProvider$OpenExchangeRates.<init> WARN Expected key, got STRING
   [junit4]   2> 1772733 T9323 n:127.0.0.1:57341_ oass.OpenExchangeRatesOrgProvider.reload Reloading exchange rates from open-exchange-rates.json
   [junit4]   2> 1772735 T9323 n:127.0.0.1:57341_ oass.OpenExchangeRatesOrgProvider$OpenExchangeRates.<init> WARN Unknown key IMPORTANT NOTE
   [junit4]   2> 1772735 T9323 n:127.0.0.1:57341_ oass.OpenExchangeRatesOrgProvider$OpenExchangeRates.<init> WARN Expected key, got STRING
   [junit4]   2> 1772735 T9323 n:127.0.0.1:57341_ oasc.CoreContainer.create Creating SolrCore 'collection1' using configuration from collection collection1
   [junit4]   2> 1772735 T9323 n:127.0.0.1:57341_ x:collection1 oasc.SolrCore.initDirectoryFactory org.apache.solr.core.MockDirectoryFactory
   [junit4]   2> 1772736 T9323 n:127.0.0.1:57341_ x:collection1 oasc.SolrCore.<init> [[collection1] ] Opening new SolrCore at [C:\Users\JenkinsSlave\workspace\Lucene-Solr-trunk-Windows\solr\build\solr-core\test\J1\temp\solr.cloud.MultiThreadedOCPTest FF25C44C4CBB8E2A-001\shard-1-001\cores\collection1\], dataDir=[null]
   [junit4]   2> 1772736 T9323 n:127.0.0.1:57341_ x:collection1 oasc.JmxMonitoredMap.<init> JMX monitoring is enabled. Adding Solr mbeans to JMX Server: com.sun.jmx.mbeanserver.JmxMBeanServer@4fa910
   [junit4]   2> 1772737 T9323 n:127.0.0.1:57341_ x:collection1 oasc.CachingDirectoryFactory.get return new directory for C:\Users\JenkinsSlave\workspace\Lucene-Solr-trunk-Windows\solr\build\solr-core\test\J1\temp\solr.cloud.MultiThreadedOCPTest FF25C44C4CBB8E2A-001\shard-1-001\cores\collection1\data\
   [junit4]   2> 1772737 T9323 n:127.0.0.1:57341_ x:collection1 oasc.SolrCore.getNewIndexDir New index directory detected: old=null new=C:\Users\JenkinsSlave\workspace\Lucene-Solr-trunk-Windows\solr\build\solr-core\test\J1\temp\solr.cloud.MultiThreadedOCPTest FF25C44C4CBB8E2A-001\shard-1-001\cores\collection1\data\index/
   [junit4]   2> 1772737 T9323 n:127.0.0.1:57341_ x:collection1 oasc.SolrCore.initIndex WARN [collection1] Solr index directory 'C:\Users\JenkinsSlave\workspace\Lucene-Solr-trunk-Windows\solr\build\solr-core\test\J1\temp\solr.cloud.MultiThreadedOCPTest FF25C44C4CBB8E2A-001\shard-1-001\cores\collection1\data\index' doesn't exist. Creating new index...
   [junit4]   2> 1772737 T9323 n:127.0.0.1:57341_ x:collection1 oasc.CachingDirectoryFactory.get return new directory for C:\Users\JenkinsSlave\workspace\Lucene-Solr-trunk-Windows\solr\build\solr-core\test\J1\temp\solr.cloud.MultiThreadedOCPTest FF25C44C4CBB8E2A-001\shard-1-001\cores\collection1\data\index
   [junit4]   2> 1772737 T9323 n:127.0.0.1:57341_ x:collection1 oasu.RandomMergePolicy.<init> RandomMergePolicy wrapping class org.apache.lucene.index.LogByteSizeMergePolicy: [LogByteSizeMergePolicy: minMergeSize=1677721, mergeFactor=36, maxMergeSize=2147483648, maxMergeSizeForForcedMerge=9223372036854775807, calibrateSizeByDeletes=true, maxMergeDocs=2147483647, maxCFSSegmentSizeMB=8.796093022207999E12, noCFSRatio=1.0]
   [junit4]   2> 1772738 T9323 n:127.0.0.1:57341_ x:collection1 oasc.SolrDeletionPolicy.onCommit SolrDeletionPolicy.onCommit: commits: num=1
   [junit4]   2> 		commit{dir=MockDirectoryWrapper(RAMDirectory@1239497 lockFactory=org.apache.lucene.store.SingleInstanceLockFactory@99cf6d),segFN=segments_1,generation=1}
   [junit4]   2> 1772738 T9323 n:127.0.0.1:57341_ x:collection1 oasc.SolrDeletionPolicy.updateCommits newest commit generation = 1
   [junit4]   2> 1772743 T9323 n:127.0.0.1:57341_ x:collection1 oasup.UpdateRequestProcessorChain.init creating updateRequestProcessorChain "nodistrib"
   [junit4]   2> 1772744 T9323 n:127.0.0.1:57341_ x:collection1 oasup.UpdateRequestProcessorChain.init creating updateRequestProcessorChain "dedupe"
   [junit4]   2> 1772744 T9323 n:127.0.0.1:57341_ x:collection1 oasup.UpdateRequestProcessorChain.init inserting DistributedUpdateProcessorFactory into updateRequestProcessorChain "dedupe"
   [junit4]   2> 1772745 T9323 n:127.0.0.1:57341_ x:collection1 oasup.UpdateRequestProcessorChain.init creating updateRequestProcessorChain "stored_sig"
   [junit4]   2> 1772745 T9323 n:127.0.0.1:57341_ x:collection1 oasup.UpdateRequestProcessorChain.init inserting DistributedUpdateProcessorFactory into updateRequestProcessorChain "stored_sig"
   [junit4]   2> 1772745 T9323 n:127.0.0.1:57341_ x:collection1 oasup.UpdateRequestProcessorChain.init creating updateRequestProcessorChain "distrib-dup-test-chain-explicit"
   [junit4]   2> 1772745 T9323 n:127.0.0.1:57341_ x:collection1 oasup.UpdateRequestProcessorChain.init creating updateRequestProcessorChain "distrib-dup-test-chain-implicit"
   [junit4]   2> 1772745 T9323 n:127.0.0.1:57341_ x:collection1 oasup.UpdateRequestProcessorChain.init inserting DistributedUpdateProcessorFactory into updateRequestProcessorChain "distrib-dup-test-chain-implicit"
   [junit4]   2> 1772746 T9323 n:127.0.0.1:57341_ x:collection1 oasc.SolrCore.loadUpdateProcessorChains no updateRequestProcessorChain defined as default, creating implicit default
   [junit4]   2> 1772752 T9323 n:127.0.0.1:57341_ x:collection1 oashl.XMLLoader.init xsltCacheLifetimeSeconds=60
   [junit4]   2> 1772754 T9323 n:127.0.0.1:57341_ x:collection1 oashl.XMLLoader.init xsltCacheLifetimeSeconds=60
   [junit4]   2> 1772757 T9323 n:127.0.0.1:57341_ x:collection1 oashl.XMLLoader.init xsltCacheLifetimeSeconds=60
   [junit4]   2> 1772758 T9323 n:127.0.0.1:57341_ x:collection1 oashl.XMLLoader.init xsltCacheLifetimeSeconds=60
   [junit4]   2> 1772763 T9323 n:127.0.0.1:57341_ x:collection1 oasc.RequestHandlers.initHandlersFromConfig Registered paths: /admin/mbeans,standard,/update/csv,/update/json/docs,/admin/luke,/admin/segments,/get,/admin/system,/replication,/admin/properties,/config,/schema,/admin/plugins,/admin/logging,/update/json,/admin/threads,/admin/ping,/update,/admin/file
   [junit4]   2> 1772764 T9323 n:127.0.0.1:57341_ x:collection1 oasc.SolrCore.initStatsCache Using default statsCache cache: org.apache.solr.search.stats.LocalStatsCache
   [junit4]   2> 1772766 T9323 n:127.0.0.1:57341_ x:collection1 oasu.UpdateHandler.<init> Using UpdateLog implementation: org.apache.solr.update.UpdateLog
   [junit4]   2> 1772766 T9323 n:127.0.0.1:57341_ x:collection1 oasu.UpdateLog.init Initializing UpdateLog: dataDir= defaultSyncLevel=FLUSH numRecordsToKeep=100 maxNumLogsToKeep=10 numVersionBuckets=65536
   [junit4]   2> 1772768 T9323 n:127.0.0.1:57341_ x:collection1 oasu.CommitTracker.<init> Hard AutoCommit: disabled
   [junit4]   2> 1772768 T9323 n:127.0.0.1:57341_ x:collection1 oasu.CommitTracker.<init> Soft AutoCommit: disabled
   [junit4]   2> 1772768 T9323 n:127.0.0.1:57341_ x:collection1 oasu.RandomMergePolicy.<init> RandomMergePolicy wrapping class org.apache.lucene.index.TieredMergePolicy: [TieredMergePolicy: maxMergeAtOnce=34, maxMergeAtOnceExplicit=42, maxMergedSegmentMB=50.3740234375, floorSegmentMB=1.0234375, forceMergeDeletesPctAllowed=0.9885171520723401, segmentsPerTier=50.0, maxCFSSegmentSizeMB=8.796093022207999E12, noCFSRatio=1.0
   [junit4]   2> 1772769 T9323 n:127.0.0.1:57341_ x:collection1 oasc.SolrDeletionPolicy.onInit SolrDeletionPolicy.onInit: commits: num=1
   [junit4]   2> 		commit{dir=MockDirectoryWrapper(RAMDirectory@1239497 lockFactory=org.apache.lucene.store.SingleInstanceLockFactory@99cf6d),segFN=segments_1,generation=1}
   [junit4]   2> 1772769 T9323 n:127.0.0.1:57341_ x:collection1 oasc.SolrDeletionPolicy.updateCommits newest commit generation = 1
   [junit4]   2> 1772769 T9323 n:127.0.0.1:57341_ x:collection1 oass.SolrIndexSearcher.<init> Opening Searcher@1e4492b[collection1] main
   [junit4]   2> 1772771 T9323 n:127.0.0.1:57341_ x:collection1 oasr.ManagedResourceStorage.newStorageIO Setting up ZooKeeper-based storage for the RestManager with znodeBase: /configs/conf1
   [junit4]   2> 1772772 T9323 n:127.0.0.1:57341_ x:collection1 oasr.ManagedResourceStorage$ZooKeeperStorageIO.configure Configured ZooKeeperStorageIO with znodeBase: /configs/conf1
   [junit4]   2> 1772772 T9323 n:127.0.0.1:57341_ x:collection1 oasr.RestManager.init Initializing RestManager with initArgs: {}
   [junit4]   2> 1772772 T9323 n:127.0.0.1:57341_ x:collection1 oasr.ManagedResourceStorage.load Reading _rest_managed.json using ZooKeeperStorageIO:path=/configs/conf1
   [junit4]   2> 1772772 T9323 n:127.0.0.1:57341_ x:collection1 oasr.ManagedResourceStorage$ZooKeeperStorageIO.openInputStream No data found for znode /configs/conf1/_rest_managed.json
   [junit4]   2> 1772773 T9323 n:127.0.0.1:57341_ x:collection1 oasr.ManagedResourceStorage.load Loaded null at path _rest_managed.json using ZooKeeperStorageIO:path=/configs/conf1
   [junit4]   2> 1772773 T9323 n:127.0.0.1:57341_ x:collection1 oasr.RestManager.init Initializing 0 registered ManagedResources
   [junit4]   2> 1772773 T9323 n:127.0.0.1:57341_ x:collection1 oash.ReplicationHandler.inform Commits will be reserved for  10000
   [junit4]   2> 1772774 T9324 n:127.0.0.1:57341_ x:collection1 oasc.SolrCore.registerSearcher [collection1] Registered new searcher Searcher@1e4492b[collection1] main{ExitableDirectoryReader(UninvertingDirectoryReader())}
   [junit4]   2> 1772776 T9323 n:127.0.0.1:57341_ x:collection1 oasc.ZkController.getConfDirListeners watch zkdir /configs/conf1
   [junit4]   2> 1772776 T9323 n:127.0.0.1:57341_ x:collection1 oasu.UpdateLog.onFirstSearcher On first searcher opened, looking up max value of version field
   [junit4]   2> 1772778 T9323 n:127.0.0.1:57341_ x:collection1 oasu.VersionInfo.getMaxVersionFromIndex Refreshing highest value of _version_ for 65536 version buckets from index
   [junit4]   2> 1772778 T9323 n:127.0.0.1:57341_ x:collection1 oasu.VersionInfo.getMaxVersionFromIndex No terms found for _version_, cannot seed version bucket highest value from index
   [junit4]   2> 1772779 T9323 n:127.0.0.1:57341_ x:collection1 oasu.UpdateLog.seedBucketsWithHighestVersion Could not find max version in index or recent updates, using new clock 1502315774650351616
   [junit4]   2> 1772780 T9323 n:127.0.0.1:57341_ x:collection1 oasu.UpdateLog.seedBucketsWithHighestVersion Took 2 ms to seed version buckets with highest version 1502315774650351616
   [junit4]   2> 1772781 T9323 n:127.0.0.1:57341_ x:collection1 oasc.CoreContainer.registerCore registering core: collection1
   [junit4]   2> 1772783 T9327 n:127.0.0.1:57341_ c:collection1 s:shard2 x:collection1 oasc.ZkController.register Register replica - core:collection1 address:http://127.0.0.1:57341 collection:collection1 shard:shard2
   [junit4]   2> 1772784 T9263 n:127.0.0.1:57341_ oass.SolrDispatchFilter.init user.dir=C:\Users\JenkinsSlave\workspace\Lucene-Solr-trunk-Windows\solr\build\solr-core\test\J1
   [junit4]   2> 1772784 T9263 n:127.0.0.1:57341_ oass.SolrDispatchFilter.init SolrDispatchFilter.init() done
   [junit4]   2> 1772794 T9327 n:127.0.0.1:57341_ c:collection1 s:shard2 x:collection1 oasc.ShardLeaderElectionContext.runLeaderProcess Running the leader process for shard shard2
   [junit4]   2> 1772796 T9291 n:127.0.0.1:57326_ oasc.DistributedQueue$LatchWatcher.process NodeChildrenChanged fired on path /overseer/queue state SyncConnected
   [junit4]   2> 1772799 T9327 n:127.0.0.1:57341_ c:collection1 s:shard2 x:collection1 oasc.ShardLeaderElectionContext.waitForReplicasToComeUp Enough replicas found to continue.
   [junit4]   2> 1772799 T9327 n:127.0.0.1:57341_ c:collection1 s:shard2 x:collection1 oasc.ShardLeaderElectionContext.runLeaderProcess I may be the new leader - try and sync
   [junit4]   2> ASYNC  NEW_CORE C1619 name=collection1 org.apache.solr.core.SolrCore@a1d1ab url=http://127.0.0.1:57341/collection1 node=127.0.0.1:57341_ C1619_STATE=coll:collection1 core:collection1 props:{core=collection1, base_url=http://127.0.0.1:57341, node_name=127.0.0.1:57341_, state=down}
   [junit4]   2> 1772799 T9327 n:127.0.0.1:57341_ c:collection1 s:shard2 x:collection1 C1619 oasc.SyncStrategy.sync Sync replicas to http://127.0.0.1:57341/collection1/
   [junit4]   2> 1772799 T9327 n:127.0.0.1:57341_ c:collection1 s:shard2 x:collection1 C1619 oasc.SyncStrategy.syncReplicas Sync Success - now sync replicas to me
   [junit4]   2> 1772799 T9327 n:127.0.0.1:57341_ c:collection1 s:shard2 x:collection1 C1619 oasc.SyncStrategy.syncToMe http://127.0.0.1:57341/collection1/ has no replicas
   [junit4]   2> 1772799 T9327 n:127.0.0.1:57341_ c:collection1 s:shard2 x:collection1 oasc.ShardLeaderElectionContext.runLeaderProcess I am the new leader: http://127.0.0.1:57341/collection1/ shard2
   [junit4]   2> 1772799 T9292 n:127.0.0.1:57326_ oasc.Overseer$ClusterStateUpdater.run processMessage: queueSize: 1, message = {
   [junit4]   2> 	  "operation":"leader",
   [junit4]   2> 	  "shard":"shard2",
   [junit4]   2> 	  "collection":"collection1"} current state version: 5
   [junit4]   2> 1772802 T9292 n:127.0.0.1:57326_ oasco.ZkStateWriter.writePendingUpdates going to update_collection /collections/collection1/state.json version: 1
   [junit4]   2> 1772833 T9291 n:127.0.0.1:57326_ oasc.DistributedQueue$LatchWatcher.process NodeChildrenChanged fired on path /overseer/queue state SyncConnected
   [junit4]   2> 1772834 T9292 n:127.0.0.1:57326_ oasc.Overseer$ClusterStateUpdater.run processMessage: queueSize: 1, message = {
   [junit4]   2> 	  "operation":"leader",
   [junit4]   2> 	  "shard":"shard2",
   [junit4]   2> 	  "collection":"collection1",
   [junit4]   2> 	  "base_url":"http://127.0.0.1:57341",
   [junit4]   2> 	  "core":"collection1",
   [junit4]   2> 	  "state":"active"} current state version: 5
   [junit4]   2> 1772836 T9292 n:127.0.0.1:57326_ oasco.ZkStateWriter.writePendingUpdates going to update_collection /collections/collection1/state.json version: 2
   [junit4]   2> 1772877 T9327 n:127.0.0.1:57341_ c:collection1 s:shard2 x:collection1 oasc.ZkController.register We are http://127.0.0.1:57341/collection1/ and leader is http://127.0.0.1:57341/collection1/
   [junit4]   2> 1772878 T9327 n:127.0.0.1:57341_ c:collection1 s:shard2 x:collection1 oasc.ZkController.register No LogReplay needed for core=collection1 baseURL=http://127.0.0.1:57341
   [junit4]   2> 1772878 T9327 n:127.0.0.1:57341_ c:collection1 s:shard2 x:collection1 oasc.ZkController.checkRecovery I am the leader, no recovery necessary
   [junit4]   2> 1772878 T9327 n:127.0.0.1:57341_ c:collection1 s:shard2 x:collection1 oasc.ZkController.publish publishing core=collection1 state=active collection=collection1
   [junit4]   2> 1772878 T9327 n:127.0.0.1:57341_ c:collection1 s:shard2 x:collection1 oasc.ZkController.publish numShards not found on descriptor - reading it from system property
   [junit4]   2> 1772879 T9291 n:127.0.0.1:57326_ oasc.DistributedQueue$LatchWatcher.process NodeChildrenChanged fired on path /overseer/queue state SyncConnected
   [junit4]   2> 1772881 T9292 n:127.0.0.1:57326_ oasc.Overseer$ClusterStateUpdater.run processMessage: queueSize: 1, message = {
   [junit4]   2> 	  "core":"collection1",
   [junit4]   2> 	  "core_node_name":"core_node1",
   [junit4]   2> 	  "roles":null,
   [junit4]   2> 	  "base_url":"http://127.0.0.1:57341",
   [junit4]   2> 	  "node_name":"127.0.0.1:57341_",
   [junit4]   2> 	  "numShards":"2",
   [junit4]   2> 	  "state":"active",
   [junit4]   2> 	  "shard":"shard2",
   [junit4]   2> 	  "collection":"collection1",
   [junit4]   2> 	  "operation":"state"} current state version: 5
   [junit4]   2> 1772881 T9292 n:127.0.0.1:57326_ oasco.ReplicaMutator.updateState Update state numShards=2 message={
   [junit4]   2> 	  "core":"collection1",
   [junit4]   2> 	  "core_node_name":"core_node1",
   [junit4]   2> 	  "roles":null,
   [junit4]   2> 	  "base_url":"http://127.0.0.1:57341",
   [junit4]   2> 	  "node_name":"127.0.0.1:57341_",
   [junit4]   2> 	  "numShards":"2",
   [junit4]   2> 	  "state":"active",
   [junit4]   2> 	  "shard":"shard2",
   [junit4]   2> 	  "collection":"collection1",
   [junit4]   2> 	  "operation":"state"}
   [junit4]   2> 1772882 T9292 n:127.0.0.1:57326_ oasco.ZkStateWriter.writePendingUpdates going to update_collection /collections/collection1/state.json version: 3
   [junit4]   2> 1773214 T9263 oas.SolrTestCaseJ4.writeCoreProperties Writing core.properties file to C:\Users\JenkinsSlave\workspace\Lucene-Solr-trunk-Windows\solr\build\solr-core\test\J1\temp\solr.cloud.MultiThreadedOCPTest FF25C44C4CBB8E2A-001\shard-2-001\cores\collection1
   [junit4]   2> 1773217 T9263 oasc.AbstractFullDistribZkTestBase.createJettys create jetty 2 in directory C:\Users\JenkinsSlave\workspace\Lucene-Solr-trunk-Windows\solr\build\solr-core\test\J1\temp\solr.cloud.MultiThreadedOCPTest FF25C44C4CBB8E2A-001\shard-2-001
   [junit4]   2> 1773218 T9263 oejs.Server.doStart jetty-9.2.10.v20150310
   [junit4]   2> 1773222 T9263 oejsh.ContextHandler.doStart Started o.e.j.s.ServletContextHandler@fb29ac{/,null,AVAILABLE}
   [junit4]   2> 1773222 T9263 oejs.AbstractConnector.doStart Started ServerConnector@80bea3{HTTP/1.1}{127.0.0.1:57350}
   [junit4]   2> 1773224 T9263 oejs.Server.doStart Started @1782635ms
   [junit4]   2> 1773224 T9263 oascse.JettySolrRunner$1.lifeCycleStarted Jetty properties: {solrconfig=solrconfig.xml, hostContext=/, hostPort=57350, coreRootDirectory=C:\Users\JenkinsSlave\workspace\Lucene-Solr-trunk-Windows\solr\build\solr-core\test\J1\temp\solr.cloud.MultiThreadedOCPTest FF25C44C4CBB8E2A-001\shard-2-001\cores}
   [junit4]   2> 1773224 T9263 oass.SolrDispatchFilter.init SolrDispatchFilter.init()sun.misc.Launcher$AppClassLoader@e2f2a
   [junit4]   2> 1773225 T9263 oasc.SolrResourceLoader.<init> new SolrResourceLoader for directory: 'C:\Users\JenkinsSlave\workspace\Lucene-Solr-trunk-Windows\solr\build\solr-core\test\J1\temp\solr.cloud.MultiThreadedOCPTest FF25C44C4CBB8E2A-001\shard-2-001\'
   [junit4]   2> 1773248 T9263 oasc.SolrXmlConfig.fromFile Loading container configuration from C:\Users\JenkinsSlave\workspace\Lucene-Solr-trunk-Windows\solr\build\solr-core\test\J1\temp\solr.cloud.MultiThreadedOCPTest FF25C44C4CBB8E2A-001\shard-2-001\solr.xml
   [junit4]   2> 1773253 T9263 oasc.CorePropertiesLocator.<init> Config-defined core root directory: C:\Users\JenkinsSlave\workspace\Lucene-Solr-trunk-Windows\solr\build\solr-core\test\J1\temp\solr.cloud.MultiThreadedOCPTest FF25C44C4CBB8E2A-001\shard-2-001\cores
   [junit4]   2> 1773253 T9263 oasc.CoreContainer.<init> New CoreContainer 28381091
   [junit4]   2> 1773253 T9263 oasc.CoreContainer.load Loading cores into CoreContainer [instanceDir=C:\Users\JenkinsSlave\workspace\Lucene-Solr-trunk-Windows\solr\build\solr-core\test\J1\temp\solr.cloud.MultiThreadedOCPTest FF25C44C4CBB8E2A-001\shard-2-001\]
   [junit4]   2> 1773253 T9263 oasc.CoreContainer.load loading shared library: C:\Users\JenkinsSlave\workspace\Lucene-Solr-trunk-Windows\solr\build\solr-core\test\J1\temp\solr.cloud.MultiThreadedOCPTest FF25C44C4CBB8E2A-001\shard-2-001\lib
   [junit4]   2> 1773253 T9263 oasc.SolrResourceLoader.addToClassLoader WARN Can't find (or read) directory to add to classloader: lib (resolved as: C:\Users\JenkinsSlave\workspace\Lucene-Solr-trunk-Windows\solr\build\solr-core\test\J1\temp\solr.cloud.MultiThreadedOCPTest FF25C44C4CBB8E2A-001\shard-2-001\lib).
   [junit4]   2> 1773261 T9263 oashc.HttpShardHandlerFactory.init created with socketTimeout : 90000,urlScheme : ,connTimeout : 15000,maxConnectionsPerHost : 20,maxConnections : 10000,corePoolSize : 0,maximumPoolSize : 2147483647,maxThreadIdleTime : 5,sizeOfQueue : -1,fairnessPolicy : false,useRetries : false,
   [junit4]   2> 1773264 T9263 oasu.UpdateShardHandler.<init> Creating UpdateShardHandler HTTP client with params: socketTimeout=340000&connTimeout=45000&retry=true
   [junit4]   2> 1773264 T9263 oasl.LogWatcher.createWatcher SLF4J impl is org.slf4j.impl.Log4jLoggerFactory
   [junit4]   2> 1773264 T9263 oasl.LogWatcher.newRegisteredLogWatcher Registering Log Listener [Log4j (org.slf4j.impl.Log4jLoggerFactory)]
   [junit4]   2> 1773264 T9263 oasc.CoreContainer.load Node Name: 127.0.0.1
   [junit4]   2> 1773265 T9263 oasc.ZkContainer.initZooKeeper Zookeeper client=127.0.0.1:57319/solr
   [junit4]   2> 1773265 T9263 oasc.ZkController.checkChrootPath zkHost includes chroot
   [junit4]   2> 1774098 T9263 n:127.0.0.1:57350_ oasc.ZkController.createEphemeralLiveNode Register node as live in ZooKeeper:/live_nodes/127.0.0.1:57350_
   [junit4]   2> 1774103 T9263 n:127.0.0.1:57350_ oasc.Overseer.close Overseer (id=null) closing
   [junit4]   2> 1774105 T9263 n:127.0.0.1:57350_ oasc.CoreContainer.initializeAuthenticationPlugin No authentication plugin used.
   [junit4]   2> 1774106 T9263 n:127.0.0.1:57350_ oasc.CoreContainer.intializeAuthorizationPlugin Security conf doesn't exist. Skipping setup for authorization module.
   [junit4]   2> 1774108 T9263 n:127.0.0.1:57350_ oasc.CorePropertiesLocator.discover Looking for core definitions underneath C:\Users\JenkinsSlave\workspace\Lucene-Solr-trunk-Windows\solr\build\solr-core\test\J1\temp\solr.cloud.MultiThreadedOCPTest FF25C44C4CBB8E2A-001\shard-2-001\cores
   [junit4]   2> 1774109 T9263 n:127.0.0.1:57350_ oasc.CoreDescriptor.<init> CORE DESCRIPTOR: {name=collection1, config=solrconfig.xml, transient=false, schema=schema.xml, loadOnStartup=true, instanceDir=C:\Users\JenkinsSlave\workspace\Lucene-Solr-trunk-Windows\solr\build\solr-core\test\J1\temp\solr.cloud.MultiThreadedOCPTest FF25C44C4CBB8E2A-001\shard-2-001\cores\collection1, collection=collection1, absoluteInstDir=C:\Users\JenkinsSlave\workspace\Lucene-Solr-trunk-Windows\solr\build\solr-core\test\J1\temp\solr.cloud.MultiThreadedOCPTest FF25C44C4CBB8E2A-001\shard-2-001\cores\collection1\, coreNodeName=, dataDir=data\, shard=}
   [junit4]   2> 1774109 T9263 n:127.0.0.1:57350_ oasc.CorePropertiesLocator.discoverUnder Found core collection1 in C:\Users\JenkinsSlave\workspace\Lucene-Solr-trunk-Windows\solr\build\solr-core\test\J1\temp\solr.cloud.MultiThreadedOCPTest FF25C44C4CBB8E2A-001\shard-2-001\cores\collection1\
   [junit4]   2> 1774110 T9263 n:127.0.0.1:57350_ oasc.CorePropertiesLocator.discover Found 1 core definitions
   [junit4]   2> 1774117 T9345 n:127.0.0.1:57350_ c:collection1 x:collection1 oasc.ZkController.publish publishing core=collection1 state=down collection=collection1
   [junit4]   2> 1774118 T9345 n:127.0.0.1:57350_ c:collection1 x:collection1 oasc.ZkController.publish numShards not found on descriptor - reading it from system property
   [junit4]   2> 1774121 T9291 n:127.0.0.1:57326_ oasc.DistributedQueue$LatchWatcher.process NodeChildrenChanged fired on path /overseer/queue state SyncConnected
   [junit4]   2> 1774121 T9345 n:127.0.0.1:57350_ oasc.ZkController.preRegister Registering watch for external collection collection1
   [junit4]   2> 1774121 T9292 n:127.0.0.1:57326_ oasc.Overseer$ClusterStateUpdater.run processMessage: queueSize: 1, message = {
   [junit4]   2> 	  "core":"collection1",
   [junit4]   2> 	  "roles":null,
   [junit4]   2> 	  "base_url":"http://127.0.0.1:57350",
   [junit4]   2> 	  "node_name":"127.0.0.1:57350_",
   [junit4]   2> 	  "numShards":"2",
   [junit4]   2> 	  "state":"down",
   [junit4]   2> 	  "shard":null,
   [junit4]   2> 	  "collection":"collection1",
   [junit4]   2> 	  "operation":"state"} current state version: 5
   [junit4]   2> 1774122 T9292 n:127.0.0.1:57326_ oasco.ReplicaMutator.updateState Update state numShards=2 message={
   [junit4]   2> 	  "core":"collection1",
   [junit4]   2> 	  "roles":null,
   [junit4]   2> 	  "base_url":"http://127.0.0.1:57350",
   [junit4]   2> 	  "node_name":"127.0.0.1:57350_",
   [junit4]   2> 	  "numShards":"2",
   [junit4]   2> 	  "state":"down",
   [junit4]   2> 	  "shard":null,
   [junit4]   2> 	  "collection":"collection1",
   [junit4]   2> 	  "operation":"state"}
   [junit4]   2> 1774122 T9292 n:127.0.0.1:57326_ oasco.ReplicaMutator.updateState Collection already exists with numShards=2
   [junit4]   2> 1774122 T9292 n:127.0.0.1:57326_ oasco.ReplicaMutator.updateState Assigning new node to shard shard=shard1
   [junit4]   2> 1774123 T9345 n:127.0.0.1:57350_ oasc.ZkController.waitForCoreNodeName look for our core node name
   [junit4]   2> 1774124 T9292 n:127.0.0.1:57326_ oasco.ZkStateWriter.writePendingUpdates going to update_collection /collections/collection1/state.json version: 4
   [junit4]   2> 1774937 T9345 n:127.0.0.1:57350_ oasc.ZkController.waitForShardId waiting to find shard id in clusterstate for collection1
   [junit4]   2> 1774937 T9345 n:127.0.0.1:57350_ oasc.ZkController.createCollectionZkNode Check for collection zkNode:collection1
   [junit4]   2> 1774938 T9345 n:127.0.0.1:57350_ oasc.ZkController.createCollectionZkNode Collection zkNode exists
   [junit4]   2> 1774939 T9345 n:127.0.0.1:57350_ oasc.SolrResourceLoader.<init> new SolrResourceLoader for directory: 'C:\Users\JenkinsSlave\workspace\Lucene-Solr-trunk-Windows\solr\build\solr-core\test\J1\temp\solr.cloud.MultiThreadedOCPTest FF25C44C4CBB8E2A-001\shard-2-001\cores\collection1\'
   [junit4]   2> 1774957 T9345 n:127.0.0.1:57350_ oasc.Config.<init> loaded config solrconfig.xml with version 0 
   [junit4]   2> 1774965 T9345 n:127.0.0.1:57350_ oasc.SolrConfig.refreshRequestParams current version of requestparams : -1
   [junit4]   2> 1774969 T9345 n:127.0.0.1:57350_ oasc.SolrConfig.<init> Using Lucene MatchVersion: 6.0.0
   [junit4]   2> 1774976 T9345 n:127.0.0.1:57350_ oasc.SolrConfig.<init> Loaded SolrConfig: solrconfig.xml
   [junit4]   2> 1774978 T9345 n:127.0.0.1:57350_ oass.IndexSchema.readSchema Reading Solr Schema from /configs/conf1/schema.xml
   [junit4]   2> 1774983 T9345 n:127.0.0.1:57350_ oass.IndexSchema.readSchema [collection1] Schema name=test
   [junit4]   2> 1775075 T9345 n:127.0.0.1:57350_ oass.OpenExchangeRatesOrgProvider.init Initialized with rates=open-exchange-rates.json, refreshInterval=1440.
   [junit4]   2> 1775082 T9345 n:127.0.0.1:57350_ oass.IndexSchema.readSchema default search field in schema is text
   [junit4]   2> 1775082 T9345 n:127.0.0.1:57350_ oass.IndexSchema.readSchema unique key field: id
   [junit4]   2> 1775093 T9345 n:127.0.0.1:57350_ oass.FileExchangeRateProvider.reload Reloading exchange rates from file currency.xml
   [junit4]   2> 1775095 T9345 n:127.0.0.1:57350_ oass.FileExchangeRateProvider.reload Reloading exchange rates from file currency.xml
   [junit4]   2> 1775098 T9345 n:127.0.0.1:57350_ oass.OpenExchangeRatesOrgProvider.reload Reloading exchange rates from open-exchange-rates.json
   [junit4]   2> 1775100 T9345 n:127.0.0.1:57350_ oass.OpenExchangeRatesOrgProvider$OpenExchangeRates.<init> WARN Unknown key IMPORTANT NOTE
   [junit4]   2> 1775100 T9345 n:127.0.0.1:57350_ oass.OpenExchangeRatesOrgProvider$OpenExchangeRates.<init> WARN Expected key, got STRING
   [junit4]   2> 1775100 T9345 n:127.0.0.1:57350_ oass.OpenExchangeRatesOrgProvider.reload Reloading exchange rates from open-exchange-rates.json
   [junit4]   2> 1775101 T9345 n:127.0.0.1:57350_ oass.OpenExchangeRatesOrgProvider$OpenExchangeRates.<init> WARN Unknown key IMPORTANT NOTE
   [junit4]   2> 1775102 T9345 n:127.0.0.1:57350_ oass.OpenExchangeRatesOrgProvider$OpenExchangeRates.<init> WARN Expected key, got STRING
   [junit4]   2> 1775102 T9345 n:127.0.0.1:57350_ oasc.CoreContainer.create Creating SolrCore 'collection1' using configuration from collection collection1
   [junit4]   2> 1775102 T9345 n:127.0.0.1:57350_ x:collection1 oasc.SolrCore.initDirectoryFactory org.apache.solr.core.MockDirectoryFactory
   [junit4]   2> 1775102 T9345 n:127.0.0.1:57350_ x:collection1 oasc.SolrCore.<init> [[collection1] ] Opening new SolrCore at [C:\Users\JenkinsSlave\workspace\Lucene-Solr-trunk-Windows\solr\build\solr-core\test\J1\temp\solr.cloud.MultiThreadedOCPTest FF25C44C4CBB8E2A-001\shard-2-001\cores\collection1\], dataDir=[null]
   [junit4]   2> 1775102 T9345 n:127.0.0.1:57350_ x:collection1 oasc.JmxMonitoredMap.<init> JMX monitoring is enabled. Adding Solr mbeans to JMX Server: com.sun.jmx.mbeanserver.JmxMBeanServer@4fa910
   [junit4]   2> 1775104 T9345 n:127.0.0.1:57350_ x:collection1 oasc.CachingDirectoryFactory.get return new directory for C:\Users\JenkinsSlave\workspace\Lucene-Solr-trunk-Windows\solr\build\solr-core\test\J1\temp\solr.cloud.MultiThreadedOCPTest FF25C44C4CBB8E2A-001\shard-2-001\cores\collection1\data\
   [junit4]   2> 1775104 T9345 n:127.0.0.1:57350_ x:collection1 oasc.SolrCore.getNewIndexDir New index directory detected: old=null new=C:\Users\JenkinsSlave\workspace\Lucene-Solr-trunk-Windows\solr\build\solr-core\test\J1\temp\solr.cloud.MultiThreadedOCPTest FF25C44C4CBB8E2A-001\shard-2-001\cores\collection1\data\index/
   [junit4]   2> 1775104 T9345 n:127.0.0.1:57350_ x:collection1 oasc.SolrCore.initIndex WARN [collection1] Solr index directory 'C:\Users\JenkinsSlave\workspace\Lucene-Solr-trunk-Windows\solr\build\solr-core\test\J1\temp\solr.cloud.MultiThreadedOCPTest FF25C44C4CBB8E2A-001\shard-2-001\cores\collection1\data\index' doesn't exist. Creating new index...
   [junit4]   2> 1775105 T9345 n:127.0.0.1:57350_ x:collection1 oasc.CachingDirectoryFactory.get return new directory for C:\Users\JenkinsSlave\workspace\Lucene-Solr-trunk-Windows\solr\build\solr-core\test\J1\temp\solr.cloud.MultiThreadedOCPTest FF25C44C4CBB8E2A-001\shard-2-001\cores\collection1\data\index
   [junit4]   2> 1775105 T9345 n:127.0.0.1:57350_ x:collection1 oasu.RandomMergePolicy.<init> RandomMergePolicy wrapping class org.apache.lucene.index.LogByteSizeMergePolicy: [LogByteSizeMergePolicy: minMergeSize=1677721, mergeFactor=36, maxMergeSize=2147483648, maxMergeSizeForForcedMerge=9223372036854775807, calibrateSizeByDeletes=true, maxMergeDocs=2147483647, maxCFSSegmentSizeMB=8.796093022207999E12, noCFSRatio=1.0]
   [junit4]   2> 1775105 T9345 n:127.0.0.1:57350_ x:collection1 oasc.SolrDeletionPolicy.onCommit SolrDeletionPolicy.onCommit: commits: num=1
   [junit4]   2> 		commit{dir=MockDirectoryWrapper(RAMDirectory@22df83 lockFactory=org.apache.lucene.store.SingleInstanceLockFactory@4b7be4),segFN=segments_1,generation=1}
   [junit4]   2> 1775105 T9345 n:127.0.0.1:57350_ x:collection1 oasc.SolrDeletionPolicy.updateCommits newest commit generation = 1
   [junit4]   2> 1775109 T9345 n:127.0.0.1:57350_ x:collection1 oasup.UpdateRequestProcessorChain.init creating updateRequestProcessorChain "nodistrib"
   [junit4]   2> 1775110 T9345 n:127.0.0.1:57350_ x:collection1 oasup.UpdateRequestProcessorChain.init creating updateRequestProcessorChain "dedupe"
   [junit4]   2> 1775110 T9345 n:127.0.0.1:57350_ x:collection1 oasup.UpdateRequestProcessorChain.init inserting DistributedUpdateProcessorFactory into updateRequestProcessorChain "dedupe"
   [junit4]   2> 1775110 T9345 n:127.0.0.1:57350_ x:collection1 oasup.UpdateRequestProcessorChain.init creating updateRequestProcessorChain "stored_sig"
   [junit4]   2> 1775111 T9345 n:127.0.0.1:57350_ x:collection1 oasup.UpdateRequestProcessorChain.init inserting DistributedUpdateProcessorFactory into updateRequestProcessorChain "stored_sig"
   [junit4]   2> 1775111 T9345 n:127.0.0.1:57350_ x:collection1 oasup.UpdateRequestProcessorChain.init creating updateRequestProcessorChain "distrib-dup-test-chain-explicit"
   [junit4]   2> 1775111 T9345 n:127.0.0.1:57350_ x:collection1 oasup.UpdateRequestProcessorChain.init creating updateRequestProcessorChain "distrib-dup-test-chain-implicit"
   [junit4]   2> 1775111 T9345 n:127.0.0.1:57350_ x:collection1 oasup.UpdateRequestProcessorChain.init inserting DistributedUpdateProcessorFactory into updateRequestProcessorChain "distrib-dup-test-chain-implicit"
   [junit4]   2> 1775112 T9345 n:127.0.0.1:57350_ x:collection1 oasc.SolrCore.loadUpdateProcessorChains no updateRequestProcessorChain defined as default, creating implicit default
   [junit4]   2> 1775115 T9345 n:127.0.0.1:57350_ x:collection1 oashl.XMLLoader.init xsltCacheLifetimeSeconds=60
   [junit4]   2> 1775117 T9345 n:127.0.0.1:57350_ x:collection1 oashl.XMLLoader.init xsltCacheLifetimeSeconds=60
   [junit4]   2> 1775118 T9345 n:127.0.0.1:57350_ x:collection1 oashl.XMLLoader.init xsltCacheLifetimeSeconds=60
   [junit4]   2> 1775119 T9345 n:127.0.0.1:57350_ x:collection1 oashl.XMLLoader.init xsltCacheLifetimeSeconds=60
   [junit4]   2> 1775125 T9345 n:127.0.0.1:57350_ x:collection1 oasc.RequestHandlers.initHandlersFromConfig Registered paths: /admin/mbeans,standard,/update/csv,/update/json/docs,/admin/luke,/admin/segments,/get,/admin/system,/replication,/admin/properties,/config,/schema,/admin/plugins,/admin/logging,/update/json,/admin/threads,/admin/ping,/update,/admin/file
   [junit4]   2> 1775125 T9345 n:127.0.0.1:57350_ x:collection1 oasc.SolrCore.initStatsCache Using default statsCache cache: org.apache.solr.search.stats.LocalStatsCache
   [junit4]   2> 1775126 T9345 n:127.0.0.1:57350_ x:collection1 oasu.UpdateHandler.<init> Using UpdateLog implementation: org.apache.solr.update.UpdateLog
   [junit4]   2> 1775127 T9345 n:127.0.0.1:57350_ x:collection1 oasu.UpdateLog.init Initializing UpdateLog: dataDir= defaultSyncLevel=FLUSH numRecordsToKeep=100 maxNumLogsToKeep=10 numVersionBuckets=65536
   [junit4]   2> 1775129 T9345 n:127.0.0.1:57350_ x:collection1 oasu.CommitTracker.<init> Hard AutoCommit: disabled
   [junit4]   2> 1775129 T9345 n:127.0.0.1:57350_ x:collection1 oasu.CommitTracker.<init> Soft AutoCommit: disabled
   [junit4]   2> 1775129 T9345 n:127.0.0.1:57350_ x:collection1 oasu.RandomMergePolicy.<init> RandomMergePolicy wrapping class org.apache.lucene.index.TieredMergePolicy: [TieredMergePolicy: maxMergeAtOnce=34, maxMergeAtOnceExplicit=42, maxMergedSegmentMB=50.3740234375, floorSegmentMB=1.0234375, forceMergeDeletesPctAllowed=0.9885171520723401, segmentsPerTier=50.0, maxCFSSegmentSizeMB=8.796093022207999E12, noCFSRatio=1.0
   [junit4]   2> 1775129 T9345 n:127.0.0.1:57350_ x:collection1 oasc.SolrDeletionPolicy.onInit SolrDeletionPolicy.onInit: commits: num=1
   [junit4]   2> 		commit{dir=MockDirectoryWrapper(RAMDirectory@22df83 lockFactory=org.apache.lucene.store.SingleInstanceLockFactory@4b7be4),segFN=segments_1,generation=1}
   [junit4]   2> 1775130 T9345 n:127.0.0.1:57350_ x:collection1 oasc.SolrDeletionPolicy.updateCommits newest commit generation = 1
   [junit4]   2> 1775130 T9345 n:127.0.0.1:57350_ x:collection1 oass.SolrIndexSearcher.<init> Opening Searcher@a97921[collection1] main
   [junit4]   2> 1775131 T9345 n:127.0.0.1:57350_ x:collection1 oasr.ManagedResourceStorage.newStorageIO Setting up ZooKeeper-based storage for the RestManager with znodeBase: /configs/conf1
   [junit4]   2> 1775132 T9345 n:127.0.0.1:57350_ x:collection1 oasr.ManagedResourceStorage$ZooKeeperStorageIO.configure Configured ZooKeeperStorageIO with znodeBase: /configs/conf1
   [junit4]   2> 1775132 T9345 n:127.0.0.1:57350_ x:collection1 oasr.RestManager.init Initializing RestManager with initArgs: {}
   [junit4]   2> 1775132 T9345 n:127.0.0.1:57350_ x:collection1 oasr.ManagedResourceStorage.load Reading _rest_managed.json using ZooKeeperStorageIO:path=/configs/conf1
   [junit4]   2> 1775133 T9345 n:127.0.0.1:57350_ x:collection1 oasr.ManagedResourceStorage$ZooKeeperStorageIO.openInputStream No data found for znode /configs/conf1/_rest_managed.json
   [junit4]   2> 1775133 T9345 n:127.0.0.1:57350_ x:collection1 oasr.ManagedResourceStorage.load Loaded null at path _rest_managed.json using ZooKeeperStorageIO:path=/configs/conf1
   [junit4]   2> 1775133 T9345 n:127.0.0.1:57350_ x:collection1 oasr.RestManager.init Initializing 0 registered ManagedResources
   [junit4]   2> 1775133 T9345 n:127.0.0.1:57350_ x:collection1 oash.ReplicationHandler.inform Commits will be reserved for  10000
   [junit4]   2> 1775134 T9346 n:127.0.0.1:57350_ x:collection1 oasc.SolrCore.registerSearcher [collection1] Registered new searcher Searcher@a97921[collection1] main{ExitableDirectoryReader(UninvertingDirectoryReader())}
   [junit4]   2> 1775134 T9345 n:127.0.0.1:57350_ x:collection1 oasc.ZkController.getConfDirListeners watch zkdir /configs/conf1
   [junit4]   2> 1775135 T9345 n:127.0.0.1:57350_ x:collection1 oasu.UpdateLog.onFirstSearcher On first searcher opened, looking up max value of version field
   [junit4]   2> 1775136 T9345 n:127.0.0.1:57350_ x:collection1 oasu.VersionInfo.getMaxVersionFromIndex Refreshing highest value of _version_ for 65536 version buckets from index
   [junit4]   2> 1775136 T9345 n:127.0.0.1:57350_ x:collection1 oasu.VersionInfo.getMaxVersionFromIndex No terms found for _version_, cannot seed version bucket highest value from index
   [junit4]   2> 1775136 T9345 n:127.0.0.1:57350_ x:collection1 oasu.UpdateLog.seedBucketsWithHighestVersion Could not find max version in index or recent updates, using new clock 1502315777121845248
   [junit4]   2> 1775138 T9345 n:127.0.0.1:57350_ x:collection1 oasu.UpdateLog.seedBucketsWithHighestVersion Took 2 ms to seed version buckets with highest version 1502315777121845248
   [junit4]   2> 1775138 T9345 n:127.0.0.1:57350_ x:collection1 oasc.CoreContainer.registerCore registering core: collection1
   [junit4]   2> 1775140 T9349 n:127.0.0.1:57350_ c:collection1 s:shard1 x:collection1 oasc.ZkController.register Register replica - core:collection1 address:http://127.0.0.1:57350 collection:collection1 shard:shard1
   [junit4]   2> 1775140 T9263 n:127.0.0.1:57350_ oass.SolrDispatchFilter.init user.dir=C:\Users\JenkinsSlave\workspace\Lucene-Solr-trunk-Windows\solr\build\solr-core\test\J1
   [junit4]   2> 1775140 T9263 n:127.0.0.1:57350_ oass.SolrDispatchFilter.init SolrDispatchFilter.init() done
   [junit4]   2> 1775146 T9349 n:127.0.0.1:57350_ c:collection1 s:shard1 x:collection1 oasc.ShardLeaderElectionContext.runLeaderProcess Running the leader process for shard shard1
   [junit4]   2> 1775148 T9291 n:127.0.0.1:57326_ oasc.DistributedQueue$LatchWatcher.process NodeChildrenChanged fired on path /overseer/queue state SyncConnected
   [junit4]   2> 1775148 T9349 n:127.0.0.1:57350_ c:collection1 s:shard1 x:collection1 oasc.ShardLeaderElectionContext.waitForReplicasToComeUp Enough replicas found to continue.
   [junit4]   2> 1775148 T9349 n:127.0.0.1:57350_ c:collection1 s:shard1 x:collection1 oasc.ShardLeaderElectionContext.runLeaderProcess I may be the new leader - try and sync
   [junit4]   2> ASYNC  NEW_CORE C1620 name=collection1 org.apache.solr.core.SolrCore@b46c39 url=http://127.0.0.1:57350/collection1 node=127.0.0.1:57350_ C1620_STATE=coll:collection1 core:collection1 props:{core=collection1, base_url=http://127.0.0.1:57350, node_name=127.0.0.1:57350_, state=down}
   [junit4]   2> 1775148 T9349 n:127.0.0.1:57350_ c:collection1 s:shard1 x:collection1 C1620 oasc.SyncStrategy.sync Sync replicas to http://127.0.0.1:57350/collection1/
   [junit4]   2> 1775149 T9349 n:127.0.0.1:57350_ c:collection1 s:shard1 x:collection1 C1620 oasc.SyncStrategy.syncReplicas Sync Success - now sync replicas to me
   [junit4]   2> 1775149 T9349 n:127.0.0.1:57350_ c:collection1 s:shard1 x:collection1 C1620 oasc.SyncStrategy.syncToMe http://127.0.0.1:57350/collection1/ has no replicas
   [junit4]   2> 1775149 T9349 n:127.0.0.1:57350_ c:collection1 s:shard1 x:collection1 oasc.ShardLeaderElectionContext.runLeaderProcess I am the new leader: http://127.0.0.1:57350/collection1/ shard1
   [junit4]   2> 1775149 T9292 n:127.0.0.1:57326_ oasc.Overseer$ClusterStateUpdater.run processMessage: queueSize: 1, message = {
   [junit4]   2> 	  "operation":"leader",
   [junit4]   2> 	  "shard":"shard1",
   [junit4]   2> 	  "collection":"collection1"} current state version: 5
   [junit4]   2> 1775151 T9292 n:127.0.0.1:57326_ oasco.ZkStateWriter.writePendingUpdates going to update_collection /collections/collection1/state.json version: 5
   [junit4]   2> 1775156 T9292 n:127.0.0.1:57326_ oasc.Overseer$ClusterStateUpdater.run processMessage: queueSize: 1, message = {
   [junit4]   2> 	  "operation":"leader",
   [junit4]   2> 	  "shard":"shard1",
   [junit4]   2> 	  "collection":"collection1",
   [junit4]   2> 	  "base_url":"http://127.0.0.1:57350",
   [junit4]   2> 	  "core":"collection1",
   [junit4]   2> 	  "state":"active"} current state version: 5
   [junit4]   2> 1775159 T9292 n:127.0.0.1:57326_ oasco.ZkStateWriter.writePendingUpdates going to update_collection /collections/collection1/state.json version: 6
   [junit4]   2> 1775164 T9291 n:127.0.0.1:57326_ oasc.DistributedQueue$LatchWatcher.process NodeChildrenChanged fired on path /overseer/queue state SyncConnected
   [junit4]   2> 1775197 T9349 n:127.0.0.1:57350_ c:collection1 s:shard1 x:collection1 oasc.ZkController.register We are http://127.0.0.1:57350/collection1/ and leader is http://127.0.0.1:57350/collection1/
   [junit4]   2> 1775197 T9349 n:127.0.0.1:57350_ c:collection1 s:shard1 x:collection1 oasc.ZkController.register No LogReplay needed for core=collection1 baseURL=http://127.0.0.1:57350
   [junit4]   2> 1775197 T9349 n:127.0.0.1:57350_ c:collection1 s:shard1 x:collection1 oasc.ZkController.checkRecovery I am the leader, no recovery necessary
   [junit4]   2> 1775197 T9349 n:127.0.0.1:57350_ c:collection1 s:shard1 x:collection1 oasc.ZkController.publish publishing core=collection1 state=active collection=collection1
   [junit4]   2> 1775198 T9349 n:127.0.0.1:57350_ c:collection1 s:shard1 x:collection1 oasc.ZkController.publish numShards not found on descriptor - reading it from system property
   [junit4]   2> 1775198 T9291 n:127.0.0.1:57326_ oasc.DistributedQueue$LatchWatcher.process NodeChildrenChanged fired on path /overseer/queue state SyncConnected
   [junit4]   2> 1775199 T9292 n:127.0.0.1:57326_ oasc.Overseer$ClusterStateUpdater.run processMessage: queueSize: 1, message = {
   [junit4]   2> 	  "core":"collection1",
   [junit4]   2> 	  "core_node_name":"core_node2",
   [junit4]   2> 	  "roles":null,
   [junit4]   2> 	  "base_url":"http://127.0.0.1:57350",
   [junit4]   2> 	  "node_name":"127.0.0.1:57350_",
   [junit4]   2> 	  "numShards":"2",
   [junit4]   2> 	  "state":"active",
   [junit4]   2> 	  "shard":"shard1",
   [junit4]   2> 	  "collection":"collection1",
   [junit4]   2> 	  "operation":"state"} current state version: 5
   [junit4]   2> 1775200 T9292 n:127.0.0.1:57326_ oasco.ReplicaMutator.updateState Update state numShards=2 message={
   [junit4]   2> 	  "core":"collection1",
   [junit4]   2> 	  "core_node_name":"core_node2",
   [junit4]   2> 	  "roles":null,
   [junit4]   2> 	  "base_url":"http://127.0.0.1:57350",
   [junit4]   2> 	  "node_name":"127.0.0.1:57350_",
   [junit4]   2> 	  "numShards":"2",
   [junit4]   2> 	  "state":"active",
   [junit4]   2> 	  "shard":"shard1",
   [junit4]   2> 	  "collection":"collection1",
   [junit4]   2> 	  "operation":"state"}
   [junit4]   2> 1775202 T9292 n:127.0.0.1:57326_ oasco.ZkStateWriter.writePendingUpdates going to update_collection /collections/collection1/state.json version: 7
   [junit4]   2> 1775469 T9263 oas.SolrTestCaseJ4.writeCoreProperties Writing core.properties file to C:\Users\JenkinsSlave\workspace\Lucene-Solr-trunk-Windows\solr\build\solr-core\test\J1\temp\solr.cloud.MultiThreadedOCPTest FF25C44C4CBB8E2A-001\shard-3-001\cores\collection1
   [junit4]   2> 1775472 T9263 oasc.AbstractFullDistribZkTestBase.createJettys create jetty 3 in directory C:\Users\JenkinsSlave\workspace\Lucene-Solr-trunk-Windows\solr\build\solr-core\test\J1\temp\solr.cloud.MultiThreadedOCPTest FF25C44C4CBB8E2A-001\shard-3-001
   [junit4]   2> 1775473 T9263 oejs.Server.doStart jetty-9.2.10.v20150310
   [junit4]   2> 1775477 T9263 oejsh.ContextHandler.doStart Started o.e.j.s.ServletContextHandler@19ed38e{/,null,AVAILABLE}
   [junit4]   2> 1775477 T9263 oejs.AbstractConnector.doStart Started ServerConnector@15de674{HTTP/1.1}{127.0.0.1:57359}
   [junit4]   2> 1775478 T9263 oejs.Server.doStart Started @1785427ms
   [junit4]   2> 1775478 T9263 oascse.JettySolrRunner$1.lifeCycleStarted Jetty properties: {solrconfig=solrconfig.xml, hostContext=/, hostPort=57359, coreRootDirectory=C:\Users\JenkinsSlave\workspace\Lucene-Solr-trunk-Windows\solr\build\solr-core\test\J1\temp\solr.cloud.MultiThreadedOCPTest FF25C44C4CBB8E2A-001\shard-3-001\cores}
   [junit4]   2> 1775479 T9263 oass.SolrDispatchFilter.init SolrDispatchFilter.init()sun.misc.Launcher$AppClassLoader@e2f2a
   [junit4]   2> 1775479 T9263 oasc.SolrResourceLoader.<init> new SolrResourceLoader for directory: 'C:\Users\JenkinsSlave\workspace\Lucene-Solr-trunk-Windows\solr\build\solr-core\test\J1\temp\solr.cloud.MultiThreadedOCPTest FF25C44C4CBB8E2A-001\shard-3-001\'
   [junit4]   2> 1775511 T9263 oasc.SolrXmlConfig.fr

[...truncated too long message...]

asc.ChaosMonkey.monkeyLog monkey: stop shard! 57326
   [junit4]   2> 1979520 T9263 oasc.ZkTestServer.send4LetterWord connecting to 127.0.0.1:57319 57319
   [junit4]   2> 1981997 T9264 oasc.ZkTestServer.send4LetterWord connecting to 127.0.0.1:57319 57319
   [junit4]   2> 1981999 T9264 oasc.ZkTestServer$ZKServerMain.runFromConfig WARN Watch limit violations: 
   [junit4]   2> 	Maximum concurrent create/delete watches above limit:
   [junit4]   2> 	
   [junit4]   2> 		6	/solr/aliases.json
   [junit4]   2> 		6	/solr/clusterstate.json
   [junit4]   2> 		5	/solr/configs/conf1
   [junit4]   2> 		4	/solr/collections/ocptest_shardsplit2/state.json
   [junit4]   2> 		4	/solr/collections/ocptest1/state.json
   [junit4]   2> 		4	/solr/collections/ocptest2/state.json
   [junit4]   2> 		4	/solr/collections/collection1/state.json
   [junit4]   2> 		4	/solr/collections/ocptest4/state.json
   [junit4]   2> 		4	/solr/collections/ocptest3/state.json
   [junit4]   2> 		4	/solr/collections/ocptest_shardsplit/state.json
   [junit4]   2> 	
   [junit4]   2> 	Maximum concurrent children watches above limit:
   [junit4]   2> 	
   [junit4]   2> 		6	/solr/live_nodes
   [junit4]   2> 		5	/solr/overseer/collection-queue-work
   [junit4]   2> 		4	/solr/overseer/queue
   [junit4]   2> 	
   [junit4]   2> NOTE: reproduce with: ant test  -Dtestcase=MultiThreadedOCPTest -Dtests.method=test -Dtests.seed=FF25C44C4CBB8E2A -Dtests.slow=true -Dtests.locale=en_ZA -Dtests.timezone=Australia/Eucla -Dtests.asserts=true -Dtests.file.encoding=Cp1252
   [junit4] ERROR    213s J1 | MultiThreadedOCPTest.test <<<
   [junit4]    > Throwable #1: com.carrotsearch.randomizedtesting.UncaughtExceptionError: Captured an uncaught exception in thread: Thread[id=9599, name=parallelCoreAdminExecutor-4953-thread-15, state=RUNNABLE, group=TGRP-MultiThreadedOCPTest]
   [junit4]    > 	at __randomizedtesting.SeedInfo.seed([FF25C44C4CBB8E2A:7771FB96E247E3D2]:0)
   [junit4]    > Caused by: java.lang.AssertionError: Too many closes on SolrCore
   [junit4]    > 	at __randomizedtesting.SeedInfo.seed([FF25C44C4CBB8E2A]:0)
   [junit4]    > 	at org.apache.solr.core.SolrCore.close(SolrCore.java:1150)
   [junit4]    > 	at org.apache.solr.common.util.IOUtils.closeQuietly(IOUtils.java:31)
   [junit4]    > 	at org.apache.solr.core.CoreContainer.create(CoreContainer.java:652)
   [junit4]    > 	at org.apache.solr.core.CoreContainer.create(CoreContainer.java:611)
   [junit4]    > 	at org.apache.solr.handler.admin.CoreAdminHandler.handleCreateAction(CoreAdminHandler.java:628)
   [junit4]    > 	at org.apache.solr.handler.admin.CoreAdminHandler.handleRequestInternal(CoreAdminHandler.java:213)
   [junit4]    > 	at org.apache.solr.handler.admin.CoreAdminHandler$ParallelCoreAdminHandlerThread.run(CoreAdminHandler.java:1249)
   [junit4]    > 	at org.apache.solr.common.util.ExecutorUtil$MDCAwareThreadPoolExecutor$1.run(ExecutorUtil.java:148)
   [junit4]    > 	at java.util.concurrent.ThreadPoolExecutor.runWorker(ThreadPoolExecutor.java:1142)
   [junit4]    > 	at java.util.concurrent.ThreadPoolExecutor$Worker.run(ThreadPoolExecutor.java:617)
   [junit4]    > 	at java.lang.Thread.run(Thread.java:745)
   [junit4]   2> 1982018 T9263 oas.SolrTestCaseJ4.deleteCore ###deleteCore
   [junit4]   2> NOTE: test params are: codec=Asserting(Lucene50): {range_facet_l_dv=PostingsFormat(name=LuceneVarGapDocFreqInterval), _version_=PostingsFormat(name=Memory doPackFST= false), multiDefault=PostingsFormat(name=Asserting), intDefault=PostingsFormat(name=Memory doPackFST= false), id=PostingsFormat(name=LuceneVarGapDocFreqInterval), range_facet_i_dv=PostingsFormat(name=Asserting), range_facet_l=PostingsFormat(name=Asserting), timestamp=PostingsFormat(name=Asserting)}, docValues:{range_facet_l_dv=DocValuesFormat(name=Memory), range_facet_i_dv=DocValuesFormat(name=Asserting), timestamp=DocValuesFormat(name=Asserting)}, sim=DefaultSimilarity, locale=en_ZA, timezone=Australia/Eucla
   [junit4]   2> NOTE: Windows 7 6.1 x86/Oracle Corporation 1.8.0_45 (32-bit)/cpus=3,threads=1,free=302394256,total=536870912
   [junit4]   2> NOTE: All tests run in this JVM: [AnalysisErrorHandlingTest, TestManagedResourceStorage, TestMergePolicyConfig, TestSerializedLuceneMatchVersion, DateFieldTest, MigrateRouteKeyTest, BinaryUpdateRequestHandlerTest, OpenCloseCoreStressTest, FileUtilsTest, TestSolrQueryParser, SolrCmdDistributorTest, BlockDirectoryTest, StandardRequestHandlerTest, TestRebalanceLeaders, TestConfig, VersionInfoTest, CopyFieldTest, RAMDirectoryFactoryTest, BadCopyFieldTest, TestSchemaNameResource, TestReqParamsAPI, EchoParamsTest, HdfsBasicDistributedZkTest, AnalyticsMergeStrategyTest, TestSolrDynamicMBean, MBeansHandlerTest, DistributedVersionInfoTest, TestSimpleTrackingShardHandler, TestFieldTypeResource, CurrencyFieldOpenExchangeTest, TestNamedUpdateProcessors, TestJettySolrRunner, TestManagedResource, TestShortCircuitedRequests, TestSearcherReuse, TestReversedWildcardFilterFactory, AliasIntegrationTest, SaslZkACLProviderTest, ExternalCollectionsTest, QueryEqualityTest, TestZkChroot, BlockCacheTest, TestAddFieldRealTimeGet, ConvertedLegacyTest, PluginInfoTest, FastVectorHighlighterTest, HdfsThreadLeakTest, TestLuceneMatchVersion, TestDFRSimilarityFactory, HdfsRecoverLeaseTest, ParsingFieldUpdateProcessorsTest, DistributedFacetPivotLongTailTest, TestHdfsUpdateLog, TestSolr4Spatial, SolrCloudExampleTest, UpdateParamsTest, TermVectorComponentTest, TestLRUStatsCache, TestPHPSerializedResponseWriter, TestStressUserVersions, AsyncMigrateRouteKeyTest, HdfsChaosMonkeySafeLeaderTest, CachingDirectoryFactoryTest, ZkSolrClientTest, RecoveryAfterSoftCommitTest, DirectSolrSpellCheckerTest, TestValueSourceCache, TestMissingGroups, MinimalSchemaTest, ResourceLoaderTest, TestSolr4Spatial2, TestSchemaSimilarityResource, LoggingHandlerTest, VMParamsZkACLAndCredentialsProvidersTest, TestSolrConfigHandler, TestRequestStatusCollectionAPI, BasicDistributedZk2Test, TestLMDirichletSimilarityFactory, DistributedDebugComponentTest, TestNonDefinedSimilarityFactory, TestSolrDeletionPolicy2, RollingRestartTest, DocumentBuilderTest, CollectionsAPIDistributedZkTest, TestRemoteStreaming, DistribJoinFromCollectionTest, AddSchemaFieldsUpdateProcessorFactoryTest, DistributedExpandComponentTest, RequestLoggingTest, CloudMLTQParserTest, TestInfoStreamLogging, HdfsUnloadDistributedZkTest, DateMathParserTest, TestDistributedGrouping, FieldMutatingUpdateProcessorTest, RegexBoostProcessorTest, TestStandardQParsers, DocValuesMissingTest, TestSolrCoreProperties, TestSortingResponseWriter, TestTolerantSearch, TestSolrJ, HttpPartitionTest, SegmentsInfoRequestHandlerTest, TestIntervalFaceting, QueryParsingTest, TestFuzzyAnalyzedSuggestions, TestObjectReleaseTracker, CursorPagingTest, DebugComponentTest, TestClusterStateMutator, SpatialFilterTest, SuggestComponentTest, DistributedQueueTest, TestRecovery, SolrIndexConfigTest, TestReload, TestImplicitCoreProperties, CSVRequestHandlerTest, TestManagedSchemaFieldTypeResource, SpellPossibilityIteratorTest, DeleteShardTest, TestFastWriter, TestBadConfig, ChaosMonkeySafeLeaderTest, SyncSliceTest, ClusterStateUpdateTest, TestRandomFaceting, TestRandomDVFaceting, ZkCLITest, TestFaceting, ZkControllerTest, TestStressReorder, TestStressVersions, TestCoreContainer, StatsComponentTest, TestFiltering, OverseerCollectionProcessorTest, DistributedQueryElevationComponentTest, SignatureUpdateProcessorFactoryTest, SuggesterFSTTest, TestFoldingMultitermQuery, TestStressLucene, TestTrie, PolyFieldTest, WordBreakSolrSpellCheckerTest, TestPseudoReturnFields, DirectUpdateHandlerOptimizeTest, DocValuesMultiTest, DistanceFunctionTest, TestSolrDeletionPolicy1, XsltUpdateRequestHandlerTest, IndexBasedSpellCheckerTest, DisMaxRequestHandlerTest, FileBasedSpellCheckerTest, XmlUpdateRequestHandlerTest, MoreLikeThisHandlerTest, TestArbitraryIndexDir, TestJmxIntegration, UpdateRequestProcessorFactoryTest, TestCSVResponseWriter, UniqFieldsUpdateProcessorFactoryTest, JsonLoaderTest, TestComponentsName, HighlighterConfigTest, TestQuerySenderListener, ResponseLogComponentTest, MultiTermTest, TestBinaryField, TestElisionMultitermQuery, ExternalFileFieldSortTest, NotRequiredUniqueKeyTest, TestXIncludeConfig, TestLMJelinekMercerSimilarityFactory, TimeZoneUtilsTest, ScriptEngineTest, TestFastLRUCache, ChaosMonkeyNothingIsSafeTest, BaseCdcrDistributedZkTest, CloudExitableDirectoryReaderTest, ConnectionManagerTest, CustomCollectionTest, LeaderInitiatedRecoveryOnCommitTest, MultiThreadedOCPTest]
   [junit4] Completed [404/503] on J1 in 213.91s, 1 test, 1 error <<< FAILURES!

[...truncated 313 lines...]
BUILD FAILED
C:\Users\JenkinsSlave\workspace\Lucene-Solr-trunk-Windows\build.xml:526: The following error occurred while executing this line:
C:\Users\JenkinsSlave\workspace\Lucene-Solr-trunk-Windows\build.xml:474: The following error occurred while executing this line:
C:\Users\JenkinsSlave\workspace\Lucene-Solr-trunk-Windows\build.xml:61: The following error occurred while executing this line:
C:\Users\JenkinsSlave\workspace\Lucene-Solr-trunk-Windows\extra-targets.xml:39: The following error occurred while executing this line:
C:\Users\JenkinsSlave\workspace\Lucene-Solr-trunk-Windows\solr\build.xml:230: The following error occurred while executing this line:
C:\Users\JenkinsSlave\workspace\Lucene-Solr-trunk-Windows\solr\common-build.xml:512: The following error occurred while executing this line:
C:\Users\JenkinsSlave\workspace\Lucene-Solr-trunk-Windows\lucene\common-build.xml:1415: The following error occurred while executing this line:
C:\Users\JenkinsSlave\workspace\Lucene-Solr-trunk-Windows\lucene\common-build.xml:973: There were test failures: 503 suites, 1984 tests, 1 error, 66 ignored (34 assumptions)

Total time: 58 minutes 15 seconds
Build step 'Invoke Ant' marked build as failure
Archiving artifacts
Recording test results
Email was triggered for: Failure - Any
Sending email for trigger: Failure - Any



Mime
View raw message