lucene-dev mailing list archives

Site index · List index
Message view « Date » · « Thread »
Top « Date » · « Thread »
From Policeman Jenkins Server <jenk...@thetaphi.de>
Subject [JENKINS] Lucene-Solr-trunk-Windows (64bit/jdk1.8.0_45) - Build # 4845 - Still Failing!
Date Sat, 23 May 2015 22:29:38 GMT
Build: http://jenkins.thetaphi.de/job/Lucene-Solr-trunk-Windows/4845/
Java: 64bit/jdk1.8.0_45 -XX:+UseCompressedOops -XX:+UseSerialGC

2 tests failed.
FAILED:  org.apache.solr.ConvertedLegacyTest.testABunchOfConvertedStuff

Error Message:
Test abandoned because suite timeout was reached.

Stack Trace:
java.lang.Exception: Test abandoned because suite timeout was reached.
	at __randomizedtesting.SeedInfo.seed([9A942A4156E3F0E8]:0)


FAILED:  junit.framework.TestSuite.org.apache.solr.ConvertedLegacyTest

Error Message:
Suite timeout exceeded (>= 7200000 msec).

Stack Trace:
java.lang.Exception: Suite timeout exceeded (>= 7200000 msec).
	at __randomizedtesting.SeedInfo.seed([9A942A4156E3F0E8]:0)




Build Log:
[...truncated 10735 lines...]
   [junit4] Suite: org.apache.solr.ConvertedLegacyTest
   [junit4]   2> Creating dataDir: C:\Users\JenkinsSlave\workspace\Lucene-Solr-trunk-Windows\solr\build\solr-core\test\J1\temp\solr.ConvertedLegacyTest 9A942A4156E3F0E8-001\init-core-data-001
   [junit4]   2> 793096 T5225 oas.SolrTestCaseJ4.buildSSLConfig Randomized ssl (false) and clientAuth (false)
   [junit4]   2> 793099 T5225 oas.SolrTestCaseJ4.initCore ####initCore
   [junit4]   2> 793099 T5225 oasc.SolrResourceLoader.<init> new SolrResourceLoader for directory: 'C:\Users\JenkinsSlave\workspace\Lucene-Solr-trunk-Windows\solr\core\src\test-files\solr\collection1\'
   [junit4]   2> 793100 T5225 oasc.SolrResourceLoader.replaceClassLoader Adding 'file:/C:/Users/JenkinsSlave/workspace/Lucene-Solr-trunk-Windows/solr/core/src/test-files/solr/collection1/lib/classes/' to classloader
   [junit4]   2> 793101 T5225 oasc.SolrResourceLoader.replaceClassLoader Adding 'file:/C:/Users/JenkinsSlave/workspace/Lucene-Solr-trunk-Windows/solr/core/src/test-files/solr/collection1/lib/README' to classloader
   [junit4]   2> 793165 T5225 oasc.SolrConfig.refreshRequestParams current version of requestparams : -1
   [junit4]   2> 793177 T5225 oasc.SolrConfig.<init> Using Lucene MatchVersion: 6.0.0
   [junit4]   2> 793207 T5225 oasc.SolrConfig.<init> Loaded SolrConfig: solrconfig.xml
   [junit4]   2> 793208 T5225 oass.IndexSchema.readSchema Reading Solr Schema from C:\Users\JenkinsSlave\workspace\Lucene-Solr-trunk-Windows\solr\core\src\test-files\solr\collection1\conf\schema.xml
   [junit4]   2> 793214 T5225 oass.IndexSchema.readSchema [null] Schema name=test
   [junit4]   2> 793336 T5225 oass.OpenExchangeRatesOrgProvider.init Initialized with rates=open-exchange-rates.json, refreshInterval=1440.
   [junit4]   2> 793343 T5225 oass.IndexSchema.readSchema default search field in schema is text
   [junit4]   2> 793344 T5225 oass.IndexSchema.readSchema unique key field: id
   [junit4]   2> 793349 T5225 oass.FileExchangeRateProvider.reload Reloading exchange rates from file currency.xml
   [junit4]   2> 793351 T5225 oass.FileExchangeRateProvider.reload Reloading exchange rates from file currency.xml
   [junit4]   2> 793354 T5225 oass.OpenExchangeRatesOrgProvider.reload Reloading exchange rates from open-exchange-rates.json
   [junit4]   2> 793355 T5225 oass.OpenExchangeRatesOrgProvider$OpenExchangeRates.<init> WARN Unknown key IMPORTANT NOTE
   [junit4]   2> 793356 T5225 oass.OpenExchangeRatesOrgProvider$OpenExchangeRates.<init> WARN Expected key, got STRING
   [junit4]   2> 793356 T5225 oass.OpenExchangeRatesOrgProvider.reload Reloading exchange rates from open-exchange-rates.json
   [junit4]   2> 793356 T5225 oass.OpenExchangeRatesOrgProvider$OpenExchangeRates.<init> WARN Unknown key IMPORTANT NOTE
   [junit4]   2> 793356 T5225 oass.OpenExchangeRatesOrgProvider$OpenExchangeRates.<init> WARN Expected key, got STRING
   [junit4]   2> 793357 T5225 oasc.SolrResourceLoader.locateSolrHome JNDI not configured for solr (NoInitialContextEx)
   [junit4]   2> 793357 T5225 oasc.SolrResourceLoader.locateSolrHome using system property solr.solr.home: C:\Users\JenkinsSlave\workspace\Lucene-Solr-trunk-Windows\solr\core\src\test-files\solr
   [junit4]   2> 793357 T5225 oasc.SolrResourceLoader.<init> new SolrResourceLoader for directory: 'C:\Users\JenkinsSlave\workspace\Lucene-Solr-trunk-Windows\solr\core\src\test-files\solr\'
   [junit4]   2> 793374 T5225 oasc.CoreContainer.<init> New CoreContainer 503254736
   [junit4]   2> 793374 T5225 oasc.CoreContainer.load Loading cores into CoreContainer [instanceDir=C:\Users\JenkinsSlave\workspace\Lucene-Solr-trunk-Windows\solr\core\src\test-files\solr\]
   [junit4]   2> 793374 T5225 oasc.CoreContainer.load loading shared library: C:\Users\JenkinsSlave\workspace\Lucene-Solr-trunk-Windows\solr\core\src\test-files\solr\lib
   [junit4]   2> 793374 T5225 oasc.SolrResourceLoader.addToClassLoader WARN Can't find (or read) directory to add to classloader: lib (resolved as: C:\Users\JenkinsSlave\workspace\Lucene-Solr-trunk-Windows\solr\core\src\test-files\solr\lib).
   [junit4]   2> 793382 T5225 oashc.HttpShardHandlerFactory.init created with socketTimeout : 600000,connTimeout : 60000,maxConnectionsPerHost : 20,maxConnections : 10000,corePoolSize : 0,maximumPoolSize : 2147483647,maxThreadIdleTime : 5,sizeOfQueue : -1,fairnessPolicy : false,useRetries : false,
   [junit4]   2> 793386 T5225 oasu.UpdateShardHandler.<init> Creating UpdateShardHandler HTTP client with params: socketTimeout=30000&connTimeout=30000&retry=true
   [junit4]   2> 793387 T5225 oasl.LogWatcher.createWatcher SLF4J impl is org.slf4j.impl.Log4jLoggerFactory
   [junit4]   2> 793387 T5225 oasl.LogWatcher.newRegisteredLogWatcher Registering Log Listener [Log4j (org.slf4j.impl.Log4jLoggerFactory)]
   [junit4]   2> 793387 T5225 oasc.CoreContainer.load Node Name: testNode
   [junit4]   2> 793387 T5225 oasc.CoreContainer.initializeAuthenticationPlugin No authentication plugin used.
   [junit4]   2> 793389 T5225 oasc.CoreDescriptor.<init> CORE DESCRIPTOR: {name=collection1, config=solrconfig.xml, transient=false, schema=schema.xml, loadOnStartup=true, instanceDir=collection1, collection=collection1, absoluteInstDir=C:\Users\JenkinsSlave\workspace\Lucene-Solr-trunk-Windows\solr\core\src\test-files\solr\collection1\, dataDir=C:\Users\JenkinsSlave\workspace\Lucene-Solr-trunk-Windows\solr\build\solr-core\test\J1\temp\solr.ConvertedLegacyTest 9A942A4156E3F0E8-001\init-core-data-001, shard=shard1}
   [junit4]   2> 793391 T5226 oasc.SolrResourceLoader.<init> new SolrResourceLoader for directory: 'C:\Users\JenkinsSlave\workspace\Lucene-Solr-trunk-Windows\solr\core\src\test-files\solr\collection1\'
   [junit4]   2> 793393 T5226 oasc.SolrResourceLoader.replaceClassLoader Adding 'file:/C:/Users/JenkinsSlave/workspace/Lucene-Solr-trunk-Windows/solr/core/src/test-files/solr/collection1/lib/classes/' to classloader
   [junit4]   2> 793393 T5226 oasc.SolrResourceLoader.replaceClassLoader Adding 'file:/C:/Users/JenkinsSlave/workspace/Lucene-Solr-trunk-Windows/solr/core/src/test-files/solr/collection1/lib/README' to classloader
   [junit4]   2> 793424 T5226 oasc.SolrConfig.refreshRequestParams current version of requestparams : -1
   [junit4]   2> 793438 T5226 oasc.SolrConfig.<init> Using Lucene MatchVersion: 6.0.0
   [junit4]   2> 793470 T5226 oasc.SolrConfig.<init> Loaded SolrConfig: solrconfig.xml
   [junit4]   2> 793470 T5226 oass.IndexSchema.readSchema Reading Solr Schema from C:\Users\JenkinsSlave\workspace\Lucene-Solr-trunk-Windows\solr\core\src\test-files\solr\collection1\conf\schema.xml
   [junit4]   2> 793476 T5226 oass.IndexSchema.readSchema [collection1] Schema name=test
   [junit4]   2> 793622 T5226 oass.OpenExchangeRatesOrgProvider.init Initialized with rates=open-exchange-rates.json, refreshInterval=1440.
   [junit4]   2> 793630 T5226 oass.IndexSchema.readSchema default search field in schema is text
   [junit4]   2> 793631 T5226 oass.IndexSchema.readSchema unique key field: id
   [junit4]   2> 793639 T5226 oass.FileExchangeRateProvider.reload Reloading exchange rates from file currency.xml
   [junit4]   2> 793642 T5226 oass.FileExchangeRateProvider.reload Reloading exchange rates from file currency.xml
   [junit4]   2> 793645 T5226 oass.OpenExchangeRatesOrgProvider.reload Reloading exchange rates from open-exchange-rates.json
   [junit4]   2> 793646 T5226 oass.OpenExchangeRatesOrgProvider$OpenExchangeRates.<init> WARN Unknown key IMPORTANT NOTE
   [junit4]   2> 793646 T5226 oass.OpenExchangeRatesOrgProvider$OpenExchangeRates.<init> WARN Expected key, got STRING
   [junit4]   2> 793646 T5226 oass.OpenExchangeRatesOrgProvider.reload Reloading exchange rates from open-exchange-rates.json
   [junit4]   2> 793647 T5226 oass.OpenExchangeRatesOrgProvider$OpenExchangeRates.<init> WARN Unknown key IMPORTANT NOTE
   [junit4]   2> 793647 T5226 oass.OpenExchangeRatesOrgProvider$OpenExchangeRates.<init> WARN Expected key, got STRING
   [junit4]   2> 793647 T5226 oasc.CoreContainer.create Creating SolrCore 'collection1' using configuration from instancedir C:\Users\JenkinsSlave\workspace\Lucene-Solr-trunk-Windows\solr\core\src\test-files\solr\collection1\
   [junit4]   2> 793647 T5226 x:collection1 oasc.SolrCore.initDirectoryFactory org.apache.solr.core.MockDirectoryFactory
   [junit4]   2> 793648 T5226 x:collection1 oasc.SolrCore.<init> [[collection1] ] Opening new SolrCore at [C:\Users\JenkinsSlave\workspace\Lucene-Solr-trunk-Windows\solr\core\src\test-files\solr\collection1\], dataDir=[null]
   [junit4]   2> 793648 T5226 x:collection1 oasc.JmxMonitoredMap.<init> JMX monitoring is enabled. Adding Solr mbeans to JMX Server: com.sun.jmx.mbeanserver.JmxMBeanServer@45d493d3
   [junit4]   2> 793648 T5226 x:collection1 oasc.CachingDirectoryFactory.get return new directory for C:\Users\JenkinsSlave\workspace\Lucene-Solr-trunk-Windows\solr\build\solr-core\test\J1\temp\solr.ConvertedLegacyTest 9A942A4156E3F0E8-001\init-core-data-001\
   [junit4]   2> 793649 T5226 x:collection1 oasc.SolrCore.getNewIndexDir New index directory detected: old=null new=C:\Users\JenkinsSlave\workspace\Lucene-Solr-trunk-Windows\solr\build\solr-core\test\J1\temp\solr.ConvertedLegacyTest 9A942A4156E3F0E8-001\init-core-data-001\index/
   [junit4]   2> 793649 T5226 x:collection1 oasc.SolrCore.initIndex WARN [collection1] Solr index directory 'C:\Users\JenkinsSlave\workspace\Lucene-Solr-trunk-Windows\solr\build\solr-core\test\J1\temp\solr.ConvertedLegacyTest 9A942A4156E3F0E8-001\init-core-data-001\index' doesn't exist. Creating new index...
   [junit4]   2> 793649 T5226 x:collection1 oasc.CachingDirectoryFactory.get return new directory for C:\Users\JenkinsSlave\workspace\Lucene-Solr-trunk-Windows\solr\build\solr-core\test\J1\temp\solr.ConvertedLegacyTest 9A942A4156E3F0E8-001\init-core-data-001\index
   [junit4]   2> 793650 T5226 x:collection1 oasu.RandomMergePolicy.<init> RandomMergePolicy wrapping class org.apache.lucene.index.TieredMergePolicy: [TieredMergePolicy: maxMergeAtOnce=43, maxMergeAtOnceExplicit=34, maxMergedSegmentMB=8.27734375, floorSegmentMB=1.283203125, forceMergeDeletesPctAllowed=1.5521181997010025, segmentsPerTier=41.0, maxCFSSegmentSizeMB=8.796093022207999E12, noCFSRatio=1.0
   [junit4]   2> 793652 T5226 x:collection1 oasc.SolrDeletionPolicy.onCommit SolrDeletionPolicy.onCommit: commits: num=1
   [junit4]   2> 		commit{dir=MockDirectoryWrapper(RAMDirectory@4553dd1a lockFactory=org.apache.lucene.store.SingleInstanceLockFactory@15b714ef),segFN=segments_1,generation=1}
   [junit4]   2> 793652 T5226 x:collection1 oasc.SolrDeletionPolicy.updateCommits newest commit generation = 1
   [junit4]   2> 793658 T5226 x:collection1 oasup.UpdateRequestProcessorChain.init creating updateRequestProcessorChain "dedupe"
   [junit4]   2> 793658 T5226 x:collection1 oasup.UpdateRequestProcessorChain.init inserting DistributedUpdateProcessorFactory into updateRequestProcessorChain "dedupe"
   [junit4]   2> 793658 T5226 x:collection1 oasup.UpdateRequestProcessorChain.init creating updateRequestProcessorChain "dedupe-allfields"
   [junit4]   2> 793659 T5226 x:collection1 oasup.UpdateRequestProcessorChain.init inserting DistributedUpdateProcessorFactory into updateRequestProcessorChain "dedupe-allfields"
   [junit4]   2> 793659 T5226 x:collection1 oasup.UpdateRequestProcessorChain.init creating updateRequestProcessorChain "stored_sig"
   [junit4]   2> 793659 T5226 x:collection1 oasup.UpdateRequestProcessorChain.init inserting DistributedUpdateProcessorFactory into updateRequestProcessorChain "stored_sig"
   [junit4]   2> 793659 T5226 x:collection1 oasup.UpdateRequestProcessorChain.init creating updateRequestProcessorChain "uniq-fields"
   [junit4]   2> 793660 T5226 x:collection1 oasup.UpdateRequestProcessorChain.init inserting DistributedUpdateProcessorFactory into updateRequestProcessorChain "uniq-fields"
   [junit4]   2> 793660 T5226 x:collection1 oasup.UpdateRequestProcessorChain.init creating updateRequestProcessorChain "distrib-dup-test-chain-explicit"
   [junit4]   2> 793660 T5226 x:collection1 oasup.UpdateRequestProcessorChain.init creating updateRequestProcessorChain "distrib-dup-test-chain-implicit"
   [junit4]   2> 793661 T5226 x:collection1 oasup.UpdateRequestProcessorChain.init inserting DistributedUpdateProcessorFactory into updateRequestProcessorChain "distrib-dup-test-chain-implicit"
   [junit4]   2> 793661 T5226 x:collection1 oasc.SolrCore.loadUpdateProcessorChains no updateRequestProcessorChain defined as default, creating implicit default
   [junit4]   2> 793669 T5226 x:collection1 oashl.XMLLoader.init xsltCacheLifetimeSeconds=60
   [junit4]   2> 793671 T5226 x:collection1 oashl.XMLLoader.init xsltCacheLifetimeSeconds=60
   [junit4]   2> 793673 T5226 x:collection1 oashl.XMLLoader.init xsltCacheLifetimeSeconds=60
   [junit4]   2> 793675 T5226 x:collection1 oashl.XMLLoader.init xsltCacheLifetimeSeconds=60
   [junit4]   2> 793681 T5226 x:collection1 oasc.PluginBag.createPlugin requestHandler : 'lazy' created with startup=lazy 
   [junit4]   2> 793684 T5226 x:collection1 oasc.RequestHandlers.initHandlersFromConfig Registered paths: /admin/mbeans,standard,spellCheckCompRH,lazy,/update/json/docs,/admin/luke,spellCheckWithWordbreak_Direct,tvrh,/get,/admin/properties,/update/json,mltrh,/admin/threads,/search-facet-def,/update/csv,/search-facet-invariants,/admin/segments,spellCheckCompRH1,/mlt,/admin/system,/replication,dismax,defaults,/config,/schema,/admin/plugins,/admin/logging,spellCheckWithWordbreak,mock,/admin/ping,/update,/admin/file,/terms,spellCheckCompRH_Direct,/debug/dump
   [junit4]   2> 793685 T5226 x:collection1 oasc.SolrCore.initDeprecatedSupport WARN solrconfig.xml uses deprecated <admin/gettableFiles>, Please update your config to use the ShowFileRequestHandler.
   [junit4]   2> 793685 T5226 x:collection1 oasc.SolrCore.initStatsCache Using default statsCache cache: org.apache.solr.search.stats.LocalStatsCache
   [junit4]   2> 793686 T5226 x:collection1 oasu.UpdateHandler.<init> Using UpdateLog implementation: org.apache.solr.update.UpdateLog
   [junit4]   2> 793687 T5226 x:collection1 oasu.UpdateLog.init Initializing UpdateLog: dataDir= defaultSyncLevel=FLUSH numRecordsToKeep=100 maxNumLogsToKeep=10 numVersionBuckets=65536
   [junit4]   2> 793688 T5226 x:collection1 oasu.CommitTracker.<init> Hard AutoCommit: disabled
   [junit4]   2> 793688 T5226 x:collection1 oasu.CommitTracker.<init> Soft AutoCommit: disabled
   [junit4]   2> 793690 T5226 x:collection1 oasu.RandomMergePolicy.<init> RandomMergePolicy wrapping class org.apache.lucene.index.TieredMergePolicy: [TieredMergePolicy: maxMergeAtOnce=47, maxMergeAtOnceExplicit=14, maxMergedSegmentMB=84.15234375, floorSegmentMB=1.90234375, forceMergeDeletesPctAllowed=8.456899662584219, segmentsPerTier=21.0, maxCFSSegmentSizeMB=8.796093022207999E12, noCFSRatio=1.0
   [junit4]   2> 793690 T5226 x:collection1 oasc.SolrDeletionPolicy.onInit SolrDeletionPolicy.onInit: commits: num=1
   [junit4]   2> 		commit{dir=MockDirectoryWrapper(RAMDirectory@4553dd1a lockFactory=org.apache.lucene.store.SingleInstanceLockFactory@15b714ef),segFN=segments_1,generation=1}
   [junit4]   2> 793690 T5226 x:collection1 oasc.SolrDeletionPolicy.updateCommits newest commit generation = 1
   [junit4]   2> 793690 T5226 x:collection1 oass.SolrIndexSearcher.<init> Opening Searcher@74b0f690[collection1] main
   [junit4]   2> 793691 T5226 x:collection1 oasu.UpdateLog.onFirstSearcher On first searcher opened, looking up max value of version field
   [junit4]   2> 793691 T5226 x:collection1 oasu.VersionInfo.getMaxVersionFromIndex Refreshing highest value of _version_ for 65536 version buckets from index
   [junit4]   2> 793691 T5226 x:collection1 oasu.VersionInfo.getMaxVersionFromIndex WARN No terms found for _version_, cannot seed version bucket highest value from index
   [junit4]   2> 793691 T5226 x:collection1 oasu.UpdateLog.seedBucketsWithHighestVersion WARN Could not find max version in index or recent updates, using new clock 1501993776339484672
   [junit4]   2> 793693 T5226 x:collection1 oasu.UpdateLog.seedBucketsWithHighestVersion Took 2 ms to seed version buckets with highest version 1501993776339484672
   [junit4]   2> 793693 T5226 x:collection1 oasr.RestManager.init Initializing RestManager with initArgs: {storageIO=org.apache.solr.rest.ManagedResourceStorage$InMemoryStorageIO}
   [junit4]   2> 793694 T5226 x:collection1 oasr.ManagedResourceStorage.load Reading _rest_managed.json using InMemoryStorage
   [junit4]   2> 793694 T5226 x:collection1 oasr.RestManager.init Initializing 0 registered ManagedResources
   [junit4]   2> 793694 T5226 x:collection1 oashc.SpellCheckComponent.inform Initializing spell checkers
   [junit4]   2> 793705 T5226 x:collection1 oass.DirectSolrSpellChecker.init init: {name=direct,classname=DirectSolrSpellChecker,field=lowerfilt,minQueryLength=3}
   [junit4]   2> 793762 T5226 x:collection1 oash.ReplicationHandler.inform Commits will be reserved for  10000
   [junit4]   2> 793762 T5227 x:collection1 oashc.SpellCheckComponent$SpellCheckerListener.newSearcher Loading spell index for spellchecker: default
   [junit4]   2> 793762 T5226 x:collection1 oasc.CoreContainer.registerCore registering core: collection1
   [junit4]   2> 793762 T5227 x:collection1 oashc.SpellCheckComponent$SpellCheckerListener.newSearcher Loading spell index for spellchecker: direct
   [junit4]   2> 793762 T5227 x:collection1 oashc.SpellCheckComponent$SpellCheckerListener.newSearcher Loading spell index for spellchecker: wordbreak
   [junit4]   2> 793763 T5227 x:collection1 oashc.SpellCheckComponent$SpellCheckerListener.newSearcher Loading spell index for spellchecker: multipleFields
   [junit4]   2> 793764 T5225 oas.SolrTestCaseJ4.initCore ####initCore end
   [junit4]   2> 793764 T5227 x:collection1 oashc.SpellCheckComponent$SpellCheckerListener.newSearcher Loading spell index for spellchecker: jarowinkler
   [junit4]   2> 793767 T5225 oas.SolrTestCaseJ4.setUp ###Starting testABunchOfConvertedStuff
   [junit4]   2> ASYNC  NEW_CORE C1240 name=collection1 org.apache.solr.core.SolrCore@7b99db06
   [junit4]   2> 793768 T5225 C1240 oasu.DirectUpdateHandler2.commit start commit{,optimize=true,openSearcher=true,waitSearcher=true,expungeDeletes=false,softCommit=false,prepareCommit=false}
   [junit4]   2> 793768 T5225 C1240 oasu.DirectUpdateHandler2.commit No uncommitted changes. Skipping IW.commit.
   [junit4]   2> 793768 T5225 C1240 oasc.SolrCore.getSearcher WARN [collection1] PERFORMANCE WARNING: Overlapping onDeckSearchers=2
   [junit4]   2> 793769 T5225 C1240 oasc.SolrCore.openNewSearcher SolrIndexSearcher has not changed - not re-opening: org.apache.solr.search.SolrIndexSearcher
   [junit4]   2> 793769 T5225 C1240 oasu.UpdateLog.onFirstSearcher On first searcher opened, looking up max value of version field
   [junit4]   2> 793768 T5227 x:collection1 oashc.SpellCheckComponent$SpellCheckerListener.newSearcher Loading spell index for spellchecker: external
   [junit4]   2> 793770 T5227 x:collection1 oashc.SpellCheckComponent$SpellCheckerListener.newSearcher Loading spell index for spellchecker: freq
   [junit4]   2> 793770 T5227 x:collection1 oashc.SpellCheckComponent$SpellCheckerListener.newSearcher Loading spell index for spellchecker: fqcn
   [junit4]   2> 793770 T5227 x:collection1 oashc.SpellCheckComponent$SpellCheckerListener.newSearcher Loading spell index for spellchecker: perDict
   [junit4]   2> 793772 T5227 x:collection1 oasc.SolrCore.registerSearcher [collection1] Registered new searcher Searcher@74b0f690[collection1] main{ExitableDirectoryReader(UninvertingDirectoryReader())}
   [junit4]   2> 7246119 T5224 ccr.ThreadLeakControl$2.evaluate WARNING Suite execution timed out: org.apache.solr.ConvertedLegacyTest
   [junit4]   2> 	==== jstack at approximately timeout time ====
   [junit4]   2> 	"Thread-1383" ID=5228 WAITING on java.lang.Object@452b1c89
   [junit4]   2> 		at java.lang.Object.wait(Native Method)
   [junit4]   2> 		- waiting on java.lang.Object@452b1c89
   [junit4]   2> 		at java.lang.Object.wait(Object.java:502)
   [junit4]   2> 		at org.apache.solr.core.CloserThread.run(CoreContainer.java:1035)
   [junit4]   2> 	
   [junit4]   2> 	"searcherExecutor-2318-thread-1" ID=5227 WAITING on java.util.concurrent.locks.AbstractQueuedSynchronizer$ConditionObject@4033308d
   [junit4]   2> 		at sun.misc.Unsafe.park(Native Method)
   [junit4]   2> 		- waiting on java.util.concurrent.locks.AbstractQueuedSynchronizer$ConditionObject@4033308d
   [junit4]   2> 		at java.util.concurrent.locks.LockSupport.park(LockSupport.java:175)
   [junit4]   2> 		at java.util.concurrent.locks.AbstractQueuedSynchronizer$ConditionObject.await(AbstractQueuedSynchronizer.java:2039)
   [junit4]   2> 		at java.util.concurrent.LinkedBlockingQueue.take(LinkedBlockingQueue.java:442)
   [junit4]   2> 		at java.util.concurrent.ThreadPoolExecutor.getTask(ThreadPoolExecutor.java:1067)
   [junit4]   2> 		at java.util.concurrent.ThreadPoolExecutor.runWorker(ThreadPoolExecutor.java:1127)
   [junit4]   2> 		at java.util.concurrent.ThreadPoolExecutor$Worker.run(ThreadPoolExecutor.java:617)
   [junit4]   2> 		at java.lang.Thread.run(Thread.java:745)
   [junit4]   2> 	
   [junit4]   2> 	"TEST-ConvertedLegacyTest.testABunchOfConvertedStuff-seed#[9A942A4156E3F0E8]" ID=5225 WAITING on java.util.concurrent.locks.ReentrantReadWriteLock$FairSync@7c6a18b3
   [junit4]   2> 		at sun.misc.Unsafe.park(Native Method)
   [junit4]   2> 		- waiting on java.util.concurrent.locks.ReentrantReadWriteLock$FairSync@7c6a18b3
   [junit4]   2> 		at java.util.concurrent.locks.LockSupport.park(LockSupport.java:175)
   [junit4]   2> 		at java.util.concurrent.locks.AbstractQueuedSynchronizer.parkAndCheckInterrupt(AbstractQueuedSynchronizer.java:836)
   [junit4]   2> 		at java.util.concurrent.locks.AbstractQueuedSynchronizer.acquireQueued(AbstractQueuedSynchronizer.java:870)
   [junit4]   2> 		at java.util.concurrent.locks.AbstractQueuedSynchronizer.acquire(AbstractQueuedSynchronizer.java:1199)
   [junit4]   2> 		at java.util.concurrent.locks.ReentrantReadWriteLock$WriteLock.lock(ReentrantReadWriteLock.java:943)
   [junit4]   2> 		at org.apache.solr.update.VersionInfo.blockUpdates(VersionInfo.java:119)
   [junit4]   2> 		at org.apache.solr.update.UpdateLog.onFirstSearcher(UpdateLog.java:1604)
   [junit4]   2> 		at org.apache.solr.core.SolrCore.getSearcher(SolrCore.java:1810)
   [junit4]   2> 		at org.apache.solr.core.SolrCore.getSearcher(SolrCore.java:1505)
   [junit4]   2> 		at org.apache.solr.update.DirectUpdateHandler2.commit(DirectUpdateHandler2.java:617)
   [junit4]   2> 		- locked java.lang.Object@74241dbf
   [junit4]   2> 		at org.apache.solr.update.processor.RunUpdateProcessor.processCommit(RunUpdateProcessorFactory.java:95)
   [junit4]   2> 		at org.apache.solr.update.processor.UpdateRequestProcessor.processCommit(UpdateRequestProcessor.java:64)
   [junit4]   2> 		at org.apache.solr.update.processor.DistributedUpdateProcessor.doLocalCommit(DistributedUpdateProcessor.java:1642)
   [junit4]   2> 		at org.apache.solr.update.processor.DistributedUpdateProcessor.processCommit(DistributedUpdateProcessor.java:1619)
   [junit4]   2> 		at org.apache.solr.update.processor.LogUpdateProcessor.processCommit(LogUpdateProcessorFactory.java:161)
   [junit4]   2> 		at org.apache.solr.handler.loader.XMLLoader.processUpdate(XMLLoader.java:270)
   [junit4]   2> 		at org.apache.solr.handler.loader.XMLLoader.load(XMLLoader.java:177)
   [junit4]   2> 		at org.apache.solr.handler.UpdateRequestHandler$1.load(UpdateRequestHandler.java:98)
   [junit4]   2> 		at org.apache.solr.handler.ContentStreamHandlerBase.handleRequestBody(ContentStreamHandlerBase.java:74)
   [junit4]   2> 		at org.apache.solr.handler.RequestHandlerBase.handleRequest(RequestHandlerBase.java:143)
   [junit4]   2> 		at org.apache.solr.core.SolrCore.execute(SolrCore.java:2051)
   [junit4]   2> 		at org.apache.solr.servlet.DirectSolrConnection.request(DirectSolrConnection.java:131)
   [junit4]   2> 		at org.apache.solr.util.TestHarness.update(TestHarness.java:267)
   [junit4]   2> 		at org.apache.solr.util.BaseTestHarness.checkUpdateStatus(BaseTestHarness.java:282)
   [junit4]   2> 		at org.apache.solr.util.BaseTestHarness.validateUpdate(BaseTestHarness.java:252)
   [junit4]   2> 		at org.apache.solr.SolrTestCaseJ4.checkUpdateU(SolrTestCaseJ4.java:748)
   [junit4]   2> 		at org.apache.solr.SolrTestCaseJ4.assertU(SolrTestCaseJ4.java:727)
   [junit4]   2> 		at org.apache.solr.SolrTestCaseJ4.assertU(SolrTestCaseJ4.java:721)
   [junit4]   2> 		at org.apache.solr.ConvertedLegacyTest.testABunchOfConvertedStuff(ConvertedLegacyTest.java:51)
   [junit4]   2> 		at sun.reflect.NativeMethodAccessorImpl.invoke0(Native Method)
   [junit4]   2> 		at sun.reflect.NativeMethodAccessorImpl.invoke(NativeMethodAccessorImpl.java:62)
   [junit4]   2> 		at sun.reflect.DelegatingMethodAccessorImpl.invoke(DelegatingMethodAccessorImpl.java:43)
   [junit4]   2> 		at java.lang.reflect.Method.invoke(Method.java:497)
   [junit4]   2> 		at com.carrotsearch.randomizedtesting.RandomizedRunner.invoke(RandomizedRunner.java:1627)
   [junit4]   2> 		at com.carrotsearch.randomizedtesting.RandomizedRunner$6.evaluate(RandomizedRunner.java:836)
   [junit4]   2> 		at com.carrotsearch.randomizedtesting.RandomizedRunner$7.evaluate(RandomizedRunner.java:872)
   [junit4]   2> 		at com.carrotsearch.randomizedtesting.RandomizedRunner$8.evaluate(RandomizedRunner.java:886)
   [junit4]   2> 		at com.carrotsearch.randomizedtesting.rules.SystemPropertiesRestoreRule$1.evaluate(SystemPropertiesRestoreRule.java:57)
   [junit4]   2> 		at org.apache.lucene.util.TestRuleSetupTeardownChained$1.evaluate(TestRuleSetupTeardownChained.java:50)
   [junit4]   2> 		at org.apache.lucene.util.AbstractBeforeAfterRule$1.evaluate(AbstractBeforeAfterRule.java:46)
   [junit4]   2> 		at org.apache.lucene.util.TestRuleThreadAndTestName$1.evaluate(TestRuleThreadAndTestName.java:49)
   [junit4]   2> 		at org.apache.lucene.util.TestRuleIgnoreAfterMaxFailures$1.evaluate(TestRuleIgnoreAfterMaxFailures.java:65)
   [junit4]   2> 		at org.apache.lucene.util.TestRuleMarkFailure$1.evaluate(TestRuleMarkFailure.java:48)
   [junit4]   2> 		at com.carrotsearch.randomizedtesting.rules.StatementAdapter.evaluate(StatementAdapter.java:36)
   [junit4]   2> 		at com.carrotsearch.randomizedtesting.ThreadLeakControl$StatementRunner.run(ThreadLeakControl.java:365)
   [junit4]   2> 		at com.carrotsearch.randomizedtesting.ThreadLeakControl.forkTimeoutingTask(ThreadLeakControl.java:798)
   [junit4]   2> 		at com.carrotsearch.randomizedtesting.ThreadLeakControl$3.evaluate(ThreadLeakControl.java:458)
   [junit4]   2> 		at com.carrotsearch.randomizedtesting.RandomizedRunner.runSingleTest(RandomizedRunner.java:845)
   [junit4]   2> 		at com.carrotsearch.randomizedtesting.RandomizedRunner$3.evaluate(RandomizedRunner.java:747)
   [junit4]   2> 		at com.carrotsearch.randomizedtesting.RandomizedRunner$4.evaluate(RandomizedRunner.java:781)
   [junit4]   2> 		at com.carrotsearch.randomizedtesting.RandomizedRunner$5.evaluate(RandomizedRunner.java:792)
   [junit4]   2> 		at com.carrotsearch.randomizedtesting.rules.StatementAdapter.evaluate(StatementAdapter.java:36)
   [junit4]   2> 		at com.carrotsearch.randomizedtesting.rules.SystemPropertiesRestoreRule$1.evaluate(SystemPropertiesRestoreRule.java:57)
   [junit4]   2> 		at org.apache.lucene.util.AbstractBeforeAfterRule$1.evaluate(AbstractBeforeAfterRule.java:46)
   [junit4]   2> 		at com.carrotsearch.randomizedtesting.rules.StatementAdapter.evaluate(StatementAdapter.java:36)
   [junit4]   2> 		at org.apache.lucene.util.TestRuleStoreClassName$1.evaluate(TestRuleStoreClassName.java:42)
   [junit4]   2> 		at com.carrotsearch.randomizedtesting.rules.NoShadowingOrOverridesOnMethodsRule$1.evaluate(NoShadowingOrOverridesOnMethodsRule.java:39)
   [junit4]   2> 		at com.carrotsearch.randomizedtesting.rules.NoShadowingOrOverridesOnMethodsRule$1.evaluate(NoShadowingOrOverridesOnMethodsRule.java:39)
   [junit4]   2> 		at com.carrotsearch.randomizedtesting.rules.StatementAdapter.evaluate(StatementAdapter.java:36)
   [junit4]   2> 		at com.carrotsearch.randomizedtesting.rules.StatementAdapter.evaluate(StatementAdapter.java:36)
   [junit4]   2> 		at com.carrotsearch.randomizedtesting.rules.StatementAdapter.evaluate(StatementAdapter.java:36)
   [junit4]   2> 		at org.apache.lucene.util.TestRuleAssertionsRequired$1.evaluate(TestRuleAssertionsRequired.java:54)
   [junit4]   2> 		at org.apache.lucene.util.TestRuleMarkFailure$1.evaluate(TestRuleMarkFailure.java:48)
   [junit4]   2> 		at org.apache.lucene.util.TestRuleIgnoreAfterMaxFailures$1.evaluate(TestRuleIgnoreAfterMaxFailures.java:65)
   [junit4]   2> 		at org.apache.lucene.util.TestRuleIgnoreTestSuites$1.evaluate(TestRuleIgnoreTestSuites.java:55)
   [junit4]   2> 		at com.carrotsearch.randomizedtesting.rules.StatementAdapter.evaluate(StatementAdapter.java:36)
   [junit4]   2> 		at com.carrotsearch.randomizedtesting.ThreadLeakControl$StatementRunner.run(ThreadLeakControl.java:365)
   [junit4]   2> 		at java.lang.Thread.run(Thread.java:745)
   [junit4]   2> 		Locked synchronizers:
   [junit4]   2> 		- java.util.concurrent.locks.ReentrantLock$FairSync@38d66f01
   [junit4]   2> 		- java.util.concurrent.locks.ReentrantLock$NonfairSync@2504e3c6
   [junit4]   2> 	
   [junit4]   2> 	"SUITE-ConvertedLegacyTest-seed#[9A942A4156E3F0E8]" ID=5224 RUNNABLE
   [junit4]   2> 		at sun.management.ThreadImpl.dumpThreads0(Native Method)
   [junit4]   2> 		at sun.management.ThreadImpl.dumpAllThreads(ThreadImpl.java:446)
   [junit4]   2> 		at com.carrotsearch.randomizedtesting.ThreadLeakControl.formatThreadStacksFull(ThreadLeakControl.java:671)
   [junit4]   2> 		at com.carrotsearch.randomizedtesting.ThreadLeakControl.access$900(ThreadLeakControl.java:62)
   [junit4]   2> 		at com.carrotsearch.randomizedtesting.ThreadLeakControl$2.evaluate(ThreadLeakControl.java:412)
   [junit4]   2> 		- locked java.lang.Object@28773b64
   [junit4]   2> 		at com.carrotsearch.randomizedtesting.RandomizedRunner.runSuite(RandomizedRunner.java:651)
   [junit4]   2> 		at com.carrotsearch.randomizedtesting.RandomizedRunner.access$200(RandomizedRunner.java:138)
   [junit4]   2> 		at com.carrotsearch.randomizedtesting.RandomizedRunner$1.run(RandomizedRunner.java:568)
   [junit4]   2> 	
   [junit4]   2> 	"Thread-675" ID=2825 TIMED_WAITING
   [junit4]   2> 		at java.lang.Thread.sleep(Native Method)
   [junit4]   2> 		at org.apache.zookeeper.Login$1.run(Login.java:183)
   [junit4]   2> 		at java.lang.Thread.run(Thread.java:745)
   [junit4]   2> 	
   [junit4]   2> 	"JUnit4-serializer-daemon" ID=10 TIMED_WAITING
   [junit4]   2> 		at java.lang.Thread.sleep(Native Method)
   [junit4]   2> 		at com.carrotsearch.ant.tasks.junit4.events.Serializer$1.run(Serializer.java:47)
   [junit4]   2> 	
   [junit4]   2> 	"Attach Listener" ID=5 RUNNABLE
   [junit4]   2> 	
   [junit4]   2> 	"Signal Dispatcher" ID=4 RUNNABLE
   [junit4]   2> 	
   [junit4]   2> 	"Finalizer" ID=3 WAITING on java.lang.ref.ReferenceQueue$Lock@23d2e70c
   [junit4]   2> 		at java.lang.Object.wait(Native Method)
   [junit4]   2> 		- waiting on java.lang.ref.ReferenceQueue$Lock@23d2e70c
   [junit4]   2> 		at java.lang.ref.ReferenceQueue.remove(ReferenceQueue.java:143)
   [junit4]   2> 		at java.lang.ref.ReferenceQueue.remove(ReferenceQueue.java:164)
   [junit4]   2> 		at java.lang.ref.Finalizer$FinalizerThread.run(Finalizer.java:209)
   [junit4]   2> 	
   [junit4]   2> 	"Reference Handler" ID=2 WAITING on java.lang.ref.Reference$Lock@214a3a63
   [junit4]   2> 		at java.lang.Object.wait(Native Method)
   [junit4]   2> 		- waiting on java.lang.ref.Reference$Lock@214a3a63
   [junit4]   2> 		at java.lang.Object.wait(Object.java:502)
   [junit4]   2> 		at java.lang.ref.Reference$ReferenceHandler.run(Reference.java:157)
   [junit4]   2> 	
   [junit4]   2> 	"main" ID=1 WAITING on com.carrotsearch.randomizedtesting.RandomizedRunner$1@41616b2
   [junit4]   2> 		at java.lang.Object.wait(Native Method)
   [junit4]   2> 		- waiting on com.carrotsearch.randomizedtesting.RandomizedRunner$1@41616b2
   [junit4]   2> 		at java.lang.Thread.join(Thread.java:1245)
   [junit4]   2> 		at java.lang.Thread.join(Thread.java:1319)
   [junit4]   2> 		at com.carrotsearch.randomizedtesting.RandomizedRunner.runSuite(RandomizedRunner.java:578)
   [junit4]   2> 		at com.carrotsearch.randomizedtesting.RandomizedRunner.run(RandomizedRunner.java:444)
   [junit4]   2> 		at com.carrotsearch.ant.tasks.junit4.slave.SlaveMain.execute(SlaveMain.java:199)
   [junit4]   2> 		at com.carrotsearch.ant.tasks.junit4.slave.SlaveMain.main(SlaveMain.java:310)
   [junit4]   2> 		at com.carrotsearch.ant.tasks.junit4.slave.SlaveMainSafe.main(SlaveMainSafe.java:12)
   [junit4]   2> 	
   [junit4]   2> 	^^==============================================
   [junit4]   2> 	
   [junit4]   2> NOTE: reproduce with: ant test  -Dtestcase=ConvertedLegacyTest -Dtests.method=testABunchOfConvertedStuff -Dtests.seed=9A942A4156E3F0E8 -Dtests.slow=true -Dtests.locale=es_EC -Dtests.timezone=America/Atikokan -Dtests.asserts=true -Dtests.file.encoding=Cp1252
   [junit4] ERROR   7245s J1 | ConvertedLegacyTest.testABunchOfConvertedStuff <<<
   [junit4]    > Throwable #1: java.lang.Exception: Test abandoned because suite timeout was reached.
   [junit4]    > 	at __randomizedtesting.SeedInfo.seed([9A942A4156E3F0E8]:0)
   [junit4]   2> 7246124 T5224 ccr.ThreadLeakControl.checkThreadLeaks WARNING Will linger awaiting termination of 3 leaked thread(s).
   [junit4]   2> 7266343 T5224 ccr.ThreadLeakControl.checkThreadLeaks SEVERE 3 threads leaked from SUITE scope at org.apache.solr.ConvertedLegacyTest: 
   [junit4]   2> 	   1) Thread[id=5225, name=TEST-ConvertedLegacyTest.testABunchOfConvertedStuff-seed#[9A942A4156E3F0E8], state=WAITING, group=TGRP-ConvertedLegacyTest]
   [junit4]   2> 	        at sun.misc.Unsafe.park(Native Method)
   [junit4]   2> 	        at java.util.concurrent.locks.LockSupport.park(LockSupport.java:175)
   [junit4]   2> 	        at java.util.concurrent.locks.AbstractQueuedSynchronizer.parkAndCheckInterrupt(AbstractQueuedSynchronizer.java:836)
   [junit4]   2> 	        at java.util.concurrent.locks.AbstractQueuedSynchronizer.acquireQueued(AbstractQueuedSynchronizer.java:870)
   [junit4]   2> 	        at java.util.concurrent.locks.AbstractQueuedSynchronizer.acquire(AbstractQueuedSynchronizer.java:1199)
   [junit4]   2> 	        at java.util.concurrent.locks.ReentrantReadWriteLock$WriteLock.lock(ReentrantReadWriteLock.java:943)
   [junit4]   2> 	        at org.apache.solr.update.VersionInfo.blockUpdates(VersionInfo.java:119)
   [junit4]   2> 	        at org.apache.solr.update.UpdateLog.onFirstSearcher(UpdateLog.java:1604)
   [junit4]   2> 	        at org.apache.solr.core.SolrCore.getSearcher(SolrCore.java:1810)
   [junit4]   2> 	        at org.apache.solr.core.SolrCore.getSearcher(SolrCore.java:1505)
   [junit4]   2> 	        at org.apache.solr.update.DirectUpdateHandler2.commit(DirectUpdateHandler2.java:617)
   [junit4]   2> 	        at org.apache.solr.update.processor.RunUpdateProcessor.processCommit(RunUpdateProcessorFactory.java:95)
   [junit4]   2> 	        at org.apache.solr.update.processor.UpdateRequestProcessor.processCommit(UpdateRequestProcessor.java:64)
   [junit4]   2> 	        at org.apache.solr.update.processor.DistributedUpdateProcessor.doLocalCommit(DistributedUpdateProcessor.java:1642)
   [junit4]   2> 	        at org.apache.solr.update.processor.DistributedUpdateProcessor.processCommit(DistributedUpdateProcessor.java:1619)
   [junit4]   2> 	        at org.apache.solr.update.processor.LogUpdateProcessor.processCommit(LogUpdateProcessorFactory.java:161)
   [junit4]   2> 	        at org.apache.solr.handler.loader.XMLLoader.processUpdate(XMLLoader.java:270)
   [junit4]   2> 	        at org.apache.solr.handler.loader.XMLLoader.load(XMLLoader.java:177)
   [junit4]   2> 	        at org.apache.solr.handler.UpdateRequestHandler$1.load(UpdateRequestHandler.java:98)
   [junit4]   2> 	        at org.apache.solr.handler.ContentStreamHandlerBase.handleRequestBody(ContentStreamHandlerBase.java:74)
   [junit4]   2> 	        at org.apache.solr.handler.RequestHandlerBase.handleRequest(RequestHandlerBase.java:143)
   [junit4]   2> 	        at org.apache.solr.core.SolrCore.execute(SolrCore.java:2051)
   [junit4]   2> 	        at org.apache.solr.servlet.DirectSolrConnection.request(DirectSolrConnection.java:131)
   [junit4]   2> 	        at org.apache.solr.util.TestHarness.update(TestHarness.java:267)
   [junit4]   2> 	        at org.apache.solr.util.BaseTestHarness.checkUpdateStatus(BaseTestHarness.java:282)
   [junit4]   2> 	        at org.apache.solr.util.BaseTestHarness.validateUpdate(BaseTestHarness.java:252)
   [junit4]   2> 	        at org.apache.solr.SolrTestCaseJ4.checkUpdateU(SolrTestCaseJ4.java:748)
   [junit4]   2> 	        at org.apache.solr.SolrTestCaseJ4.assertU(SolrTestCaseJ4.java:727)
   [junit4]   2> 	        at org.apache.solr.SolrTestCaseJ4.assertU(SolrTestCaseJ4.java:721)
   [junit4]   2> 	        at org.apache.solr.ConvertedLegacyTest.testABunchOfConvertedStuff(ConvertedLegacyTest.java:51)
   [junit4]   2> 	        at sun.reflect.NativeMethodAccessorImpl.invoke0(Native Method)
   [junit4]   2> 	        at sun.reflect.NativeMethodAccessorImpl.invoke(NativeMethodAccessorImpl.java:62)
   [junit4]   2> 	        at sun.reflect.DelegatingMethodAccessorImpl.invoke(DelegatingMethodAccessorImpl.java:43)
   [junit4]   2> 	        at java.lang.reflect.Method.invoke(Method.java:497)
   [junit4]   2> 	        at com.carrotsearch.randomizedtesting.RandomizedRunner.invoke(RandomizedRunner.java:1627)
   [junit4]   2> 	        at com.carrotsearch.randomizedtesting.RandomizedRunner$6.evaluate(RandomizedRunner.java:836)
   [junit4]   2> 	        at com.carrotsearch.randomizedtesting.RandomizedRunner$7.evaluate(RandomizedRunner.java:872)
   [junit4]   2> 	        at com.carrotsearch.randomizedtesting.RandomizedRunner$8.evaluate(RandomizedRunner.java:886)
   [junit4]   2> 	        at com.carrotsearch.randomizedtesting.rules.SystemPropertiesRestoreRule$1.evaluate(SystemPropertiesRestoreRule.java:57)
   [junit4]   2> 	        at org.apache.lucene.util.TestRuleSetupTeardownChained$1.evaluate(TestRuleSetupTeardownChained.java:50)
   [junit4]   2> 	        at org.apache.lucene.util.AbstractBeforeAfterRule$1.evaluate(AbstractBeforeAfterRule.java:46)
   [junit4]   2> 	        at org.apache.lucene.util.TestRuleThreadAndTestName$1.evaluate(TestRuleThreadAndTestName.java:49)
   [junit4]   2> 	        at org.apache.lucene.util.TestRuleIgnoreAfterMaxFailures$1.evaluate(TestRuleIgnoreAfterMaxFailures.java:65)
   [junit4]   2> 	        at org.apache.lucene.util.TestRuleMarkFailure$1.evaluate(TestRuleMarkFailure.java:48)
   [junit4]   2> 	        at com.carrotsearch.randomizedtesting.rules.StatementAdapter.evaluate(StatementAdapter.java:36)
   [junit4]   2> 	        at com.carrotsearch.randomizedtesting.ThreadLeakControl$StatementRunner.run(ThreadLeakControl.java:365)
   [junit4]   2> 	        at com.carrotsearch.randomizedtesting.ThreadLeakControl.forkTimeoutingTask(ThreadLeakControl.java:798)
   [junit4]   2> 	        at com.carrotsearch.randomizedtesting.ThreadLeakControl$3.evaluate(ThreadLeakControl.java:458)
   [junit4]   2> 	        at com.carrotsearch.randomizedtesting.RandomizedRunner.runSingleTest(RandomizedRunner.java:845)
   [junit4]   2> 	        at com.carrotsearch.randomizedtesting.RandomizedRunner$3.evaluate(RandomizedRunner.java:747)
   [junit4]   2> 	        at com.carrotsearch.randomizedtesting.RandomizedRunner$4.evaluate(RandomizedRunner.java:781)
   [junit4]   2> 	        at com.carrotsearch.randomizedtesting.RandomizedRunner$5.evaluate(RandomizedRunner.java:792)
   [junit4]   2> 	        at com.carrotsearch.randomizedtesting.rules.StatementAdapter.evaluate(StatementAdapter.java:36)
   [junit4]   2> 	        at com.carrotsearch.randomizedtesting.rules.SystemPropertiesRestoreRule$1.evaluate(SystemPropertiesRestoreRule.java:57)
   [junit4]   2> 	        at org.apache.lucene.util.AbstractBeforeAfterRule$1.evaluate(AbstractBeforeAfterRule.java:46)
   [junit4]   2> 	        at com.carrotsearch.randomizedtesting.rules.StatementAdapter.evaluate(StatementAdapter.java:36)
   [junit4]   2> 	        at org.apache.lucene.util.TestRuleStoreClassName$1.evaluate(TestRuleStoreClassName.java:42)
   [junit4]   2> 	        at com.carrotsearch.randomizedtesting.rules.NoShadowingOrOverridesOnMethodsRule$1.evaluate(NoShadowingOrOverridesOnMethodsRule.java:39)
   [junit4]   2> 	        at com.carrotsearch.randomizedtesting.rules.NoShadowingOrOverridesOnMethodsRule$1.evaluate(NoShadowingOrOverridesOnMethodsRule.java:39)
   [junit4]   2> 	        at com.carrotsearch.randomizedtesting.rules.StatementAdapter.evaluate(StatementAdapter.java:36)
   [junit4]   2> 	        at com.carrotsearch.randomizedtesting.rules.StatementAdapter.evaluate(StatementAdapter.java:36)
   [junit4]   2> 	        at com.carrotsearch.randomizedtesting.rules.StatementAdapter.evaluate(StatementAdapter.java:36)
   [junit4]   2> 	        at org.apache.lucene.util.TestRuleAssertionsRequired$1.evaluate(TestRuleAssertionsRequired.java:54)
   [junit4]   2> 	        at org.apache.lucene.util.TestRuleMarkFailure$1.evaluate(TestRuleMarkFailure.java:48)
   [junit4]   2> 	        at org.apache.lucene.util.TestRuleIgnoreAfterMaxFailures$1.evaluate(TestRuleIgnoreAfterMaxFailures.java:65)
   [junit4]   2> 	        at org.apache.lucene.util.TestRuleIgnoreTestSuites$1.evaluate(TestRuleIgnoreTestSuites.java:55)
   [junit4]   2> 	        at com.carrotsearch.randomizedtesting.rules.StatementAdapter.evaluate(StatementAdapter.java:36)
   [junit4]   2> 	        at com.carrotsearch.randomizedtesting.ThreadLeakControl$StatementRunner.run(ThreadLeakControl.java:365)
   [junit4]   2> 	        at java.lang.Thread.run(Thread.java:745)
   [junit4]   2> 	   2) Thread[id=5228, name=Thread-1383, state=WAITING, group=TGRP-ConvertedLegacyTest]
   [junit4]   2> 	        at java.lang.Object.wait(Native Method)
   [junit4]   2> 	        at java.lang.Object.wait(Object.java:502)
   [junit4]   2> 	        at org.apache.solr.core.CloserThread.run(CoreContainer.java:1035)
   [junit4]   2> 	   3) Thread[id=5227, name=searcherExecutor-2318-thread-1, state=WAITING, group=TGRP-ConvertedLegacyTest]
   [junit4]   2> 	        at sun.misc.Unsafe.park(Native Method)
   [junit4]   2> 	        at java.util.concurrent.locks.LockSupport.park(LockSupport.java:175)
   [junit4]   2> 	        at java.util.concurrent.locks.AbstractQueuedSynchronizer$ConditionObject.await(AbstractQueuedSynchronizer.java:2039)
   [junit4]   2> 	        at java.util.concurrent.LinkedBlockingQueue.take(LinkedBlockingQueue.java:442)
   [junit4]   2> 	        at java.util.concurrent.ThreadPoolExecutor.getTask(ThreadPoolExecutor.java:1067)
   [junit4]   2> 	        at java.util.concurrent.ThreadPoolExecutor.runWorker(ThreadPoolExecutor.java:1127)
   [junit4]   2> 	        at java.util.concurrent.ThreadPoolExecutor$Worker.run(ThreadPoolExecutor.java:617)
   [junit4]   2> 	        at java.lang.Thread.run(Thread.java:745)
   [junit4]   2> 7266343 T5224 ccr.ThreadLeakControl.tryToInterruptAll Starting to interrupt leaked threads:
   [junit4]   2> 	   1) Thread[id=5225, name=TEST-ConvertedLegacyTest.testABunchOfConvertedStuff-seed#[9A942A4156E3F0E8], state=WAITING, group=TGRP-ConvertedLegacyTest]
   [junit4]   2> 	   2) Thread[id=5228, name=Thread-1383, state=WAITING, group=TGRP-ConvertedLegacyTest]
   [junit4]   2> 	   3) Thread[id=5227, name=searcherExecutor-2318-thread-1, state=WAITING, group=TGRP-ConvertedLegacyTest]
   [junit4]   2> 7269383 T5224 ccr.ThreadLeakControl.tryToInterruptAll SEVERE There are still zombie threads that couldn't be terminated:
   [junit4]   2> 	   1) Thread[id=5225, name=TEST-ConvertedLegacyTest.testABunchOfConvertedStuff-seed#[9A942A4156E3F0E8], state=WAITING, group=TGRP-ConvertedLegacyTest]
   [junit4]   2> 	        at sun.misc.Unsafe.park(Native Method)
   [junit4]   2> 	        at java.util.concurrent.locks.LockSupport.park(LockSupport.java:175)
   [junit4]   2> 	        at java.util.concurrent.locks.AbstractQueuedSynchronizer.parkAndCheckInterrupt(AbstractQueuedSynchronizer.java:836)
   [junit4]   2> 	        at java.util.concurrent.locks.AbstractQueuedSynchronizer.acquireQueued(AbstractQueuedSynchronizer.java:870)
   [junit4]   2> 	        at java.util.concurrent.locks.AbstractQueuedSynchronizer.acquire(AbstractQueuedSynchronizer.java:1199)
   [junit4]   2> 	        at java.util.concurrent.locks.ReentrantReadWriteLock$WriteLock.lock(ReentrantReadWriteLock.java:943)
   [junit4]   2> 	        at org.apache.solr.update.VersionInfo.blockUpdates(VersionInfo.java:119)
   [junit4]   2> 	        at org.apache.solr.update.UpdateLog.onFirstSearcher(UpdateLog.java:1604)
   [junit4]   2> 	        at org.apache.solr.core.SolrCore.getSearcher(SolrCore.java:1810)
   [junit4]   2> 	        at org.apache.solr.core.SolrCore.getSearcher(SolrCore.java:1505)
   [junit4]   2> 	        at org.apache.solr.update.DirectUpdateHandler2.commit(DirectUpdateHandler2.java:617)
   [junit4]   2> 	        at org.apache.solr.update.processor.RunUpdateProcessor.processCommit(RunUpdateProcessorFactory.java:95)
   [junit4]   2> 	        at org.apache.solr.update.processor.UpdateRequestProcessor.processCommit(UpdateRequestProcessor.java:64)
   [junit4]   2> 	        at org.apache.solr.update.processor.DistributedUpdateProcessor.doLocalCommit(DistributedUpdateProcessor.java:1642)
   [junit4]   2> 	        at org.apache.solr.update.processor.DistributedUpdateProcessor.processCommit(DistributedUpdateProcessor.java:1619)
   [junit4]   2> 	        at org.apache.solr.update.processor.LogUpdateProcessor.processCommit(LogUpdateProcessorFactory.java:161)
   [junit4]   2> 	        at org.apache.solr.handler.loader.XMLLoader.processUpdate(XMLLoader.java:270)
   [junit4]   2> 	        at org.apache.solr.handler.loader.XMLLoader.load(XMLLoader.java:177)
   [junit4]   2> 	        at org.apache.solr.handler.UpdateRequestHandler$1.load(UpdateRequestHandler.java:98)
   [junit4]   2> 	        at org.apache.solr.handler.ContentStreamHandlerBase.handleRequestBody(ContentStreamHandlerBase.java:74)
   [junit4]   2> 	        at org.apache.solr.handler.RequestHandlerBase.handleRequest(RequestHandlerBase.java:143)
   [junit4]   2> 	        at org.apache.solr.core.SolrCore.execute(SolrCore.java:2051)
   [junit4]   2> 	        at org.apache.solr.servlet.DirectSolrConnection.request(DirectSolrConnection.java:131)
   [junit4]   2> 	        at org.apache.solr.util.TestHarness.update(TestHarness.java:267)
   [junit4]   2> 	        at org.apache.solr.util.BaseTestHarness.checkUpdateStatus(BaseTestHarness.java:282)
   [junit4]   2> 	        at org.apache.solr.util.BaseTestHarness.validateUpdate(BaseTestHarness.java:252)
   [junit4]   2> 	        at org.apache.solr.SolrTestCaseJ4.checkUpdateU(SolrTestCaseJ4.java:748)
   [junit4]   2> 	        at org.apache.solr.SolrTestCaseJ4.assertU(SolrTestCaseJ4.java:727)
   [junit4]   2> 	        at org.apache.solr.SolrTestCaseJ4.assertU(SolrTestCaseJ4.java:721)
   [junit4]   2> 	        at org.apache.solr.ConvertedLegacyTest.testABunchOfConvertedStuff(ConvertedLegacyTest.java:51)
   [junit4]   2> 	        at sun.reflect.NativeMethodAccessorImpl.invoke0(Native Method)
   [junit4]   2> 	        at sun.reflect.NativeMethodAccessorImpl.invoke(NativeMethodAccessorImpl.java:62)
   [junit4]   2> 	        at sun.reflect.DelegatingMethodAccessorImpl.invoke(DelegatingMethodAccessorImpl.java:43)
   [junit4]   2> 	        at java.lang.reflect.Method.invoke(Method.java:497)
   [junit4]   2> 	        at com.carrotsearch.randomizedtesting.RandomizedRunner.invoke(RandomizedRunner.java:1627)
   [junit4]   2> 	        at com.carrotsearch.randomizedtesting.RandomizedRunner$6.evaluate(RandomizedRunner.java:836)
   [junit4]   2> 	        at com.carrotsearch.randomizedtesting.RandomizedRunner$7.evaluate(RandomizedRunner.java:872)
   [junit4]   2> 	        at com.carrotsearch.randomizedtesting.RandomizedRunner$8.evaluate(RandomizedRunner.java:886)
   [junit4]   2> 	        at com.carrotsearch.randomizedtesting.rules.SystemPropertiesRestoreRule$1.evaluate(SystemPropertiesRestoreRule.java:57)
   [junit4]   2> 	        at org.apache.lucene.util.TestRuleSetupTeardownChained$1.evaluate(TestRuleSetupTeardownChained.java:50)
   [junit4]   2> 	        at org.apache.lucene.util.AbstractBeforeAfterRule$1.evaluate(AbstractBeforeAfterRule.java:46)
   [junit4]   2> 	        at org.apache.lucene.util.TestRuleThreadAndTestName$1.evaluate(TestRuleThreadAndTestName.java:49)
   [junit4]   2> 	        at org.apache.lucene.util.TestRuleIgnoreAfterMaxFailures$1.evaluate(TestRuleIgnoreAfterMaxFailures.java:65)
   [junit4]   2> 	        at org.apache.lucene.util.TestRuleMarkFailure$1.evaluate(TestRuleMarkFailure.java:48)
   [junit4]   2> 	        at com.carrotsearch.randomizedtesting.rules.StatementAdapter.evaluate(StatementAdapter.java:36)
   [junit4]   2> 	        at com.carrotsearch.randomizedtesting.ThreadLeakControl$StatementRunner.run(ThreadLeakControl.java:365)
   [junit4]   2> 	        at com.carrotsearch.randomizedtesting.ThreadLeakControl.forkTimeoutingTask(ThreadLeakControl.java:798)
   [junit4]   2> 	        at com.carrotsearch.randomizedtesting.ThreadLeakControl$3.evaluate(ThreadLeakControl.java:458)
   [junit4]   2> 	        at com.carrotsearch.randomizedtesting.RandomizedRunner.runSingleTest(RandomizedRunner.java:845)
   [junit4]   2> 	        at com.carrotsearch.randomizedtesting.RandomizedRunner$3.evaluate(RandomizedRunner.java:747)
   [junit4]   2> 	        at com.carrotsearch.randomizedtesting.RandomizedRunner$4.evaluate(RandomizedRunner.java:781)
   [junit4]   2> 	        at com.carrotsearch.randomizedtesting.RandomizedRunner$5.evaluate(RandomizedRunner.java:792)
   [junit4]   2> 	        at com.carrotsearch.randomizedtesting.rules.StatementAdapter.evaluate(StatementAdapter.java:36)
   [junit4]   2> 	        at com.carrotsearch.randomizedtesting.rules.SystemPropertiesRestoreRule$1.evaluate(SystemPropertiesRestoreRule.java:57)
   [junit4]   2> 	        at org.apache.lucene.util.AbstractBeforeAfterRule$1.evaluate(AbstractBeforeAfterRule.java:46)
   [junit4]   2> 	        at com.carrotsearch.randomizedtesting.rules.StatementAdapter.evaluate(StatementAdapter.java:36)
   [junit4]   2> 	        at org.apache.lucene.util.TestRuleStoreClassName$1.evaluate(TestRuleStoreClassName.java:42)
   [junit4]   2> 	        at com.carrotsearch.randomizedtesting.rules.NoShadowingOrOverridesOnMethodsRule$1.evaluate(NoShadowingOrOverridesOnMethodsRule.java:39)
   [junit4]   2> 	        at com.carrotsearch.randomizedtesting.rules.NoShadowingOrOverridesOnMethodsRule$1.evaluate(NoShadowingOrOverridesOnMethodsRule.java:39)
   [junit4]   2> 	        at com.carrotsearch.randomizedtesting.rules.StatementAdapter.evaluate(StatementAdapter.java:36)
   [junit4]   2> 	        at com.carrotsearch.randomizedtesting.rules.StatementAdapter.evaluate(StatementAdapter.java:36)
   [junit4]   2> 	        at com.carrotsearch.randomizedtesting.rules.StatementAdapter.evaluate(StatementAdapter.java:36)
   [junit4]   2> 	        at org.apache.lucene.util.TestRuleAssertionsRequired$1.evaluate(TestRuleAssertionsRequired.java:54)
   [junit4]   2> 	        at org.apache.lucene.util.TestRuleMarkFailure$1.evaluate(TestRuleMarkFailure.java:48)
   [junit4]   2> 	        at org.apache.lucene.util.TestRuleIgnoreAfterMaxFailures$1.evaluate(TestRuleIgnoreAfterMaxFailures.java:65)
   [junit4]   2> 	        at org.apache.lucene.util.TestRuleIgnoreTestSuites$1.evaluate(TestRuleIgnoreTestSuites.java:55)
   [junit4]   2> 	        at com.carrotsearch.randomizedtesting.rules.StatementAdapter.evaluate(StatementAdapter.java:36)
   [junit4]   2> 	        at com.carrotsearch.randomizedtesting.ThreadLeakControl$StatementRunner.run(ThreadLeakControl.java:365)
   [junit4]   2> 	        at java.lang.Thread.run(Thread.java:745)
   [junit4]   2> 	   2) Thread[id=5228, name=Thread-1383, state=WAITING, group=TGRP-ConvertedLegacyTest]
   [junit4]   2> 	        at java.lang.Object.wait(Native Method)
   [junit4]   2> 	        at java.lang.Object.wait(Object.java:502)
   [junit4]   2> 	        at org.apache.solr.core.CloserThread.run(CoreContainer.java:1035)
   [junit4]   2> 	   3) Thread[id=5227, name=searcherExecutor-2318-thread-1, state=WAITING, group=TGRP-ConvertedLegacyTest]
   [junit4]   2> 	        at sun.misc.Unsafe.park(Native Method)
   [junit4]   2> 	        at java.util.concurrent.locks.LockSupport.park(LockSupport.java:175)
   [junit4]   2> 	        at java.util.concurrent.locks.AbstractQueuedSynchronizer$ConditionObject.await(AbstractQueuedSynchronizer.java:2039)
   [junit4]   2> 	        at java.util.concurrent.LinkedBlockingQueue.take(LinkedBlockingQueue.java:442)
   [junit4]   2> 	        at java.util.concurrent.ThreadPoolExecutor.getTask(ThreadPoolExecutor.java:1067)
   [junit4]   2> 	        at java.util.concurrent.ThreadPoolExecutor.runWorker(ThreadPoolExecutor.java:1127)
   [junit4]   2> 	        at java.util.concurrent.ThreadPoolExecutor$Worker.run(ThreadPoolExecutor.java:617)
   [junit4]   2> 	        at java.lang.Thread.run(Thread.java:745)
   [junit4]   2> NOTE: test params are: codec=Asserting(Lucene50): {}, docValues:{}, sim=RandomSimilarityProvider(queryNorm=false,coord=crazy): {}, locale=es_EC, timezone=America/Atikokan
   [junit4]   2> NOTE: Windows 7 6.1 amd64/Oracle Corporation 1.8.0_45 (64-bit)/cpus=3,threads=4,free=42589632,total=282181632
   [junit4]   2> NOTE: All tests run in this JVM: [TestAddFieldRealTimeGet, TestInfoStreamLogging, TestHdfsUpdateLog, DistributedFacetPivotSmallTest, TestSolrCloudWithKerberos, TestFoldingMultitermQuery, TestQuerySenderNoQuery, DirectSolrSpellCheckerTest, TestSolrConfigHandlerCloud, ExternalFileFieldSortTest, TestRandomFaceting, HdfsLockFactoryTest, TestDFRSimilarityFactory, HdfsThreadLeakTest, TestFastOutputStream, BasicZkTest, HdfsDirectoryFactoryTest, CloudMLTQParserTest, QueryEqualityTest, CurrencyFieldXmlFileTest, TestIntervalFaceting, SolrCloudExampleTest, TestConfigReload, TestBulkSchemaConcurrent, PreAnalyzedUpdateProcessorTest, DateFieldTest, HdfsWriteToMultipleCollectionsTest, SaslZkACLProviderTest, BJQParserTest, TestRequestStatusCollectionAPI, HdfsCollectionsAPIDistributedZkTest, HttpPartitionTest, DeleteShardTest, TermsComponentTest, AssignTest, OverseerStatusTest, DistributedQueueTest, TestSolrDeletionPolicy2, PrimitiveFieldTypeTest, TestUtils, ChaosMonkeySafeLeaderTest, TestPHPSerializedResponseWriter, TestFastWriter, PolyFieldTest, TestManagedResourceStorage, TestSimpleQParserPlugin, TestSuggestSpellingConverter, FieldMutatingUpdateProcessorTest, MigrateRouteKeyTest, DistribJoinFromCollectionTest, TestZkChroot, TestValueSourceCache, SignatureUpdateProcessorFactoryTest, TestRecovery, FullSolrCloudDistribCmdsTest, SolrIndexConfigTest, TestInitParams, HdfsRecoverLeaseTest, TestCollapseQParserPlugin, TestSolrDeletionPolicy1, TestConfig, DistributedExpandComponentTest, IndexBasedSpellCheckerTest, ConvertedLegacyTest]
   [junit4]   2> NOTE: reproduce with: ant test  -Dtestcase=ConvertedLegacyTest -Dtests.seed=9A942A4156E3F0E8 -Dtests.slow=true -Dtests.locale=es_EC -Dtests.timezone=America/Atikokan -Dtests.asserts=true -Dtests.file.encoding=Cp1252
   [junit4] ERROR   0.00s J1 | ConvertedLegacyTest (suite) <<<
   [junit4]    > Throwable #1: java.lang.Exception: Suite timeout exceeded (>= 7200000 msec).
   [junit4]    > 	at __randomizedtesting.SeedInfo.seed([9A942A4156E3F0E8]:0)
   [junit4] Completed [440/502] on J1 in 7269.42s, 1 test, 2 errors <<< FAILURES!

[...truncated 198 lines...]
BUILD FAILED
C:\Users\JenkinsSlave\workspace\Lucene-Solr-trunk-Windows\build.xml:526: The following error occurred while executing this line:
C:\Users\JenkinsSlave\workspace\Lucene-Solr-trunk-Windows\build.xml:474: The following error occurred while executing this line:
C:\Users\JenkinsSlave\workspace\Lucene-Solr-trunk-Windows\build.xml:61: The following error occurred while executing this line:
C:\Users\JenkinsSlave\workspace\Lucene-Solr-trunk-Windows\extra-targets.xml:39: The following error occurred while executing this line:
C:\Users\JenkinsSlave\workspace\Lucene-Solr-trunk-Windows\solr\build.xml:229: The following error occurred while executing this line:
C:\Users\JenkinsSlave\workspace\Lucene-Solr-trunk-Windows\solr\common-build.xml:512: The following error occurred while executing this line:
C:\Users\JenkinsSlave\workspace\Lucene-Solr-trunk-Windows\lucene\common-build.xml:1415: The following error occurred while executing this line:
C:\Users\JenkinsSlave\workspace\Lucene-Solr-trunk-Windows\lucene\common-build.xml:973: There were test failures: 502 suites, 1983 tests, 1 suite-level error, 1 error, 414 ignored (32 assumptions)

Total time: 151 minutes 54 seconds
Build step 'Invoke Ant' marked build as failure
Archiving artifacts
Recording test results
Email was triggered for: Failure - Any
Sending email for trigger: Failure - Any



Mime
View raw message