lucene-dev mailing list archives

Site index · List index
Message view « Date » · « Thread »
Top « Date » · « Thread »
From Apache Jenkins Server <jenk...@builds.apache.org>
Subject [JENKINS-MAVEN] Lucene-Solr-Maven-trunk #1442: POMs out of sync
Date Fri, 22 May 2015 23:47:22 GMT
Build: https://builds.apache.org/job/Lucene-Solr-Maven-trunk/1442/

No tests ran.

Build Log:
[...truncated 47724 lines...]
-validate-maven-dependencies:
[artifact:dependencies] Downloading: org/apache/mahout/mahout-collections/1.0/mahout-collections-1.0.pom
from repository maven-restlet at http://maven.restlet.org
[artifact:dependencies] Unable to locate resource in repository
[artifact:dependencies] [INFO] Unable to find resource 'org.apache.mahout:mahout-collections:pom:1.0'
in repository maven-restlet (http://maven.restlet.org)
[artifact:dependencies] Downloading: org/apache/mahout/mahout-collections/1.0/mahout-collections-1.0.pom
from repository releases.cloudera.com at https://repository.cloudera.com/artifactory/libs-release
[artifact:dependencies] Unable to locate resource in repository
[artifact:dependencies] [INFO] Unable to find resource 'org.apache.mahout:mahout-collections:pom:1.0'
in repository releases.cloudera.com (https://repository.cloudera.com/artifactory/libs-release)
[artifact:dependencies] Downloading: org/apache/mahout/mahout-collections/1.0/mahout-collections-1.0.pom
from repository central at http://repo1.maven.org/maven2
[artifact:dependencies] Transferring 10K from central
[artifact:dependencies] Downloading: org/apache/apache/6/apache-6.pom from repository maven-restlet
at http://maven.restlet.org
[artifact:dependencies] Unable to locate resource in repository
[artifact:dependencies] [INFO] Unable to find resource 'org.apache:apache:pom:6' in repository
maven-restlet (http://maven.restlet.org)
[artifact:dependencies] Downloading: org/apache/apache/6/apache-6.pom from repository releases.cloudera.com
at https://repository.cloudera.com/artifactory/libs-release
[artifact:dependencies] Unable to locate resource in repository
[artifact:dependencies] [INFO] Unable to find resource 'org.apache:apache:pom:6' in repository
releases.cloudera.com (https://repository.cloudera.com/artifactory/libs-release)
[artifact:dependencies] Downloading: org/apache/apache/6/apache-6.pom from repository central
at http://repo1.maven.org/maven2
[artifact:dependencies] Transferring 12K from central
[artifact:dependencies] Downloading: org/apache/mahout/mahout-math/0.6/mahout-math-0.6.pom
from repository maven-restlet at http://maven.restlet.org
[artifact:dependencies] Unable to locate resource in repository
[artifact:dependencies] [INFO] Unable to find resource 'org.apache.mahout:mahout-math:pom:0.6'
in repository maven-restlet (http://maven.restlet.org)
[artifact:dependencies] Downloading: org/apache/mahout/mahout-math/0.6/mahout-math-0.6.pom
from repository releases.cloudera.com at https://repository.cloudera.com/artifactory/libs-release
[artifact:dependencies] Unable to locate resource in repository
[artifact:dependencies] [INFO] Unable to find resource 'org.apache.mahout:mahout-math:pom:0.6'
in repository releases.cloudera.com (https://repository.cloudera.com/artifactory/libs-release)
[artifact:dependencies] Downloading: org/apache/mahout/mahout-math/0.6/mahout-math-0.6.pom
from repository central at http://repo1.maven.org/maven2
[artifact:dependencies] Transferring 4K from central
[artifact:dependencies] Downloading: org/apache/mahout/mahout/0.6/mahout-0.6.pom from repository
maven-restlet at http://maven.restlet.org
[artifact:dependencies] Unable to locate resource in repository
[artifact:dependencies] [INFO] Unable to find resource 'org.apache.mahout:mahout:pom:0.6'
in repository maven-restlet (http://maven.restlet.org)
[artifact:dependencies] Downloading: org/apache/mahout/mahout/0.6/mahout-0.6.pom from repository
releases.cloudera.com at https://repository.cloudera.com/artifactory/libs-release
[artifact:dependencies] Unable to locate resource in repository
[artifact:dependencies] [INFO] Unable to find resource 'org.apache.mahout:mahout:pom:0.6'
in repository releases.cloudera.com (https://repository.cloudera.com/artifactory/libs-release)
[artifact:dependencies] Downloading: org/apache/mahout/mahout/0.6/mahout-0.6.pom from repository
central at http://repo1.maven.org/maven2
[artifact:dependencies] Transferring 32K from central
[artifact:dependencies] Downloading: org/carrot2/carrot2-mini/3.9.0/carrot2-mini-3.9.0.pom
from repository maven-restlet at http://maven.restlet.org
[artifact:dependencies] Unable to locate resource in repository
[artifact:dependencies] [INFO] Unable to find resource 'org.carrot2:carrot2-mini:pom:3.9.0'
in repository maven-restlet (http://maven.restlet.org)
[artifact:dependencies] Downloading: org/carrot2/carrot2-mini/3.9.0/carrot2-mini-3.9.0.pom
from repository releases.cloudera.com at https://repository.cloudera.com/artifactory/libs-release
[artifact:dependencies] Unable to locate resource in repository
[artifact:dependencies] [INFO] Unable to find resource 'org.carrot2:carrot2-mini:pom:3.9.0'
in repository releases.cloudera.com (https://repository.cloudera.com/artifactory/libs-release)
[artifact:dependencies] Downloading: org/carrot2/carrot2-mini/3.9.0/carrot2-mini-3.9.0.pom
from repository central at http://repo1.maven.org/maven2
[artifact:dependencies] Transferring 3K from central
[artifact:dependencies] Downloading: org/carrot2/carrot2/3.9.0/carrot2-3.9.0.pom from repository
maven-restlet at http://maven.restlet.org
[artifact:dependencies] Unable to locate resource in repository
[artifact:dependencies] [INFO] Unable to find resource 'org.carrot2:carrot2:pom:3.9.0' in
repository maven-restlet (http://maven.restlet.org)
[artifact:dependencies] Downloading: org/carrot2/carrot2/3.9.0/carrot2-3.9.0.pom from repository
releases.cloudera.com at https://repository.cloudera.com/artifactory/libs-release
[artifact:dependencies] Unable to locate resource in repository
[artifact:dependencies] [INFO] Unable to find resource 'org.carrot2:carrot2:pom:3.9.0' in
repository releases.cloudera.com (https://repository.cloudera.com/artifactory/libs-release)
[artifact:dependencies] Downloading: org/carrot2/carrot2/3.9.0/carrot2-3.9.0.pom from repository
central at http://repo1.maven.org/maven2
[artifact:dependencies] Transferring 7K from central
[artifact:dependencies] Downloading: org/sonatype/oss/oss-parent/5/oss-parent-5.pom from repository
sonatype.releases at http://oss.sonatype.org/content/repositories/releases
[artifact:dependencies] Transferring 0K from sonatype.releases
[artifact:dependencies] [WARNING] *** CHECKSUM FAILED - Checksum failed on download: local
= '81ffbd1712afe8cdf138b570c0fc9934742c33c1'; remote = '<html>
[artifact:dependencies] <head><title>301' - RETRYING
[artifact:dependencies] Downloading: org/sonatype/oss/oss-parent/5/oss-parent-5.pom from repository
sonatype.releases at http://oss.sonatype.org/content/repositories/releases
[artifact:dependencies] Transferring 0K from sonatype.releases
[artifact:dependencies] [WARNING] *** CHECKSUM FAILED - Checksum failed on download: local
= '81ffbd1712afe8cdf138b570c0fc9934742c33c1'; remote = '<html>
[artifact:dependencies] <head><title>301' - IGNORING
[artifact:dependencies] An error has occurred while processing the Maven artifact tasks.

[...truncated 16 lines...]
BUILD FAILED
/home/jenkins/jenkins-slave/workspace/Lucene-Solr-Maven-trunk/build.xml:542: The following
error occurred while executing this line:
/home/jenkins/jenkins-slave/workspace/Lucene-Solr-Maven-trunk/build.xml:203: The following
error occurred while executing this line:
/home/jenkins/jenkins-slave/workspace/Lucene-Solr-Maven-trunk/solr/build.xml:684: The following
error occurred while executing this line:
/home/jenkins/jenkins-slave/workspace/Lucene-Solr-Maven-trunk/solr/common-build.xml:455: The
following error occurred while executing this line:
/home/jenkins/jenkins-slave/workspace/Lucene-Solr-Maven-trunk/solr/common-build.xml:358: The
following error occurred while executing this line:
/home/jenkins/jenkins-slave/workspace/Lucene-Solr-Maven-trunk/lucene/common-build.xml:585:
Unable to resolve artifact: Unable to get dependency information: Unable to read the metadata
file for artifact 'org.carrot2:carrot2-mini:jar': Cannot find parent: org.sonatype.oss:oss-parent
for project: org.carrot2:carrot2:pom:3.9.0 for project org.carrot2:carrot2:pom:3.9.0
  org.carrot2:carrot2-mini:jar:3.9.0

from the specified remote repositories:
  maven-restlet (http://maven.restlet.org),
  central (http://repo1.maven.org/maven2),
  Nexus (http://repository.apache.org/snapshots),
  releases.cloudera.com (https://repository.cloudera.com/artifactory/libs-release)

Path to dependency: 
	1) org.apache.solr:solr-clustering:jar:6.0.0-SNAPSHOT



Total time: 13 minutes 20 seconds
Build step 'Invoke Ant' marked build as failure
Email was triggered for: Failure
Sending email for trigger: Failure



Mime
View raw message