lucene-dev mailing list archives

Site index · List index
Message view « Date » · « Thread »
Top « Date » · « Thread »
From Apache Jenkins Server <jenk...@builds.apache.org>
Subject [JENKINS] Lucene-Solr-Tests-5.x-Java7 - Build # 3082 - Failure
Date Fri, 08 May 2015 09:18:00 GMT
Build: https://builds.apache.org/job/Lucene-Solr-Tests-5.x-Java7/3082/

1 tests failed.
REGRESSION:  org.apache.solr.cloud.HttpPartitionTest.test

Error Message:
Didn't see all replicas for shard shard1 in c8n_1x2 come up within 30000 ms! ClusterState: {   "control_collection":{     "autoAddReplicas":"false",     "replicationFactor":"1",     "shards":{"shard1":{         "range":"80000000-7fffffff",         "state":"active",         "replicas":{"core_node1":{             "state":"active",             "node_name":"127.0.0.1:32120_vvh",             "core":"collection1",             "base_url":"http://127.0.0.1:32120/vvh",             "leader":"true"}}}},     "autoCreated":"true",     "router":{"name":"compositeId"},     "maxShardsPerNode":"1"},   "c8n_1x2":{     "autoAddReplicas":"false",     "replicationFactor":"2",     "shards":{"shard1":{         "range":"80000000-7fffffff",         "state":"active",         "replicas":{           "core_node1":{             "state":"recovering",             "node_name":"127.0.0.1:32133_vvh",             "core":"c8n_1x2_shard1_replica2",             "base_url":"http://127.0.0.1:32133/vvh"},           "core_node2":{             "state":"active",             "node_name":"127.0.0.1:32120_vvh",             "core":"c8n_1x2_shard1_replica1",             "base_url":"http://127.0.0.1:32120/vvh",             "leader":"true"}}}},     "router":{"name":"compositeId"},     "maxShardsPerNode":"1"},   "collection1":{     "autoAddReplicas":"false",     "replicationFactor":"1",     "shards":{       "shard1":{         "range":"80000000-ffffffff",         "state":"active",         "replicas":{"core_node2":{             "state":"active",             "node_name":"127.0.0.1:32151_vvh",             "core":"collection1",             "base_url":"http://127.0.0.1:32151/vvh",             "leader":"true"}}},       "shard2":{         "range":"0-7fffffff",         "state":"active",         "replicas":{           "core_node1":{             "state":"active",             "node_name":"127.0.0.1:32133_vvh",             "core":"collection1",             "base_url":"http://127.0.0.1:32133/vvh",             "leader":"true"},           "core_node3":{             "state":"active",             "node_name":"127.0.0.1:32157_vvh",             "core":"collection1",             "base_url":"http://127.0.0.1:32157/vvh"}}}},     "autoCreated":"true",     "router":{"name":"compositeId"},     "maxShardsPerNode":"1"}}

Stack Trace:
java.lang.AssertionError: Didn't see all replicas for shard shard1 in c8n_1x2 come up within 30000 ms! ClusterState: {
  "control_collection":{
    "autoAddReplicas":"false",
    "replicationFactor":"1",
    "shards":{"shard1":{
        "range":"80000000-7fffffff",
        "state":"active",
        "replicas":{"core_node1":{
            "state":"active",
            "node_name":"127.0.0.1:32120_vvh",
            "core":"collection1",
            "base_url":"http://127.0.0.1:32120/vvh",
            "leader":"true"}}}},
    "autoCreated":"true",
    "router":{"name":"compositeId"},
    "maxShardsPerNode":"1"},
  "c8n_1x2":{
    "autoAddReplicas":"false",
    "replicationFactor":"2",
    "shards":{"shard1":{
        "range":"80000000-7fffffff",
        "state":"active",
        "replicas":{
          "core_node1":{
            "state":"recovering",
            "node_name":"127.0.0.1:32133_vvh",
            "core":"c8n_1x2_shard1_replica2",
            "base_url":"http://127.0.0.1:32133/vvh"},
          "core_node2":{
            "state":"active",
            "node_name":"127.0.0.1:32120_vvh",
            "core":"c8n_1x2_shard1_replica1",
            "base_url":"http://127.0.0.1:32120/vvh",
            "leader":"true"}}}},
    "router":{"name":"compositeId"},
    "maxShardsPerNode":"1"},
  "collection1":{
    "autoAddReplicas":"false",
    "replicationFactor":"1",
    "shards":{
      "shard1":{
        "range":"80000000-ffffffff",
        "state":"active",
        "replicas":{"core_node2":{
            "state":"active",
            "node_name":"127.0.0.1:32151_vvh",
            "core":"collection1",
            "base_url":"http://127.0.0.1:32151/vvh",
            "leader":"true"}}},
      "shard2":{
        "range":"0-7fffffff",
        "state":"active",
        "replicas":{
          "core_node1":{
            "state":"active",
            "node_name":"127.0.0.1:32133_vvh",
            "core":"collection1",
            "base_url":"http://127.0.0.1:32133/vvh",
            "leader":"true"},
          "core_node3":{
            "state":"active",
            "node_name":"127.0.0.1:32157_vvh",
            "core":"collection1",
            "base_url":"http://127.0.0.1:32157/vvh"}}}},
    "autoCreated":"true",
    "router":{"name":"compositeId"},
    "maxShardsPerNode":"1"}}
	at __randomizedtesting.SeedInfo.seed([AD424071B5FE79DD:25167FAB1B021425]:0)
	at org.junit.Assert.fail(Assert.java:93)
	at org.apache.solr.cloud.AbstractFullDistribZkTestBase.ensureAllReplicasAreActive(AbstractFullDistribZkTestBase.java:1920)
	at org.apache.solr.cloud.HttpPartitionTest.testRf2(HttpPartitionTest.java:237)
	at org.apache.solr.cloud.HttpPartitionTest.test(HttpPartitionTest.java:105)
	at sun.reflect.NativeMethodAccessorImpl.invoke0(Native Method)
	at sun.reflect.NativeMethodAccessorImpl.invoke(NativeMethodAccessorImpl.java:57)
	at sun.reflect.DelegatingMethodAccessorImpl.invoke(DelegatingMethodAccessorImpl.java:43)
	at java.lang.reflect.Method.invoke(Method.java:606)
	at com.carrotsearch.randomizedtesting.RandomizedRunner.invoke(RandomizedRunner.java:1627)
	at com.carrotsearch.randomizedtesting.RandomizedRunner$6.evaluate(RandomizedRunner.java:836)
	at com.carrotsearch.randomizedtesting.RandomizedRunner$7.evaluate(RandomizedRunner.java:872)
	at com.carrotsearch.randomizedtesting.RandomizedRunner$8.evaluate(RandomizedRunner.java:886)
	at org.apache.solr.BaseDistributedSearchTestCase$ShardsRepeatRule$ShardsFixedStatement.callStatement(BaseDistributedSearchTestCase.java:960)
	at org.apache.solr.BaseDistributedSearchTestCase$ShardsRepeatRule$ShardsStatement.evaluate(BaseDistributedSearchTestCase.java:935)
	at com.carrotsearch.randomizedtesting.rules.SystemPropertiesRestoreRule$1.evaluate(SystemPropertiesRestoreRule.java:57)
	at org.apache.lucene.util.TestRuleSetupTeardownChained$1.evaluate(TestRuleSetupTeardownChained.java:50)
	at org.apache.lucene.util.AbstractBeforeAfterRule$1.evaluate(AbstractBeforeAfterRule.java:46)
	at org.apache.lucene.util.TestRuleThreadAndTestName$1.evaluate(TestRuleThreadAndTestName.java:49)
	at org.apache.lucene.util.TestRuleIgnoreAfterMaxFailures$1.evaluate(TestRuleIgnoreAfterMaxFailures.java:65)
	at org.apache.lucene.util.TestRuleMarkFailure$1.evaluate(TestRuleMarkFailure.java:48)
	at com.carrotsearch.randomizedtesting.rules.StatementAdapter.evaluate(StatementAdapter.java:36)
	at com.carrotsearch.randomizedtesting.ThreadLeakControl$StatementRunner.run(ThreadLeakControl.java:365)
	at com.carrotsearch.randomizedtesting.ThreadLeakControl.forkTimeoutingTask(ThreadLeakControl.java:798)
	at com.carrotsearch.randomizedtesting.ThreadLeakControl$3.evaluate(ThreadLeakControl.java:458)
	at com.carrotsearch.randomizedtesting.RandomizedRunner.runSingleTest(RandomizedRunner.java:845)
	at com.carrotsearch.randomizedtesting.RandomizedRunner$3.evaluate(RandomizedRunner.java:747)
	at com.carrotsearch.randomizedtesting.RandomizedRunner$4.evaluate(RandomizedRunner.java:781)
	at com.carrotsearch.randomizedtesting.RandomizedRunner$5.evaluate(RandomizedRunner.java:792)
	at com.carrotsearch.randomizedtesting.rules.StatementAdapter.evaluate(StatementAdapter.java:36)
	at com.carrotsearch.randomizedtesting.rules.SystemPropertiesRestoreRule$1.evaluate(SystemPropertiesRestoreRule.java:57)
	at org.apache.lucene.util.AbstractBeforeAfterRule$1.evaluate(AbstractBeforeAfterRule.java:46)
	at com.carrotsearch.randomizedtesting.rules.StatementAdapter.evaluate(StatementAdapter.java:36)
	at org.apache.lucene.util.TestRuleStoreClassName$1.evaluate(TestRuleStoreClassName.java:42)
	at com.carrotsearch.randomizedtesting.rules.NoShadowingOrOverridesOnMethodsRule$1.evaluate(NoShadowingOrOverridesOnMethodsRule.java:39)
	at com.carrotsearch.randomizedtesting.rules.NoShadowingOrOverridesOnMethodsRule$1.evaluate(NoShadowingOrOverridesOnMethodsRule.java:39)
	at com.carrotsearch.randomizedtesting.rules.StatementAdapter.evaluate(StatementAdapter.java:36)
	at com.carrotsearch.randomizedtesting.rules.StatementAdapter.evaluate(StatementAdapter.java:36)
	at com.carrotsearch.randomizedtesting.rules.StatementAdapter.evaluate(StatementAdapter.java:36)
	at org.apache.lucene.util.TestRuleAssertionsRequired$1.evaluate(TestRuleAssertionsRequired.java:54)
	at org.apache.lucene.util.TestRuleMarkFailure$1.evaluate(TestRuleMarkFailure.java:48)
	at org.apache.lucene.util.TestRuleIgnoreAfterMaxFailures$1.evaluate(TestRuleIgnoreAfterMaxFailures.java:65)
	at org.apache.lucene.util.TestRuleIgnoreTestSuites$1.evaluate(TestRuleIgnoreTestSuites.java:55)
	at com.carrotsearch.randomizedtesting.rules.StatementAdapter.evaluate(StatementAdapter.java:36)
	at com.carrotsearch.randomizedtesting.ThreadLeakControl$StatementRunner.run(ThreadLeakControl.java:365)
	at java.lang.Thread.run(Thread.java:745)




Build Log:
[...truncated 9618 lines...]
   [junit4] Suite: org.apache.solr.cloud.HttpPartitionTest
   [junit4]   2> Creating dataDir: /usr/home/jenkins/jenkins-slave/workspace/Lucene-Solr-Tests-5.x-Java7/solr/build/solr-core/test/J0/temp/solr.cloud.HttpPartitionTest AD424071B5FE79DD-001/init-core-data-001
   [junit4]   2> 107283 T281 oas.BaseDistributedSearchTestCase.initHostContext Setting hostContext system property: /vvh/
   [junit4]   2> 107290 T281 oasc.ZkTestServer.run STARTING ZK TEST SERVER
   [junit4]   2> 107290 T282 oasc.ZkTestServer$2$1.setClientPort client port:0.0.0.0/0.0.0.0:0
   [junit4]   2> 107290 T282 oasc.ZkTestServer$ZKServerMain.runFromConfig Starting server
   [junit4]   2> 107390 T281 oasc.ZkTestServer.run start zk server on port:32117
   [junit4]   2> 107391 T281 oascc.SolrZkClient.createZkCredentialsToAddAutomatically Using default ZkCredentialsProvider
   [junit4]   2> 107392 T281 oascc.ConnectionManager.waitForConnected Waiting for client to connect to ZooKeeper
   [junit4]   2> 107395 T289 oascc.ConnectionManager.process Watcher org.apache.solr.common.cloud.ConnectionManager@584f778e name:ZooKeeperConnection Watcher:127.0.0.1:32117 got event WatchedEvent state:SyncConnected type:None path:null path:null type:None
   [junit4]   2> 107396 T281 oascc.ConnectionManager.waitForConnected Client is connected to ZooKeeper
   [junit4]   2> 107396 T281 oascc.SolrZkClient.createZkACLProvider Using default ZkACLProvider
   [junit4]   2> 107396 T281 oascc.SolrZkClient.makePath makePath: /solr
   [junit4]   2> 107399 T281 oascc.SolrZkClient.createZkCredentialsToAddAutomatically Using default ZkCredentialsProvider
   [junit4]   2> 107399 T281 oascc.ConnectionManager.waitForConnected Waiting for client to connect to ZooKeeper
   [junit4]   2> 107401 T292 oascc.ConnectionManager.process Watcher org.apache.solr.common.cloud.ConnectionManager@43748549 name:ZooKeeperConnection Watcher:127.0.0.1:32117/solr got event WatchedEvent state:SyncConnected type:None path:null path:null type:None
   [junit4]   2> 107401 T281 oascc.ConnectionManager.waitForConnected Client is connected to ZooKeeper
   [junit4]   2> 107401 T281 oascc.SolrZkClient.createZkACLProvider Using default ZkACLProvider
   [junit4]   2> 107402 T281 oascc.SolrZkClient.makePath makePath: /collections/collection1
   [junit4]   2> 107404 T281 oascc.SolrZkClient.makePath makePath: /collections/collection1/shards
   [junit4]   2> 107405 T281 oascc.SolrZkClient.makePath makePath: /collections/control_collection
   [junit4]   2> 107406 T281 oascc.SolrZkClient.makePath makePath: /collections/control_collection/shards
   [junit4]   2> 107408 T281 oasc.AbstractZkTestCase.putConfig put /usr/home/jenkins/jenkins-slave/workspace/Lucene-Solr-Tests-5.x-Java7/solr/core/src/test-files/solr/collection1/conf/solrconfig-tlog.xml to /configs/conf1/solrconfig.xml
   [junit4]   2> 107408 T281 oascc.SolrZkClient.makePath makePath: /configs/conf1/solrconfig.xml
   [junit4]   2> 107411 T281 oasc.AbstractZkTestCase.putConfig put /usr/home/jenkins/jenkins-slave/workspace/Lucene-Solr-Tests-5.x-Java7/solr/core/src/test-files/solr/collection1/conf/schema.xml to /configs/conf1/schema.xml
   [junit4]   2> 107411 T281 oascc.SolrZkClient.makePath makePath: /configs/conf1/schema.xml
   [junit4]   2> 107413 T281 oasc.AbstractZkTestCase.putConfig put /usr/home/jenkins/jenkins-slave/workspace/Lucene-Solr-Tests-5.x-Java7/solr/core/src/test-files/solr/collection1/conf/solrconfig.snippet.randomindexconfig.xml to /configs/conf1/solrconfig.snippet.randomindexconfig.xml
   [junit4]   2> 107414 T281 oascc.SolrZkClient.makePath makePath: /configs/conf1/solrconfig.snippet.randomindexconfig.xml
   [junit4]   2> 107415 T281 oasc.AbstractZkTestCase.putConfig put /usr/home/jenkins/jenkins-slave/workspace/Lucene-Solr-Tests-5.x-Java7/solr/core/src/test-files/solr/collection1/conf/stopwords.txt to /configs/conf1/stopwords.txt
   [junit4]   2> 107416 T281 oascc.SolrZkClient.makePath makePath: /configs/conf1/stopwords.txt
   [junit4]   2> 107418 T281 oasc.AbstractZkTestCase.putConfig put /usr/home/jenkins/jenkins-slave/workspace/Lucene-Solr-Tests-5.x-Java7/solr/core/src/test-files/solr/collection1/conf/protwords.txt to /configs/conf1/protwords.txt
   [junit4]   2> 107418 T281 oascc.SolrZkClient.makePath makePath: /configs/conf1/protwords.txt
   [junit4]   2> 107420 T281 oasc.AbstractZkTestCase.putConfig put /usr/home/jenkins/jenkins-slave/workspace/Lucene-Solr-Tests-5.x-Java7/solr/core/src/test-files/solr/collection1/conf/currency.xml to /configs/conf1/currency.xml
   [junit4]   2> 107420 T281 oascc.SolrZkClient.makePath makePath: /configs/conf1/currency.xml
   [junit4]   2> 107422 T281 oasc.AbstractZkTestCase.putConfig put /usr/home/jenkins/jenkins-slave/workspace/Lucene-Solr-Tests-5.x-Java7/solr/core/src/test-files/solr/collection1/conf/enumsConfig.xml to /configs/conf1/enumsConfig.xml
   [junit4]   2> 107422 T281 oascc.SolrZkClient.makePath makePath: /configs/conf1/enumsConfig.xml
   [junit4]   2> 107424 T281 oasc.AbstractZkTestCase.putConfig put /usr/home/jenkins/jenkins-slave/workspace/Lucene-Solr-Tests-5.x-Java7/solr/core/src/test-files/solr/collection1/conf/open-exchange-rates.json to /configs/conf1/open-exchange-rates.json
   [junit4]   2> 107425 T281 oascc.SolrZkClient.makePath makePath: /configs/conf1/open-exchange-rates.json
   [junit4]   2> 107426 T281 oasc.AbstractZkTestCase.putConfig put /usr/home/jenkins/jenkins-slave/workspace/Lucene-Solr-Tests-5.x-Java7/solr/core/src/test-files/solr/collection1/conf/mapping-ISOLatin1Accent.txt to /configs/conf1/mapping-ISOLatin1Accent.txt
   [junit4]   2> 107427 T281 oascc.SolrZkClient.makePath makePath: /configs/conf1/mapping-ISOLatin1Accent.txt
   [junit4]   2> 107429 T281 oasc.AbstractZkTestCase.putConfig put /usr/home/jenkins/jenkins-slave/workspace/Lucene-Solr-Tests-5.x-Java7/solr/core/src/test-files/solr/collection1/conf/old_synonyms.txt to /configs/conf1/old_synonyms.txt
   [junit4]   2> 107429 T281 oascc.SolrZkClient.makePath makePath: /configs/conf1/old_synonyms.txt
   [junit4]   2> 107431 T281 oasc.AbstractZkTestCase.putConfig put /usr/home/jenkins/jenkins-slave/workspace/Lucene-Solr-Tests-5.x-Java7/solr/core/src/test-files/solr/collection1/conf/synonyms.txt to /configs/conf1/synonyms.txt
   [junit4]   2> 107431 T281 oascc.SolrZkClient.makePath makePath: /configs/conf1/synonyms.txt
   [junit4]   2> 108841 T281 oas.SolrTestCaseJ4.writeCoreProperties Writing core.properties file to /usr/home/jenkins/jenkins-slave/workspace/Lucene-Solr-Tests-5.x-Java7/solr/build/solr-core/test/J0/temp/solr.cloud.HttpPartitionTest AD424071B5FE79DD-001/control-001/cores/collection1
   [junit4]   2> 108847 T281 oejs.Server.doStart jetty-9.2.10.v20150310
   [junit4]   2> 108849 T281 oejsh.ContextHandler.doStart Started o.e.j.s.ServletContextHandler@389c4b4d{/vvh,null,AVAILABLE}
   [junit4]   2> 108852 T281 oejs.AbstractConnector.doStart Started ServerConnector@5de504a4{HTTP/1.1}{127.0.0.1:32121}
   [junit4]   2> 108852 T281 oejs.Server.doStart Started @113926ms
   [junit4]   2> 108852 T281 oascse.JettySolrRunner$1.lifeCycleStarted Jetty properties: {hostPort=32120, solr.data.dir=/usr/home/jenkins/jenkins-slave/workspace/Lucene-Solr-Tests-5.x-Java7/solr/build/solr-core/test/J0/temp/solr.cloud.HttpPartitionTest AD424071B5FE79DD-001/tempDir-001/control/data, hostContext=/vvh, coreRootDirectory=/usr/home/jenkins/jenkins-slave/workspace/Lucene-Solr-Tests-5.x-Java7/solr/build/solr-core/test/J0/temp/solr.cloud.HttpPartitionTest AD424071B5FE79DD-001/control-001/cores}
   [junit4]   2> 108853 T281 oass.SolrDispatchFilter.init SolrDispatchFilter.init()sun.misc.Launcher$AppClassLoader@231bf785
   [junit4]   2> 108854 T281 oasc.SolrResourceLoader.<init> new SolrResourceLoader for directory: '/usr/home/jenkins/jenkins-slave/workspace/Lucene-Solr-Tests-5.x-Java7/solr/build/solr-core/test/J0/temp/solr.cloud.HttpPartitionTest AD424071B5FE79DD-001/control-001/'
   [junit4]   2> 108899 T281 oasc.SolrXmlConfig.fromFile Loading container configuration from /usr/home/jenkins/jenkins-slave/workspace/Lucene-Solr-Tests-5.x-Java7/solr/build/solr-core/test/J0/temp/solr.cloud.HttpPartitionTest AD424071B5FE79DD-001/control-001/solr.xml
   [junit4]   2> 108954 T281 oasc.CorePropertiesLocator.<init> Config-defined core root directory: /usr/home/jenkins/jenkins-slave/workspace/Lucene-Solr-Tests-5.x-Java7/solr/build/solr-core/test/J0/temp/solr.cloud.HttpPartitionTest AD424071B5FE79DD-001/control-001/cores
   [junit4]   2> 108955 T281 oasc.CoreContainer.<init> New CoreContainer 982297488
   [junit4]   2> 108955 T281 oasc.CoreContainer.load Loading cores into CoreContainer [instanceDir=/usr/home/jenkins/jenkins-slave/workspace/Lucene-Solr-Tests-5.x-Java7/solr/build/solr-core/test/J0/temp/solr.cloud.HttpPartitionTest AD424071B5FE79DD-001/control-001/]
   [junit4]   2> 108955 T281 oasc.CoreContainer.load loading shared library: /usr/home/jenkins/jenkins-slave/workspace/Lucene-Solr-Tests-5.x-Java7/solr/build/solr-core/test/J0/temp/solr.cloud.HttpPartitionTest AD424071B5FE79DD-001/control-001/lib
   [junit4]   2> 108956 T281 oasc.SolrResourceLoader.addToClassLoader WARN Can't find (or read) directory to add to classloader: lib (resolved as: /usr/home/jenkins/jenkins-slave/workspace/Lucene-Solr-Tests-5.x-Java7/solr/build/solr-core/test/J0/temp/solr.cloud.HttpPartitionTest AD424071B5FE79DD-001/control-001/lib).
   [junit4]   2> 108966 T281 oashc.HttpShardHandlerFactory.init created with socketTimeout : 90000,urlScheme : ,connTimeout : 15000,maxConnectionsPerHost : 20,maxConnections : 10000,corePoolSize : 0,maximumPoolSize : 2147483647,maxThreadIdleTime : 5,sizeOfQueue : -1,fairnessPolicy : false,useRetries : false,
   [junit4]   2> 108972 T281 oasu.UpdateShardHandler.<init> Creating UpdateShardHandler HTTP client with params: socketTimeout=340000&connTimeout=45000&retry=true
   [junit4]   2> 108973 T281 oasl.LogWatcher.createWatcher SLF4J impl is org.slf4j.impl.Log4jLoggerFactory
   [junit4]   2> 108973 T281 oasl.LogWatcher.newRegisteredLogWatcher Registering Log Listener [Log4j (org.slf4j.impl.Log4jLoggerFactory)]
   [junit4]   2> 108973 T281 oasc.CoreContainer.load Node Name: 127.0.0.1
   [junit4]   2> 108974 T281 oasc.ZkContainer.initZooKeeper Zookeeper client=127.0.0.1:32117/solr
   [junit4]   2> 108974 T281 oasc.ZkController.checkChrootPath zkHost includes chroot
   [junit4]   2> 108974 T281 oascc.SolrZkClient.createZkCredentialsToAddAutomatically Using default ZkCredentialsProvider
   [junit4]   2> 108975 T281 oascc.ConnectionManager.waitForConnected Waiting for client to connect to ZooKeeper
   [junit4]   2> 108977 T306 oascc.ConnectionManager.process Watcher org.apache.solr.common.cloud.ConnectionManager@59d803e8 name:ZooKeeperConnection Watcher:127.0.0.1:32117 got event WatchedEvent state:SyncConnected type:None path:null path:null type:None
   [junit4]   2> 108978 T281 oascc.ConnectionManager.waitForConnected Client is connected to ZooKeeper
   [junit4]   2> 108979 T281 oascc.SolrZkClient.createZkACLProvider Using default ZkACLProvider
   [junit4]   2> 108981 T281 n:127.0.0.1:32120_vvh oascc.ConnectionManager.waitForConnected Waiting for client to connect to ZooKeeper
   [junit4]   2> 108983 T309 n:127.0.0.1:32120_vvh oascc.ConnectionManager.process Watcher org.apache.solr.common.cloud.ConnectionManager@ce5188e name:ZooKeeperConnection Watcher:127.0.0.1:32117/solr got event WatchedEvent state:SyncConnected type:None path:null path:null type:None
   [junit4]   2> 108983 T281 n:127.0.0.1:32120_vvh oascc.ConnectionManager.waitForConnected Client is connected to ZooKeeper
   [junit4]   2> 108985 T281 n:127.0.0.1:32120_vvh oascc.SolrZkClient.makePath makePath: /overseer/queue
   [junit4]   2> 108987 T281 n:127.0.0.1:32120_vvh oascc.SolrZkClient.makePath makePath: /overseer/collection-queue-work
   [junit4]   2> 108989 T281 n:127.0.0.1:32120_vvh oascc.SolrZkClient.makePath makePath: /overseer/collection-map-running
   [junit4]   2> 108991 T281 n:127.0.0.1:32120_vvh oascc.SolrZkClient.makePath makePath: /overseer/collection-map-completed
   [junit4]   2> 108993 T281 n:127.0.0.1:32120_vvh oascc.SolrZkClient.makePath makePath: /overseer/collection-map-failure
   [junit4]   2> 108996 T281 n:127.0.0.1:32120_vvh oascc.SolrZkClient.makePath makePath: /live_nodes
   [junit4]   2> 108997 T281 n:127.0.0.1:32120_vvh oascc.SolrZkClient.makePath makePath: /aliases.json
   [junit4]   2> 108999 T281 n:127.0.0.1:32120_vvh oascc.SolrZkClient.makePath makePath: /clusterstate.json
   [junit4]   2> 109000 T281 n:127.0.0.1:32120_vvh oasc.ZkController.createEphemeralLiveNode Register node as live in ZooKeeper:/live_nodes/127.0.0.1:32120_vvh
   [junit4]   2> 109001 T281 n:127.0.0.1:32120_vvh oascc.SolrZkClient.makePath makePath: /live_nodes/127.0.0.1:32120_vvh
   [junit4]   2> 109002 T281 n:127.0.0.1:32120_vvh oascc.SolrZkClient.makePath makePath: /overseer_elect
   [junit4]   2> 109004 T281 n:127.0.0.1:32120_vvh oascc.SolrZkClient.makePath makePath: /overseer_elect/election
   [junit4]   2> 109005 T281 n:127.0.0.1:32120_vvh oasc.Overseer.close Overseer (id=null) closing
   [junit4]   2> 109007 T281 n:127.0.0.1:32120_vvh oasc.OverseerElectionContext.runLeaderProcess I am going to be the leader 127.0.0.1:32120_vvh
   [junit4]   2> 109007 T281 n:127.0.0.1:32120_vvh oascc.SolrZkClient.makePath makePath: /overseer_elect/leader
   [junit4]   2> 109009 T281 n:127.0.0.1:32120_vvh oasc.Overseer.start Overseer (id=93786794876600323-127.0.0.1:32120_vvh-n_0000000000) starting
   [junit4]   2> 109011 T281 n:127.0.0.1:32120_vvh oascc.SolrZkClient.makePath makePath: /overseer/queue-work
   [junit4]   2> 109017 T281 n:127.0.0.1:32120_vvh oasc.OverseerAutoReplicaFailoverThread.<init> Starting OverseerAutoReplicaFailoverThread autoReplicaFailoverWorkLoopDelay=10000 autoReplicaFailoverWaitAfterExpiration=30000 autoReplicaFailoverBadNodeExpiration=60000
   [junit4]   2> 109017 T311 n:127.0.0.1:32120_vvh oasc.OverseerCollectionProcessor.run Process current queue of collection creations
   [junit4]   2> 109017 T281 n:127.0.0.1:32120_vvh oascc.ZkStateReader.createClusterStateWatchersAndUpdate Updating cluster state from ZooKeeper... 
   [junit4]   2> 109018 T310 n:127.0.0.1:32120_vvh oasc.Overseer$ClusterStateUpdater.run Starting to work on the main queue
   [junit4]   2> 109021 T281 n:127.0.0.1:32120_vvh oasc.CorePropertiesLocator.discover Looking for core definitions underneath /usr/home/jenkins/jenkins-slave/workspace/Lucene-Solr-Tests-5.x-Java7/solr/build/solr-core/test/J0/temp/solr.cloud.HttpPartitionTest AD424071B5FE79DD-001/control-001/cores
   [junit4]   2> 109023 T281 n:127.0.0.1:32120_vvh oasc.CoreDescriptor.<init> CORE DESCRIPTOR: {collection=control_collection, transient=false, loadOnStartup=true, instanceDir=/usr/home/jenkins/jenkins-slave/workspace/Lucene-Solr-Tests-5.x-Java7/solr/build/solr-core/test/J0/temp/solr.cloud.HttpPartitionTest AD424071B5FE79DD-001/control-001/cores/collection1, shard=, schema=schema.xml, absoluteInstDir=/usr/home/jenkins/jenkins-slave/workspace/Lucene-Solr-Tests-5.x-Java7/solr/build/solr-core/test/J0/temp/solr.cloud.HttpPartitionTest AD424071B5FE79DD-001/control-001/cores/collection1/, dataDir=data/, name=collection1, config=solrconfig.xml, coreNodeName=}
   [junit4]   2> 109023 T281 n:127.0.0.1:32120_vvh oasc.CorePropertiesLocator.discoverUnder Found core collection1 in /usr/home/jenkins/jenkins-slave/workspace/Lucene-Solr-Tests-5.x-Java7/solr/build/solr-core/test/J0/temp/solr.cloud.HttpPartitionTest AD424071B5FE79DD-001/control-001/cores/collection1/
   [junit4]   2> 109024 T281 n:127.0.0.1:32120_vvh oasc.CorePropertiesLocator.discover Found 1 core definitions
   [junit4]   2> 109025 T313 n:127.0.0.1:32120_vvh c:control_collection x:collection1 oasc.ZkController.publish publishing core=collection1 state=down collection=control_collection
   [junit4]   2> 109025 T313 n:127.0.0.1:32120_vvh c:control_collection x:collection1 oasc.ZkController.publish numShards not found on descriptor - reading it from system property
   [junit4]   2> 109026 T313 n:127.0.0.1:32120_vvh oasc.ZkController.waitForCoreNodeName look for our core node name
   [junit4]   2> 109026 T309 n:127.0.0.1:32120_vvh oasc.DistributedQueue$LatchWatcher.process NodeChildrenChanged fired on path /overseer/queue state SyncConnected
   [junit4]   2> 109028 T310 n:127.0.0.1:32120_vvh oasc.Overseer$ClusterStateUpdater.run processMessage: queueSize: 1, message = {
   [junit4]   2> 	  "roles":null,
   [junit4]   2> 	  "state":"down",
   [junit4]   2> 	  "node_name":"127.0.0.1:32120_vvh",
   [junit4]   2> 	  "operation":"state",
   [junit4]   2> 	  "numShards":"1",
   [junit4]   2> 	  "core":"collection1",
   [junit4]   2> 	  "collection":"control_collection",
   [junit4]   2> 	  "shard":null,
   [junit4]   2> 	  "base_url":"http://127.0.0.1:32120/vvh"} current state version: 0
   [junit4]   2> 109029 T310 n:127.0.0.1:32120_vvh oasco.ReplicaMutator.updateState Update state numShards=1 message={
   [junit4]   2> 	  "roles":null,
   [junit4]   2> 	  "state":"down",
   [junit4]   2> 	  "node_name":"127.0.0.1:32120_vvh",
   [junit4]   2> 	  "operation":"state",
   [junit4]   2> 	  "numShards":"1",
   [junit4]   2> 	  "core":"collection1",
   [junit4]   2> 	  "collection":"control_collection",
   [junit4]   2> 	  "shard":null,
   [junit4]   2> 	  "base_url":"http://127.0.0.1:32120/vvh"}
   [junit4]   2> 109029 T310 n:127.0.0.1:32120_vvh oasco.ClusterStateMutator.createCollection building a new cName: control_collection
   [junit4]   2> 109029 T310 n:127.0.0.1:32120_vvh oasco.ReplicaMutator.updateState Assigning new node to shard shard=shard1
   [junit4]   2> 109031 T309 n:127.0.0.1:32120_vvh oascc.ZkStateReader$2.process A cluster state change: WatchedEvent state:SyncConnected type:NodeDataChanged path:/clusterstate.json, has occurred - updating... (live nodes size: 1)
   [junit4]   2> 110027 T313 n:127.0.0.1:32120_vvh oasc.ZkController.waitForShardId waiting to find shard id in clusterstate for collection1
   [junit4]   2> 110028 T313 n:127.0.0.1:32120_vvh oasc.ZkController.createCollectionZkNode Check for collection zkNode:control_collection
   [junit4]   2> 110029 T313 n:127.0.0.1:32120_vvh oasc.ZkController.createCollectionZkNode Collection zkNode exists
   [junit4]   2> 110029 T313 n:127.0.0.1:32120_vvh oascc.ZkStateReader.readConfigName Load collection config from:/collections/control_collection
   [junit4]   2> 110030 T313 n:127.0.0.1:32120_vvh oascc.ZkStateReader.readConfigName path=/collections/control_collection configName=conf1 specified config exists in ZooKeeper
   [junit4]   2> 110030 T313 n:127.0.0.1:32120_vvh oasc.SolrResourceLoader.<init> new SolrResourceLoader for directory: '/usr/home/jenkins/jenkins-slave/workspace/Lucene-Solr-Tests-5.x-Java7/solr/build/solr-core/test/J0/temp/solr.cloud.HttpPartitionTest AD424071B5FE79DD-001/control-001/cores/collection1/'
   [junit4]   2> 110046 T313 n:127.0.0.1:32120_vvh oasc.Config.<init> loaded config solrconfig.xml with version 0 
   [junit4]   2> 110058 T313 n:127.0.0.1:32120_vvh oasc.SolrConfig.refreshRequestParams current version of requestparams : -1
   [junit4]   2> 110077 T313 n:127.0.0.1:32120_vvh oasc.SolrConfig.<init> Using Lucene MatchVersion: 5.2.0
   [junit4]   2> 110121 T313 n:127.0.0.1:32120_vvh oasc.SolrConfig.<init> Loaded SolrConfig: solrconfig.xml
   [junit4]   2> 110122 T313 n:127.0.0.1:32120_vvh oass.IndexSchema.readSchema Reading Solr Schema from /configs/conf1/schema.xml
   [junit4]   2> 110140 T313 n:127.0.0.1:32120_vvh oass.IndexSchema.readSchema [collection1] Schema name=test
   [junit4]   2> 110525 T313 n:127.0.0.1:32120_vvh oass.OpenExchangeRatesOrgProvider.init Initialized with rates=open-exchange-rates.json, refreshInterval=1440.
   [junit4]   2> 110539 T313 n:127.0.0.1:32120_vvh oass.IndexSchema.readSchema default search field in schema is text
   [junit4]   2> 110542 T313 n:127.0.0.1:32120_vvh oass.IndexSchema.readSchema unique key field: id
   [junit4]   2> 110559 T313 n:127.0.0.1:32120_vvh oass.FileExchangeRateProvider.reload Reloading exchange rates from file currency.xml
   [junit4]   2> 110563 T313 n:127.0.0.1:32120_vvh oass.FileExchangeRateProvider.reload Reloading exchange rates from file currency.xml
   [junit4]   2> 110567 T313 n:127.0.0.1:32120_vvh oass.OpenExchangeRatesOrgProvider.reload Reloading exchange rates from open-exchange-rates.json
   [junit4]   2> 110568 T313 n:127.0.0.1:32120_vvh oass.OpenExchangeRatesOrgProvider$OpenExchangeRates.<init> WARN Unknown key IMPORTANT NOTE
   [junit4]   2> 110568 T313 n:127.0.0.1:32120_vvh oass.OpenExchangeRatesOrgProvider$OpenExchangeRates.<init> WARN Expected key, got STRING
   [junit4]   2> 110568 T313 n:127.0.0.1:32120_vvh oass.OpenExchangeRatesOrgProvider.reload Reloading exchange rates from open-exchange-rates.json
   [junit4]   2> 110569 T313 n:127.0.0.1:32120_vvh oass.OpenExchangeRatesOrgProvider$OpenExchangeRates.<init> WARN Unknown key IMPORTANT NOTE
   [junit4]   2> 110569 T313 n:127.0.0.1:32120_vvh oass.OpenExchangeRatesOrgProvider$OpenExchangeRates.<init> WARN Expected key, got STRING
   [junit4]   2> 110569 T313 n:127.0.0.1:32120_vvh oasc.CoreContainer.create Creating SolrCore 'collection1' using configuration from collection control_collection
   [junit4]   2> 110570 T313 n:127.0.0.1:32120_vvh x:collection1 oasc.SolrCore.initDirectoryFactory org.apache.solr.core.MockDirectoryFactory
   [junit4]   2> 110570 T313 n:127.0.0.1:32120_vvh x:collection1 oasc.SolrCore.<init> [[collection1] ] Opening new SolrCore at [/usr/home/jenkins/jenkins-slave/workspace/Lucene-Solr-Tests-5.x-Java7/solr/build/solr-core/test/J0/temp/solr.cloud.HttpPartitionTest AD424071B5FE79DD-001/control-001/cores/collection1/], dataDir=[null]
   [junit4]   2> 110570 T313 n:127.0.0.1:32120_vvh x:collection1 oasc.JmxMonitoredMap.<init> JMX monitoring is enabled. Adding Solr mbeans to JMX Server: com.sun.jmx.mbeanserver.JmxMBeanServer@533aaf33
   [junit4]   2> 110571 T313 n:127.0.0.1:32120_vvh x:collection1 oasc.CachingDirectoryFactory.get return new directory for /usr/home/jenkins/jenkins-slave/workspace/Lucene-Solr-Tests-5.x-Java7/solr/build/solr-core/test/J0/temp/solr.cloud.HttpPartitionTest AD424071B5FE79DD-001/control-001/cores/collection1/data
   [junit4]   2> 110572 T313 n:127.0.0.1:32120_vvh x:collection1 oasc.SolrCore.getNewIndexDir New index directory detected: old=null new=/usr/home/jenkins/jenkins-slave/workspace/Lucene-Solr-Tests-5.x-Java7/solr/build/solr-core/test/J0/temp/solr.cloud.HttpPartitionTest AD424071B5FE79DD-001/control-001/cores/collection1/data/index/
   [junit4]   2> 110572 T313 n:127.0.0.1:32120_vvh x:collection1 oasc.SolrCore.initIndex WARN [collection1] Solr index directory '/usr/home/jenkins/jenkins-slave/workspace/Lucene-Solr-Tests-5.x-Java7/solr/build/solr-core/test/J0/temp/solr.cloud.HttpPartitionTest AD424071B5FE79DD-001/control-001/cores/collection1/data/index' doesn't exist. Creating new index...
   [junit4]   2> 110572 T313 n:127.0.0.1:32120_vvh x:collection1 oasc.CachingDirectoryFactory.get return new directory for /usr/home/jenkins/jenkins-slave/workspace/Lucene-Solr-Tests-5.x-Java7/solr/build/solr-core/test/J0/temp/solr.cloud.HttpPartitionTest AD424071B5FE79DD-001/control-001/cores/collection1/data/index
   [junit4]   2> 110573 T313 n:127.0.0.1:32120_vvh x:collection1 oasu.RandomMergePolicy.<init> RandomMergePolicy wrapping class org.apache.lucene.index.TieredMergePolicy: [TieredMergePolicy: maxMergeAtOnce=31, maxMergeAtOnceExplicit=23, maxMergedSegmentMB=49.2578125, floorSegmentMB=1.2578125, forceMergeDeletesPctAllowed=3.2819756474184003, segmentsPerTier=21.0, maxCFSSegmentSizeMB=8.796093022207999E12, noCFSRatio=1.0
   [junit4]   2> 110574 T313 n:127.0.0.1:32120_vvh x:collection1 oasc.SolrDeletionPolicy.onCommit SolrDeletionPolicy.onCommit: commits: num=1
   [junit4]   2> 		commit{dir=MockDirectoryWrapper(RAMDirectory@3c611cc9 lockFactory=org.apache.lucene.store.SingleInstanceLockFactory@ba8ef17),segFN=segments_1,generation=1}
   [junit4]   2> 110574 T313 n:127.0.0.1:32120_vvh x:collection1 oasc.SolrDeletionPolicy.updateCommits newest commit generation = 1
   [junit4]   2> 110580 T313 n:127.0.0.1:32120_vvh x:collection1 oasup.UpdateRequestProcessorChain.init creating updateRequestProcessorChain "nodistrib"
   [junit4]   2> 110581 T313 n:127.0.0.1:32120_vvh x:collection1 oasup.UpdateRequestProcessorChain.init creating updateRequestProcessorChain "dedupe"
   [junit4]   2> 110581 T313 n:127.0.0.1:32120_vvh x:collection1 oasup.UpdateRequestProcessorChain.init inserting DistributedUpdateProcessorFactory into updateRequestProcessorChain "dedupe"
   [junit4]   2> 110581 T313 n:127.0.0.1:32120_vvh x:collection1 oasup.UpdateRequestProcessorChain.init creating updateRequestProcessorChain "stored_sig"
   [junit4]   2> 110582 T313 n:127.0.0.1:32120_vvh x:collection1 oasup.UpdateRequestProcessorChain.init inserting DistributedUpdateProcessorFactory into updateRequestProcessorChain "stored_sig"
   [junit4]   2> 110582 T313 n:127.0.0.1:32120_vvh x:collection1 oasup.UpdateRequestProcessorChain.init creating updateRequestProcessorChain "distrib-dup-test-chain-explicit"
   [junit4]   2> 110583 T313 n:127.0.0.1:32120_vvh x:collection1 oasup.UpdateRequestProcessorChain.init creating updateRequestProcessorChain "distrib-dup-test-chain-implicit"
   [junit4]   2> 110583 T313 n:127.0.0.1:32120_vvh x:collection1 oasup.UpdateRequestProcessorChain.init inserting DistributedUpdateProcessorFactory into updateRequestProcessorChain "distrib-dup-test-chain-implicit"
   [junit4]   2> 110583 T313 n:127.0.0.1:32120_vvh x:collection1 oasc.SolrCore.loadUpdateProcessorChains no updateRequestProcessorChain defined as default, creating implicit default
   [junit4]   2> 110596 T313 n:127.0.0.1:32120_vvh x:collection1 oashl.XMLLoader.init xsltCacheLifetimeSeconds=60
   [junit4]   2> 110598 T313 n:127.0.0.1:32120_vvh x:collection1 oashl.XMLLoader.init xsltCacheLifetimeSeconds=60
   [junit4]   2> 110600 T313 n:127.0.0.1:32120_vvh x:collection1 oashl.XMLLoader.init xsltCacheLifetimeSeconds=60
   [junit4]   2> 110602 T313 n:127.0.0.1:32120_vvh x:collection1 oashl.XMLLoader.init xsltCacheLifetimeSeconds=60
   [junit4]   2> 110608 T313 n:127.0.0.1:32120_vvh x:collection1 oasc.RequestHandlers.initHandlersFromConfig Registered paths: /admin/logging,/update/csv,/replication,/config,/admin/ping,standard,/admin/mbeans,/get,/admin/luke,/admin/properties,/update/json/docs,/schema,/admin/segments,/update,/admin/threads,/admin/file,/admin/system,/update/json,/admin/plugins
   [junit4]   2> 110610 T313 n:127.0.0.1:32120_vvh x:collection1 oasc.SolrCore.initStatsCache Using default statsCache cache: org.apache.solr.search.stats.LocalStatsCache
   [junit4]   2> 110611 T313 n:127.0.0.1:32120_vvh x:collection1 oasu.UpdateHandler.<init> Using UpdateLog implementation: org.apache.solr.update.UpdateLog
   [junit4]   2> 110612 T313 n:127.0.0.1:32120_vvh x:collection1 oasu.UpdateLog.init Initializing UpdateLog: dataDir= defaultSyncLevel=FLUSH numRecordsToKeep=100 maxNumLogsToKeep=10
   [junit4]   2> 110613 T313 n:127.0.0.1:32120_vvh x:collection1 oasu.CommitTracker.<init> Hard AutoCommit: disabled
   [junit4]   2> 110613 T313 n:127.0.0.1:32120_vvh x:collection1 oasu.CommitTracker.<init> Soft AutoCommit: disabled
   [junit4]   2> 110614 T313 n:127.0.0.1:32120_vvh x:collection1 oasu.RandomMergePolicy.<init> RandomMergePolicy wrapping class org.apache.lucene.index.TieredMergePolicy: [TieredMergePolicy: maxMergeAtOnce=21, maxMergeAtOnceExplicit=15, maxMergedSegmentMB=0.8818359375, floorSegmentMB=0.611328125, forceMergeDeletesPctAllowed=9.08334638439022, segmentsPerTier=46.0, maxCFSSegmentSizeMB=8.796093022207999E12, noCFSRatio=0.7534627868006927
   [junit4]   2> 110614 T313 n:127.0.0.1:32120_vvh x:collection1 oasc.SolrDeletionPolicy.onInit SolrDeletionPolicy.onInit: commits: num=1
   [junit4]   2> 		commit{dir=MockDirectoryWrapper(RAMDirectory@3c611cc9 lockFactory=org.apache.lucene.store.SingleInstanceLockFactory@ba8ef17),segFN=segments_1,generation=1}
   [junit4]   2> 110615 T313 n:127.0.0.1:32120_vvh x:collection1 oasc.SolrDeletionPolicy.updateCommits newest commit generation = 1
   [junit4]   2> 110616 T313 n:127.0.0.1:32120_vvh x:collection1 oass.SolrIndexSearcher.<init> Opening Searcher@6bb6e7d[collection1] main
   [junit4]   2> 110617 T313 n:127.0.0.1:32120_vvh x:collection1 oascc.ZkStateReader.readConfigName Load collection config from:/collections/control_collection
   [junit4]   2> 110618 T313 n:127.0.0.1:32120_vvh x:collection1 oascc.ZkStateReader.readConfigName path=/collections/control_collection configName=conf1 specified config exists in ZooKeeper
   [junit4]   2> 110618 T313 n:127.0.0.1:32120_vvh x:collection1 oasr.ManagedResourceStorage.newStorageIO Setting up ZooKeeper-based storage for the RestManager with znodeBase: /configs/conf1
   [junit4]   2> 110618 T313 n:127.0.0.1:32120_vvh x:collection1 oasr.ManagedResourceStorage$ZooKeeperStorageIO.configure Configured ZooKeeperStorageIO with znodeBase: /configs/conf1
   [junit4]   2> 110619 T313 n:127.0.0.1:32120_vvh x:collection1 oasr.RestManager.init Initializing RestManager with initArgs: {}
   [junit4]   2> 110619 T313 n:127.0.0.1:32120_vvh x:collection1 oasr.ManagedResourceStorage.load Reading _rest_managed.json using ZooKeeperStorageIO:path=/configs/conf1
   [junit4]   2> 110620 T313 n:127.0.0.1:32120_vvh x:collection1 oasr.ManagedResourceStorage$ZooKeeperStorageIO.openInputStream No data found for znode /configs/conf1/_rest_managed.json
   [junit4]   2> 110620 T313 n:127.0.0.1:32120_vvh x:collection1 oasr.ManagedResourceStorage.load Loaded null at path _rest_managed.json using ZooKeeperStorageIO:path=/configs/conf1
   [junit4]   2> 110620 T313 n:127.0.0.1:32120_vvh x:collection1 oasr.RestManager.init Initializing 0 registered ManagedResources
   [junit4]   2> 110620 T313 n:127.0.0.1:32120_vvh x:collection1 oash.ReplicationHandler.inform Commits will be reserved for  10000
   [junit4]   2> 110621 T313 n:127.0.0.1:32120_vvh x:collection1 oasc.ZkController.getConfDirListeners watch zkdir /configs/conf1
   [junit4]   2> 110622 T314 n:127.0.0.1:32120_vvh x:collection1 oasc.SolrCore.registerSearcher [collection1] Registered new searcher Searcher@6bb6e7d[collection1] main{ExitableDirectoryReader(UninvertingDirectoryReader())}
   [junit4]   2> 110622 T313 n:127.0.0.1:32120_vvh x:collection1 oasc.CoreContainer.registerCore registering core: collection1
   [junit4]   2> 110623 T317 n:127.0.0.1:32120_vvh c:control_collection s:shard1 x:collection1 oasc.ZkController.register Register replica - core:collection1 address:http://127.0.0.1:32120/vvh collection:control_collection shard:shard1
   [junit4]   2> 110624 T281 n:127.0.0.1:32120_vvh oass.SolrDispatchFilter.init user.dir=/usr/home/jenkins/jenkins-slave/workspace/Lucene-Solr-Tests-5.x-Java7/solr/build/solr-core/test/J0
   [junit4]   2> 110625 T281 n:127.0.0.1:32120_vvh oass.SolrDispatchFilter.init SolrDispatchFilter.init() done
   [junit4]   2> 110625 T317 n:127.0.0.1:32120_vvh c:control_collection s:shard1 x:collection1 oascc.SolrZkClient.makePath makePath: /collections/control_collection/leader_elect/shard1/election
   [junit4]   2> 110631 T281 oascc.SolrZkClient.createZkCredentialsToAddAutomatically Using default ZkCredentialsProvider
   [junit4]   2> 110632 T281 oascc.ConnectionManager.waitForConnected Waiting for client to connect to ZooKeeper
   [junit4]   2> 110692 T321 oascc.ConnectionManager.process Watcher org.apache.solr.common.cloud.ConnectionManager@4e3fbce1 name:ZooKeeperConnection Watcher:127.0.0.1:32117/solr got event WatchedEvent state:SyncConnected type:None path:null path:null type:None
   [junit4]   2> 110692 T281 oascc.ConnectionManager.waitForConnected Client is connected to ZooKeeper
   [junit4]   2> 110694 T281 oascc.SolrZkClient.createZkACLProvider Using default ZkACLProvider
   [junit4]   2> 110694 T281 oascc.ZkStateReader.createClusterStateWatchersAndUpdate Updating cluster state from ZooKeeper... 
   [junit4]   2> 110694 T317 n:127.0.0.1:32120_vvh c:control_collection s:shard1 x:collection1 oasc.ShardLeaderElectionContext.runLeaderProcess Running the leader process for shard shard1
   [junit4]   2> 110696 T309 n:127.0.0.1:32120_vvh oasc.DistributedQueue$LatchWatcher.process NodeChildrenChanged fired on path /overseer/queue state SyncConnected
   [junit4]   2> 110697 T317 n:127.0.0.1:32120_vvh c:control_collection s:shard1 x:collection1 oasc.ShardLeaderElectionContext.waitForReplicasToComeUp Enough replicas found to continue.
   [junit4]   2> 110697 T317 n:127.0.0.1:32120_vvh c:control_collection s:shard1 x:collection1 oasc.ShardLeaderElectionContext.runLeaderProcess I may be the new leader - try and sync
   [junit4]   2> ASYNC  NEW_CORE C19 name=collection1 org.apache.solr.core.SolrCore@4451a8ea url=http://127.0.0.1:32120/vvh/collection1 node=127.0.0.1:32120_vvh C19_STATE=coll:control_collection core:collection1 props:{state=down, node_name=127.0.0.1:32120_vvh, core=collection1, base_url=http://127.0.0.1:32120/vvh}
   [junit4]   2> 110697 T317 n:127.0.0.1:32120_vvh c:control_collection s:shard1 x:collection1 C19 oasc.SyncStrategy.sync Sync replicas to http://127.0.0.1:32120/vvh/collection1/
   [junit4]   2> 110697 T310 n:127.0.0.1:32120_vvh oasc.Overseer$ClusterStateUpdater.run processMessage: queueSize: 1, message = {
   [junit4]   2> 	  "operation":"leader",
   [junit4]   2> 	  "shard":"shard1",
   [junit4]   2> 	  "collection":"control_collection"} current state version: 1
   [junit4]   2> 110698 T281 oasc.ChaosMonkey.monkeyLog monkey: init - expire sessions:false cause connection loss:false
   [junit4]   2> 110698 T317 n:127.0.0.1:32120_vvh c:control_collection s:shard1 x:collection1 C19 oasc.SyncStrategy.syncReplicas Sync Success - now sync replicas to me
   [junit4]   2> 110699 T281 oasc.AbstractFullDistribZkTestBase.createJettys Creating collection1 with stateFormat=2
   [junit4]   2> 110699 T317 n:127.0.0.1:32120_vvh c:control_collection s:shard1 x:collection1 C19 oasc.SyncStrategy.syncToMe http://127.0.0.1:32120/vvh/collection1/ has no replicas
   [junit4]   2> 110700 T309 n:127.0.0.1:32120_vvh oascc.ZkStateReader$2.process A cluster state change: WatchedEvent state:SyncConnected type:NodeDataChanged path:/clusterstate.json, has occurred - updating... (live nodes size: 1)
   [junit4]   2> 110700 T321 oascc.ZkStateReader$2.process A cluster state change: WatchedEvent state:SyncConnected type:NodeDataChanged path:/clusterstate.json, has occurred - updating... (live nodes size: 1)
   [junit4]   2> 110700 T281 oascc.SolrZkClient.createZkCredentialsToAddAutomatically Using default ZkCredentialsProvider
   [junit4]   2> 110700 T317 n:127.0.0.1:32120_vvh c:control_collection s:shard1 x:collection1 oasc.ShardLeaderElectionContext.runLeaderProcess I am the new leader: http://127.0.0.1:32120/vvh/collection1/ shard1
   [junit4]   2> 110702 T281 oascc.ConnectionManager.waitForConnected Waiting for client to connect to ZooKeeper
   [junit4]   2> 110702 T317 n:127.0.0.1:32120_vvh c:control_collection s:shard1 x:collection1 oascc.SolrZkClient.makePath makePath: /collections/control_collection/leaders/shard1
   [junit4]   2> 110704 T324 oascc.ConnectionManager.process Watcher org.apache.solr.common.cloud.ConnectionManager@53323815 name:ZooKeeperConnection Watcher:127.0.0.1:32117/solr got event WatchedEvent state:SyncConnected type:None path:null path:null type:None
   [junit4]   2> 110704 T281 oascc.ConnectionManager.waitForConnected Client is connected to ZooKeeper
   [junit4]   2> 110705 T281 oascc.SolrZkClient.createZkACLProvider Using default ZkACLProvider
   [junit4]   2> 110708 T309 n:127.0.0.1:32120_vvh oasc.DistributedQueue$LatchWatcher.process NodeChildrenChanged fired on path /overseer/queue state SyncConnected
   [junit4]   2> 110709 T310 n:127.0.0.1:32120_vvh oasc.Overseer$ClusterStateUpdater.run processMessage: queueSize: 2, message = {
   [junit4]   2> 	  "operation":"create",
   [junit4]   2> 	  "name":"collection1",
   [junit4]   2> 	  "numShards":"2",
   [junit4]   2> 	  "stateFormat":"2"} current state version: 2
   [junit4]   2> 110710 T310 n:127.0.0.1:32120_vvh oasco.ClusterStateMutator.createCollection building a new cName: collection1
   [junit4]   2> 110713 T310 n:127.0.0.1:32120_vvh oasc.Overseer$ClusterStateUpdater.run processMessage: queueSize: 1, message = {
   [junit4]   2> 	  "operation":"leader",
   [junit4]   2> 	  "shard":"shard1",
   [junit4]   2> 	  "collection":"control_collection",
   [junit4]   2> 	  "base_url":"http://127.0.0.1:32120/vvh",
   [junit4]   2> 	  "core":"collection1",
   [junit4]   2> 	  "state":"active"} current state version: 2
   [junit4]   2> 110715 T310 n:127.0.0.1:32120_vvh oasco.ZkStateWriter.writePendingUpdates going to create_collection /collections/collection1/state.json
   [junit4]   2> 110716 T321 oascc.ZkStateReader$2.process A cluster state change: WatchedEvent state:SyncConnected type:NodeDataChanged path:/clusterstate.json, has occurred - updating... (live nodes size: 1)
   [junit4]   2> 110716 T309 n:127.0.0.1:32120_vvh oascc.ZkStateReader$2.process A cluster state change: WatchedEvent state:SyncConnected type:NodeDataChanged path:/clusterstate.json, has occurred - updating... (live nodes size: 1)
   [junit4]   2> 110719 T309 n:127.0.0.1:32120_vvh oasc.DistributedQueue$LatchWatcher.process NodeChildrenChanged fired on path /overseer/queue state SyncConnected
   [junit4]   2> 110720 T309 n:127.0.0.1:32120_vvh oascc.ZkStateReader$2.process A cluster state change: WatchedEvent state:SyncConnected type:NodeDataChanged path:/clusterstate.json, has occurred - updating... (live nodes size: 1)
   [junit4]   2> 110720 T321 oascc.ZkStateReader$2.process A cluster state change: WatchedEvent state:SyncConnected type:NodeDataChanged path:/clusterstate.json, has occurred - updating... (live nodes size: 1)
   [junit4]   2> 110760 T317 n:127.0.0.1:32120_vvh c:control_collection s:shard1 x:collection1 oasc.ZkController.register We are http://127.0.0.1:32120/vvh/collection1/ and leader is http://127.0.0.1:32120/vvh/collection1/
   [junit4]   2> 110761 T317 n:127.0.0.1:32120_vvh c:control_collection s:shard1 x:collection1 oasc.ZkController.register No LogReplay needed for core=collection1 baseURL=http://127.0.0.1:32120/vvh
   [junit4]   2> 110761 T317 n:127.0.0.1:32120_vvh c:control_collection s:shard1 x:collection1 oasc.ZkController.checkRecovery I am the leader, no recovery necessary
   [junit4]   2> 110761 T317 n:127.0.0.1:32120_vvh c:control_collection s:shard1 x:collection1 oasc.ZkController.publish publishing core=collection1 state=active collection=control_collection
   [junit4]   2> 110762 T317 n:127.0.0.1:32120_vvh c:control_collection s:shard1 x:collection1 oasc.ZkController.publish numShards not found on descriptor - reading it from system property
   [junit4]   2> 110763 T309 n:127.0.0.1:32120_vvh oasc.DistributedQueue$LatchWatcher.process NodeChildrenChanged fired on path /overseer/queue state SyncConnected
   [junit4]   2> 110764 T310 n:127.0.0.1:32120_vvh oasc.Overseer$ClusterStateUpdater.run processMessage: queueSize: 1, message = {
   [junit4]   2> 	  "roles":null,
   [junit4]   2> 	  "state":"active",
   [junit4]   2> 	  "node_name":"127.0.0.1:32120_vvh",
   [junit4]   2> 	  "operation":"state",
   [junit4]   2> 	  "numShards":"2",
   [junit4]   2> 	  "core":"collection1",
   [junit4]   2> 	  "core_node_name":"core_node1",
   [junit4]   2> 	  "collection":"control_collection",
   [junit4]   2> 	  "shard":"shard1",
   [junit4]   2> 	  "base_url":"http://127.0.0.1:32120/vvh"} current state version: 4
   [junit4]   2> 110764 T310 n:127.0.0.1:32120_vvh oasco.ReplicaMutator.updateState Update state numShards=2 message={
   [junit4]   2> 	  "roles":null,
   [junit4]   2> 	  "state":"active",
   [junit4]   2> 	  "node_name":"127.0.0.1:32120_vvh",
   [junit4]   2> 	  "operation":"state",
   [junit4]   2> 	  "numShards":"2",
   [junit4]   2> 	  "core":"collection1",
   [junit4]   2> 	  "core_node_name":"core_node1",
   [junit4]   2> 	  "collection":"control_collection",
   [junit4]   2> 	  "shard":"shard1",
   [junit4]   2> 	  "base_url":"http://127.0.0.1:32120/vvh"}
   [junit4]   2> 110868 T309 n:127.0.0.1:32120_vvh oascc.ZkStateReader$2.process A cluster state change: WatchedEvent state:SyncConnected type:NodeDataChanged path:/clusterstate.json, has occurred - updating... (live nodes size: 1)
   [junit4]   2> 110868 T321 oascc.ZkStateReader$2.process A cluster state change: WatchedEvent state:SyncConnected type:NodeDataChanged path:/clusterstate.json, has occurred - updating... (live nodes size: 1)
   [junit4]   2> 112129 T281 oas.SolrTestCaseJ4.writeCoreProperties Writing core.properties file to /usr/home/jenkins/jenkins-slave/workspace/Lucene-Solr-Tests-5.x-Java7/solr/build/solr-core/test/J0/temp/solr.cloud.HttpPartitionTest AD424071B5FE79DD-001/shard-1-001/cores/collection1
   [junit4]   2> 112131 T281 oasc.AbstractFullDistribZkTestBase.createJettys create jetty 1 in directory /usr/home/jenkins/jenkins-slave/workspace/Lucene-Solr-Tests-5.x-Java7/solr/build/solr-core/test/J0/temp/solr.cloud.HttpPartitionTest AD424071B5FE79DD-001/shard-1-001
   [junit4]   2> 112133 T281 oejs.Server.doStart jetty-9.2.10.v20150310
   [junit4]   2> 112135 T281 oejsh.ContextHandler.doStart Started o.e.j.s.ServletContextHandler@4c8c7d66{/vvh,null,AVAILABLE}
   [junit4]   2> 112136 T281 oejs.AbstractConnector.doStart Started ServerConnector@651809bc{HTTP/1.1}{127.0.0.1:32134}
   [junit4]   2> 112136 T281 oejs.Server.doStart Started @117210ms
   [junit4]   2> 112137 T281 oascse.JettySolrRunner$1.lifeCycleStarted Jetty properties: {hostContext=/vvh, solrconfig=solrconfig.xml, solr.data.dir=/usr/home/jenkins/jenkins-slave/workspace/Lucene-Solr-Tests-5.x-Java7/solr/build/solr-core/test/J0/temp/solr.cloud.HttpPartitionTest AD424071B5FE79DD-001/tempDir-001/jetty1, hostPort=32133, coreRootDirectory=/usr/home/jenkins/jenkins-slave/workspace/Lucene-Solr-Tests-5.x-Java7/solr/build/solr-core/test/J0/temp/solr.cloud.HttpPartitionTest AD424071B5FE79DD-001/shard-1-001/cores}
   [junit4]   2> 112137 T281 oass.SolrDispatchFilter.init SolrDispatchFilter.init()sun.misc.Launcher$AppClassLoader@231bf785
   [junit4]   2> 112138 T281 oasc.SolrResourceLoader.<init> new SolrResourceLoader for directory: '/usr/home/jenkins/jenkins-slave/workspace/Lucene-Solr-Tests-5.x-Java7/solr/build/solr-core/test/J0/temp/solr.cloud.HttpPartitionTest AD424071B5FE79DD-001/shard-1-001/'
   [junit4]   2> 112176 T281 oasc.SolrXmlConfig.fromFile Loading container configuration from /usr/home/jenkins/jenkins-slave/workspace/Lucene-Solr-Tests-5.x-Java7/solr/build/solr-core/test/J0/temp/solr.cloud.HttpPartitionTest AD424071B5FE79DD-001/shard-1-001/solr.xml
   [junit4]   2> 112224 T281 oasc.CorePropertiesLocator.<init> Config-defined core root directory: /usr/home/jenkins/jenkins-slave/workspace/Lucene-Solr-Tests-5.x-Java7/solr/build/solr-core/test/J0/temp/solr.cloud.HttpPartitionTest AD424071B5FE79DD-001/shard-1-001/cores
   [junit4]   2> 112225 T281 oasc.CoreContainer.<init> New CoreContainer 1564808407
   [junit4]   2> 112225 T281 oasc.CoreContainer.load Loading cores into CoreContainer [instanceDir=/usr/home/jenkins/jenkins-slave/workspace/Lucene-Solr-Tests-5.x-Java7/solr/build/solr-core/test/J0/temp/solr.cloud.HttpPartitionTest AD424071B5FE79DD-001/shard-1-001/]
   [junit4]   2> 112226 T281 oasc.CoreContainer.load loading shared library: /usr/home/jenkins/jenkins-slave/workspace/Lucene-Solr-Tests-5.x-Java7/solr/build/solr-core/test/J0/temp/solr.cloud.HttpPartitionTest AD424071B5FE79DD-001/shard-1-001/lib
   [junit4]   2> 112227 T281 oasc.SolrResourceLoader.addToClassLoader WARN Can't find (or read) directory to add to classloader: lib (resolved as: /usr/home/jenkins/jenkins-slave/workspace/Lucene-Solr-Tests-5.x-Java7/solr/build/solr-core/test/J0/temp/solr.cloud.HttpPartitionTest AD424071B5FE79DD-001/shard-1-001/lib).
   [junit4]   2> 112239 T281 oashc.HttpShardHandlerFactory.init created with socketTimeout : 90000,urlScheme : ,connTimeout : 15000,maxConnectionsPerHost : 20,maxConnections : 10000,corePoolSize : 0,maximumPoolSize : 2147483647,maxThreadIdleTime : 5,sizeOfQueue : -1,fairnessPolicy : false,useRetries : false,
   [junit4]   2> 112248 T281 oasu.UpdateShardHandler.<init> Creating UpdateShardHandler HTTP client with params: socketTimeout=340000&connTimeout=45000&retry=true
   [junit4]   2> 112249 T281 oasl.LogWatcher.createWatcher SLF4J impl is org.slf4j.impl.Log4jLoggerFactory
   [junit4]   2> 112249 T281 oasl.LogWatcher.newRegisteredLogWatcher Registering Log Listener [Log4j (org.slf4j.impl.Log4jLoggerFactory)]
   [junit4]   2> 112249 T281 oasc.CoreContainer.load Node Name: 127.0.0.1
   [junit4]   2> 112250 T281 oasc.ZkContainer.initZooKeeper Zookeeper client=127.0.0.1:32117/solr
   [junit4]   2> 112250 T281 oasc.ZkController.checkChrootPath zkHost includes chroot
   [junit4]   2> 112250 T281 oascc.SolrZkClient.createZkCredentialsToAddAutomatically Using default ZkCredentialsProvider
   [junit4]   2> 112251 T281 oascc.ConnectionManager.waitForConnected Waiting for client to connect to ZooKeeper
   [junit4]   2> 112253 T338 oascc.ConnectionManager.process Watcher org.apache.solr.common.cloud.ConnectionManager@15cb8771 name:ZooKeeperConnection Watcher:127.0.0.1:32117 got event WatchedEvent state:SyncConnected type:None path:null path:null type:None
   [junit4]   2> 112254 T281 oascc.ConnectionManager.waitForConnected Client is connected to ZooKeeper
   [junit4]   2> 112254 T281 oascc.SolrZkClient.createZkACLProvider Using default ZkACLProvider
   [junit4]   2> 112257 T281 n:127.0.0.1:32133_vvh oascc.ConnectionManager.waitForConnected Waiting for client to connect to ZooKeeper
   [junit4]   2> 112258 T341 n:127.0.0.1:32133_vvh oascc.ConnectionManager.process Watcher org.apache.solr.common.cloud.ConnectionManager@2fc1c575 name:ZooKeeperConnection Watcher:127.0.0.1:32117/solr got event WatchedEvent state:SyncConnected type:None path:null path:null type:None
   [junit4]   2> 112258 T281 n:127.0.0.1:32133_vvh oascc.ConnectionManager.waitForConnected Client is connected to ZooKeeper
   [junit4]   2> 112263 T281 n:127.0.0.1:32133_vvh oascc.ZkStateReader.createClusterStateWatchersAndUpdate Updating cluster state from ZooKeeper... 
   [junit4]   2> 113269 T281 n:127.0.0.1:32133_vvh oasc.ZkController.createEphemeralLiveNode Register node as live in ZooKeeper:/live_nodes/127.0.0.1:32133_vvh
   [junit4]   2> 113270 T281 n:127.0.0.1:32133_vvh oascc.SolrZkClient.makePath makePath: /live_nodes/127.0.0.1:32133_vvh
   [junit4]   2> 113272 T281 n:127.0.0.1:32133_vvh oasc.Overseer.close Overseer (id=null) closing
   [junit4]   2> 113275 T281 n:127.0.0.1:32133_vvh oasc.CorePropertiesLocator.discover Looking for core definitions underneath /usr/home/jenkins/jenkins-slave/workspace/Lucene-Solr-Tests-5.x-Java7/solr/build/solr-core/test/J0/temp/solr.cloud.HttpPartitionTest AD424071B5FE79DD-001/shard-1-001/cores
   [junit4]   2> 113277 T281 n:127.0.0.1:32133_vvh oasc.CoreDescriptor.<init> CORE DESCRIPTOR: {loadOnStartup=true, schema=schema.xml, config=solrconfig.xml, name=collection1, absoluteInstDir=/usr/home/jenkins/jenkins-slave/workspace/Lucene-Solr-Tests-5.x-Java7/solr/build/solr-core/test/J0/temp/solr.cloud.HttpPartitionTest AD424071B5FE79DD-001/shard-1-001/cores/collection1/, transient=false, shard=, coreNodeName=, collection=collection1, dataDir=data/, instanceDir=/usr/home/jenkins/jenkins-slave/workspace/Lucene-Solr-Tests-5.x-Java7/solr/build/solr-core/test/J0/temp/solr.cloud.HttpPartitionTest AD424071B5FE79DD-001/shard-1-001/cores/collection1}
   [junit4]   2> 113278 T281 n:127.0.0.1:32133_vvh oasc.CorePropertiesLocator.discoverUnder Found core collection1 in /usr/home/jenkins/jenkins-slave/workspace/Lucene-Solr-Tests-5.x-Java7/solr/build/solr-core/test/J0/temp/solr.cloud.HttpPartitionTest AD424071B5FE79DD-001/shard-1-001/cores/collection1/
   [junit4]   2> 113278 T281 n:127.0.0.1:32133_vvh oasc.CorePropertiesLocator.discover Found 1 core definitions
   [junit4]   2> 113280 T342 n:127.0.0.1:32133_vvh c:collection1 x:collection1 oasc.ZkController.publish publishing core=collection1 state=down collection=collection1
   [junit4]   2> 113281 T342 n:127.0.0.1:32133_vvh c:collection1 x:collection1 oasc.ZkController.publish numShards not found on descriptor - reading it from system property
   [junit4]   2> 113282 T309 n:127.0.0.1:32120_vvh oasc.DistributedQueue$LatchWatcher.process NodeChildrenChanged fired on path /overseer/queue state SyncConnected
   [junit4]   2> 113283 T342 n:127.0.0.1:32133_vvh oasc.ZkController.preRegister Registering watch for external collection collection1
   [junit4]   2> 113283 T342 n:127.0.0.1:32133_vvh oascc.ZkStateReader.addZkWatch addZkWatch collection1
   [junit4]   2> 113283 T310 n:127.0.0.1:32120_vvh oasc.Overseer$ClusterStateUpdater.run processMessage: queueSize: 1, message = {
   [junit4]   2> 	  "roles":null,
   [junit4]   2> 	  "state":"down",
   [junit4]   2> 	  "node_name":"127.0.0.1:32133_vvh",
   [junit4]   2> 	  "operation":"state",
   [junit4]   2> 	  "numShards":"2",
   [junit4]   2> 	  "core":"collection1",
   [junit4]   2> 	  "collection":"collection1",
   [junit4]   2> 	  "shard":null,
   [junit4]   2> 	  "base_url":"http://127.0.0.1:32133/vvh"} current state version: 5
   [junit4]   2> 113283 T342 n:127.0.0.1:32133_vvh oascc.ZkStateReader.addZkWatch Updating collection state at /collections/collection1/state.json from ZooKeeper... 
   [junit4]   2> 113284 T310 n:127.0.0.1:32120_vvh oasco.ReplicaMutator.updateState Update state numShards=2 message={
   [junit4]   2> 	  "roles":null,
   [junit4]   2> 	  "state":"down",
   [junit4]   2> 	  "node_name":"127.0.0.1:32133_vvh",
   [junit4]   2> 	  "operation":"state",
   [junit4]   2> 	  "numShards":"2",
   [junit4]   2> 	  "core":"collection1",
   [junit4]   2> 	  "collection":"collection1",
   [junit4]   2> 	  "shard":null,
   [junit4]   2> 	  "base_url":"http://127.0.0.1:32133/vvh"}
   [junit4]   2> 113284 T310 n:127.0.0.1:32120_vvh oasco.ReplicaMutator.updateState Collection already exists with numShards=2
   [junit4]   2> 113285 T342 n:127.0.0.1:32133_vvh oascc.ZkStateReader.updateWatchedCollection Updating data for collection1 to ver 0 
   [junit4]   2> 113285 T310 n:127.0.0.1:32120_vvh oasco.ReplicaMutator.updateState Assigning new node to shard shard=shard2
   [junit4]   2> 113285 T342 n:127.0.0.1:32133_vvh oasc.ZkController.waitForCoreNodeName look for our core node name
   [junit4]   2> 113286 T310 n:127.0.0.1:32120_vvh oasco.ZkStateWriter.writePendingUpdates going to update_collection /collections/collection1/state.json version: 0
   [junit4]   2> 113287 T341 n:127.0.0.1:32133_vvh oascc.ZkStateReader$7.process A cluster state change: WatchedEvent state:SyncConnected type:NodeDataChanged path:/collections/collection1/state.json for collection collection1 has occurred - updating... (live nodes size: 2)
   [junit4]   2> 113288 T341 n:127.0.0.1:32133_vvh oascc.ZkStateReader.updateWatchedCollection Updating data for collection1 to ver 1 
   [junit4]   2> 114286 T342 n:127.0.0.1:32133_vvh oasc.ZkController.waitForShardId waiting to find shard id in clusterstate for collection1
   [junit4]   2> 114287 T342 n:127.0.0.1:32133_vvh oasc.ZkController.createCollectionZkNode Check for collection zkNode:collection1
   [junit4]   2> 114288 T342 n:127.0.0.1:32133_vvh oasc.ZkController.createCollectionZkNode Collection zkNode exists
   [junit4]   2> 114288 T342 n:127.0.0.1:32133_vvh oascc.ZkStateReader.readConfigName Load collection config from:/collections/collection1
   [junit4]   2> 114289 T342 n:127.0.0.1:32133_vvh oascc.ZkStateReader.readConfigName path=/collections/collection1 configName=conf1 specified config exists in ZooKeeper
   [junit4]   2> 114289 T342 n:127.0.0.1:32133_vvh oasc.SolrResourceLoader.<init> new SolrResourceLoader for directory: '/usr/home/jenkins/jenkins-slave/workspace/Lucene-Solr-Tests-5.x-Java7/solr/build/solr-core/test/J0/temp/solr.cloud.HttpPartitionTest AD424071B5FE79DD-001/shard-1-001/cores/collection1/'
   [junit4]   2> 114326 T342 n:127.0.0.1:32133_vvh oasc.Config.<init> loaded config solrconfig.xml with version 0 
   [junit4]   2> 114338 T342 n:127.0.0.1:32133_vvh oasc.SolrConfig.refreshRequestParams current version of requestparams : -1
   [junit4]   2> 114359 T342 n:127.0.0.1:32133_vvh oasc.SolrConfig.<init> Using Lucene MatchVersion: 5.2.0
   [junit4]   2> 114403 T342 n:127.0.0.1:32133_vvh oasc.SolrConfig.<init> Loaded SolrConfig: solrconfig.xml
   [junit4]   2> 114405 T342 n:127.0.0.1:32133_vvh oass.IndexSchema.readSchema Reading Solr Schema from /configs/conf1/schema.xml
   [junit4]   2> 114418 T342 n:127.0.0.1:32133_vvh oass.IndexSchema.readSchema [collection1] Schema name=test
   [junit4]   2> 115096 T342 n:127.0.0.1:32133_vvh oass.OpenExchangeRatesOrgProvider.init Initialized with rates=open-exchange-rates.json, refreshInterval=1440.
   [junit4]   2> 115111 T342 n:127.0.0.1:32133_vvh oass.IndexSchema.readSchema default search field in schema is text
   [junit4]   2> 115115 T342 n:127.0.0.1:32133_vvh oass.IndexSchema.readSchema unique key field: id
   [junit4]   2> 115134 T342 n:127.0.0.1:32133_vvh oass.FileExchangeRateProvider.reload Reloading exchange rates from file currency.xml
   [junit4]   2> 115139 T342 n:127.0.0.1:32133_vvh oass.FileExchangeRateProvider.reload Reloading exchange rates from file currency.xml
   [junit4]   2> 115142 T342 n:127.0.0.1:32133_vvh oass.OpenExchangeRatesOrgProvider.reload Reloading exchange rates from open-exchange-rates.json
   [junit4]   2> 115143 T342 n:127.0.0.1:32133_vvh oass.OpenExchangeRatesOrgProvider$OpenExchangeRates.<init> WARN Unknown key IMPORTANT NOTE
   [junit4]   2> 115144 T342 n:127.0.0.1:32133_vvh oass.OpenExchangeRatesOrgProvider$OpenExchangeRates.<init> WARN Expected key, got STRING
   [junit4]   2> 115144 T342 n:127.0.0.1:32133_vvh oass.OpenExchangeRatesOrgProvider.reload Reloading exchange rates from open-exchange-rates.json
   [junit4]   2> 115145 T342 n:127.0.0.1:32133_vvh oass.OpenExchangeRatesOrgProvider$OpenExchangeRates.<init> WARN Unknown key IMPORTANT NOTE
   [junit4]   2> 115145 T342 n:127.0.0.1:32133_vvh oass.OpenExchangeRatesOrgProvider$OpenExchangeRates.<init> WARN Expected key, got STRING
   [junit4]   2> 115145 T342 n:127.0.0.1:32133_vvh oasc.CoreContainer.create Creating SolrCore 'collection1' using configuration from collection collection1
   [junit4]   2> 115145 T342 n:127.0.0.1:32133_vvh x:collection1 oasc.SolrCore.initDirectoryFactory org.apache.solr.core.MockDirectoryFactory
   [junit4]   2> 115146 T342 n:127.0.0.1:32133_vvh x:collection1 oasc.SolrCore.<init> [[collection1] ] Opening new SolrCore at [/usr/home/jenkins/jenkins-slave/workspace/Lucene-Solr-Tests-5.x-Java7/solr/build/solr-core/test/J0/temp/solr.cloud.HttpPartitionTest AD424071B5FE79DD-001/shard-1-001/cores/collection1/], dataDir=[null]
   [junit4]   2> 115146 T342 n:127.0.0.1:32133_vvh x:collection1 oasc.JmxMonitoredMap.<init> JMX monitoring is enabled. Adding Solr mbeans to JMX Server: com.sun.jmx.mbeanserver.JmxMBeanServer@533aaf33
   [junit4]   2> 115147 T342 n:127.0.0.1:32133_vvh x:collection1 oasc.CachingDirectoryFactory.get return new directory for /usr/home/jenkins/jenkins-slave/workspace/Lucene-Solr-Tests-5.x-Java7/solr/build/solr-core/test/J0/temp/solr.cloud.HttpPartitionTest AD424071B5FE79DD-001/shard-1-001/cores/collection1/data
   [junit4]   2> 115147 T342 n:127.0.0.1:32133_vvh x:collection1 oasc.SolrCore.getNewIndexDir New index directory detected: old=null new=/usr/home/jenkins/jenkins-slave/workspace/Lucene-Solr-Tests-5.x-Java7/solr/build/solr-core/test/J0/temp/solr.cloud.HttpPartitionTest AD424071B5FE79DD-001/shard-1-001/cores/collection1/data/index/
   [junit4]   2> 115147 T342 n:127.0.0.1:32133_vvh x:collection1 oasc.SolrCore.initIndex WARN [collection1] Solr index directory '/usr/home/jenkins/jenkins-slave/workspace/Lucene-Solr-Tests-5.x-Java7/solr/build/solr-core/test/J0/temp/solr.cloud.HttpPartitionTest AD424071B5FE79DD-001/shard-1-001/cores/collection1/data/index' doesn't exist. Creating new index...
   [junit4]   2> 115148 T342 n:127.0.0.1:32133_vvh x:collection1 oasc.CachingDirectoryFactory.get return new directory for /usr/home/jenkins/jenkins-slave/workspace/Lucene-Solr-Tests-5.x-Java7/solr/build/solr-core/test/J0/temp/solr.cloud.HttpPartitionTest AD424071B5FE79DD-001/shard-1-001/cores/collection1/data/index
   [junit4]   2> 115148 T342 n:127.0.0.1:32133_vvh x:collection1 oasu.RandomMergePolicy.<init> RandomMergePolicy wrapping class org.apache.lucene.index.TieredMergePolicy: [TieredMergePolicy: maxMergeAtOnce=31, maxMergeAtOnceExplicit=23, maxMergedSegmentMB=49.2578125, floorSegmentMB=1.2578125, forceMergeDeletesPctAllowed=3.2819756474184003, segmentsPerTier=21.0, maxCFSSegmentSizeMB=8.796093022207999E12, noCFSRatio=1.0
   [junit4]   2> 115149 T342 n:127.0.0.1:32133_vvh x:collection1 oasc.SolrDeletionPolicy.onCommit SolrDeletionPolicy.onCommit: commits: num=1
   [junit4]   2> 		commit{dir=MockDirectoryWrapper(RAMDirectory@3fc5ba30 lockFactory=org.apache.lucene.store.SingleInstanceLockFactory@4e42c605),segFN=segments_1,generation=1}
   [junit4]   2> 115149 T342 n:127.0.0.1:32133_vvh x:collection1 oasc.SolrDeletionPolicy.updateCommits newest commit generation = 1
   [junit4]   2> 115157 T342 n:127.0.0.1:32133_vvh x:collection1 oasup.UpdateRequestProcessorChain.init creating updateRequestProcessorChain "nodistrib"
   [junit4]   2> 115157 T342 n:127.0.0.1:32133_vvh x:collection1 oasup.UpdateRequestProcessorChain.init creating updateRequestProcessorChain "dedupe"
   [junit4]   2> 115157 T342 n:127.0.0.1:32133_vvh x:collection1 oasup.UpdateRequestProcessorChain.init inserting DistributedUpdateProcessorFactory into updateRequestProcessorChain "dedupe"
   [junit4]   2> 115158 T342 n:127.0.0.1:32133_vvh x:collection1 oasup.UpdateRequestProcessorChain.init creating updateRequestProcessorChain "stored_sig"
   [junit4]   2> 115158 T342 n:127.0.0.1:32133_vvh x:collection1 oasup.UpdateRequestProcessorChain.init inserting DistributedUpdateProcessorFactory into updateRequestProcessorChain "stored_sig"
   [junit4]   2> 115158 T342 n:127.0.0.1:32133_vvh x:collection1 oasup.UpdateRequestProcessorChain.init creating updateRequestProcessorChain "distrib-dup-test-chain-explicit"
   [junit4]   2> 115159 T342 n:127.0.0.1:32133_vvh x:collection1 oasup.UpdateRequestProcessorChain.init creating updateRequestProcessorChain "distrib-dup-test-chain-implicit"
   [junit4]   2> 115159 T342 n:127.0.0.1:32133_vvh x:collection1 oasup.UpdateRequestProcessorChain.init inserting DistributedUpdateProcessorFactory into updateRequestProcessorChain "distrib-dup-test-chain-implicit"
   [junit4]   2> 115159 T342 n:127.0.0.1:32133_vvh x:collection1 oasc.SolrCore.loadUpdateProcessorChains no updateRequestProcessorChain defined as default, creating implicit default
   [junit4]   2> 115181 T342 n:127.0.0.1:32133_vvh x:collection1 oashl.XMLLoader.init xsltCacheLifetimeSeconds=60
   [junit4]   2> 115184 T342 n:127.0.0.1:32133_vvh x:collection1 oashl.XMLLoader.init xsltCacheLifetimeSeconds=60
   [junit4]   2> 115188 T342 n:127.0.0.1:32133_vvh x:collection1 oashl.XMLLoader.init xsltCacheLifetimeSeconds=60
   [junit4]   2> 115190 T342 n:127.0.0.1:32133_vvh x:collection1 oashl.XMLLoader.init xsltCacheLifetimeSeconds=60
   [junit4]   2> 115198 T342 n:127.0.0.1:32133_vvh x:collection1 oasc.RequestHandlers.initHandlersFromConfig Registered paths: /admin/logging,/update/csv,/replication,/config,/admin/ping,standard,/admin/mbeans,/get,/admin/luke,/admin/properties,/update/json/docs,/schema,/admin/segments,/update,/admin/threads,/admin/file,/admin/system,/update/json,/admin/plugins
   [junit4]   2> 115200 T342 n:127.0.0.1:32133_vvh x:collection1 oasc.SolrCore.initStatsCache Using default statsCache cache: org.apache.solr.search.stats.LocalStatsCache
   [junit4]   2> 115202 T342 n:127.0.0.1:32133_vvh x:collection1 oasu.UpdateHandler.<init> Using UpdateLog implementation: org.apache.solr.update.UpdateLog
   [junit4]   2> 115202 T342 n:127.0.0.1:32133_vvh x:collection1 oasu.UpdateLog.init Initializing UpdateLog: dataDir= defaultSyncLevel=FLUSH numRecordsToKeep=100 maxNumLogsToKeep=10
   [junit4]   2> 115203 T342 n:127.0.0.1:32133_vvh x:collection1 oasu.CommitTracker.<init> Hard AutoCommit: disabled
   [junit4]   2> 115203 T342 n:127.0.0.1:32133_vvh x:collection1 oasu.CommitTracker.<init> Soft AutoCommit: disabled
   [junit4]   2> 115204 T342 n:127.0.0.1:32133_vvh x:collection1 oasu.RandomMergePolicy.<init> RandomMergePolicy wrapping class org.apache.lucene.index.TieredMergePolicy: [TieredMergePolicy: maxMergeAtOnce=21, maxMergeAtOnceExplicit=15, maxMergedSegmentMB=0.8818359375, floorSegmentMB=0.611328125, forceMergeDeletesPctAllowed=9.08334638439022, segmentsPerTier=46.0, maxCFSSegmentSizeMB=8.796093022207999E12, noCFSRatio=0.7534627868006927
   [junit4]   2> 115205 T342 n:127.0.0.1:32133_vvh x:collection1 oasc.SolrDeletionPolicy.onInit SolrDeletionPolicy.onInit: commits: num=1
   [junit4]   2> 		commit{dir=MockDirectoryWrapper(RAMDirectory@3fc5ba30 lockFactory=org.apache.lucene.store.SingleInstanceLockFactory@4e42c605),segFN=segments_1,generation=1}
   [junit4]   2> 115205 T342 n:127.0.0.1:32133_vvh x:collection1 oasc.SolrDeletionPolicy.updateCommits newest commit generation = 1
   [junit4]   2> 115206 T342 n:127.0.0.1:32133_vvh x:collection1 oass.SolrIndexSearcher.<init> Opening Searcher@46f95348[collection1] main
   [junit4]   2> 115206 T342 n:127.0.0.1:32133_vvh x:collection1 oascc.ZkStateReader.readConfigName Load collection config from:/collections/collection1
   [junit4]   2> 115207 T342 n:127.0.0.1:32133_vvh x:collection1 oascc.ZkStateReader.readConfigName path=/collections/collection1 configName=conf1 specified config exists in ZooKeeper
   [junit4]   2> 115208 T342 n:127.0.0.1:32133_vvh x:collection1 oasr.ManagedResourceStorage.newStorageIO Setting up ZooKeeper-based storage for the RestManager with znodeBase: /configs/conf1
   [junit4]   2> 115208 T342 n:127.0.0.1:32133_vvh x:collection1 oasr.ManagedResourceStorage$ZooKeeperStorageIO.configure Configured ZooKeeperStorageIO with znodeBase: /configs/conf1
   [junit4]   2> 115208 T342 n:127.0.0.1:32133_vvh x:collection1 oasr.RestManager.init Initializing RestManager with initArgs: {}
   [junit4]   2> 115209 T342 n:127.0.0.1:32133_vvh x:collection1 oasr.ManagedResourceStorage.load Reading _rest_managed.json using ZooKeeperStorageIO:path=/configs/conf1
   [junit4]   2> 115209 T342 n:127.0.0.1:32133_vvh x:collection1 oasr.ManagedResourceStorage$ZooKeeperStorageIO.openInputStream No data found for znode /configs/conf1/_rest_managed.json
   [junit4]   2> 115210 T342 n:127.0.0.1:32133_vvh x:collection1 oasr.ManagedResourceStorage.load Loaded null at path _rest_managed.json using ZooKeeperStorageIO:path=/configs/conf1
   [junit4]   2> 115210 T342 n:127.0.0.1:32133_vvh x:collection1 oasr.RestManager.init Initializing 0 registered ManagedResources
   [junit4]   2> 115210 T342 n:127.0.0.1:32133_vvh x:collection1 oash.ReplicationHandler.inform Commits will be reserved for  10000
   [junit4]   2> 115211 T343 n:127.0.0.1:32133_vvh x:collection1 oasc.SolrCore.registerSearcher [collection1] Registered new searcher Searcher@46f95348[collection1] main{ExitableDirectoryReader(UninvertingDirectoryReader())}
   [junit4]   2> 115212 T342 n:127.0.0.1:32133_vvh x:collection1 oasc.ZkController.getConfDirListeners watch zkdir /configs/conf1
   [junit4]   2> 115213 T342 n:127.0.0.1:32133_vvh x:collection1 oasc.CoreContainer.registerCore registering core: collection1
   [junit4]   2> 115214 T346 n:127.0.0.1:32133_vvh c:collection1 s:shard2 x:collection1 oasc.ZkController.register Register replica - core:collection1 address:http://127.0.0.1:32133/vvh collection:collection1 shard:shard2
   [junit4]   2> 115214 T281 n:127.0.0.1:32133_vvh oass.SolrDispatchFilter.init user.dir=/usr/home/jenkins/jenkins-slave/workspace/Lucene-Solr-Tests-5.x-Java7/solr/build/solr-core/test/J0
   [junit4]   2> 115215 T346 n:127.0.0.1:32133_vvh c:collection1 s:shard2 x:collection1 oascc.SolrZkClient.makePath makePath: /collections/collection1/leader_elect/shard2/election
   [junit4]   2> 115215 T281 n:127.0.0.1:32133_vvh oass.SolrDispatchFilter.init SolrDispatchFilter.init() done
   [junit4]   2> 115219 T346 n:127.0.0.1:32133_vvh c:collection1 s:shard2 x:collection1 oasc.ShardLeaderElectionContext.runLeaderProcess Running the leader process for shard shard2
   [junit4]   2> 115221 T309 n:127.0.0.1:32120_vvh oasc.DistributedQueue$LatchWatcher.process NodeChildrenChanged fired on path /overseer/queue state SyncConnected
   [junit4]   2> 115221 T346 n:127.0.0.1:32133_vvh c:collection1 s:shard2 x:collection1 oasc.ShardLeaderElectionContext.waitForReplicasToComeUp Enough replicas found to continue.
   [junit4]   2> 115221 T346 n:127.0.0.1:32133_vvh c:collection1 s:shard2 x:collection1 oasc.ShardLeaderElectionContext.runLeaderProcess I may be the new leader - try and sync
   [junit4]   2> ASYNC  NEW_CORE C20 name=collection1 org.apache.solr.core.SolrCore@4caf8c12 url=http://127.0.0.1:32133/vvh/collection1 node=127.0.0.1:32133_vvh C20_STATE=coll:collection1 core:collection1 props:{state=down, node_name=127.0.0.1:32133_vvh, core=collection1, base_url=http://127.0.0.1:32133/vvh}
   [junit4]   2> 115222 T346 n:127.0.0.1:32133_vvh c:collection1 s:shard2 x:collection1 C20 oasc.SyncStrategy.sync Sync replicas to http://127.0.0.1:32133/vvh/collection1/
   [junit4]   2> 115222 T310 n:127.0.0.1:32120_vvh oasc.Overseer$ClusterStateUpdater.run processMessage: queueSize: 1, message = {
   [junit4]   2> 	  "operation":"leader",
   [junit4]   2> 	  "shard":"shard2",
   [junit4]   2> 	  "collection":"collection1"} current state version: 5
   [junit4]   2> 115222 T346 n:127.0.0.1:32133_vvh c:collection1 s:shard2 x:collection1 C20 oasc.SyncStrategy.syncReplicas Sync Success - now sync replicas to me
   [junit4]   2> 115223 T346 n:127.0.0.1:32133_vvh c:collection1 s:shard2 x:collection1 C20 oasc.SyncStrategy.syncToMe http://127.0.0.1:32133/vvh/collection1/ has no replicas
   [junit4]   2> 115223 T346 n:127.0.0.1:32133_vvh c:collection1 s:shard2 x:collection1 oasc.ShardLeaderElectionContext.runLeaderProcess I am the new leader: http://127.0.0.1:32133/vvh/collection1/ shard2
   [junit4]   2> 115223 T346 n:127.0.0.1:32133_vvh c:collection1 s:shard2 x:collection1 oascc.SolrZkClient.makePath makePath: /collections/collection1/leaders/shard2
   [junit4]   2> 115224 T310 n:127.0.0.1:32120_vvh oasco.ZkStateWriter.writePendingUpdates going to update_collection /collections/collection1/state.json version: 1
   [junit4]   2> 115225 T341 n:127.0.0.1:32133_vvh oascc.ZkStateReader$7.process A cluster state change: WatchedEvent state:SyncConnected type:NodeDataChanged path:/collections/collection1/state.json for collection collection1 has occurred - updating... (live nodes size: 2)
   [junit4]   2> 115226 T341 n:127.0.0.1:32133_vvh oascc.ZkStateReader.updateWatchedCollection Updating data for collection1 to ver 2 
   [junit4]   2> 115228 T310 n:127.0.0.1:32120_vvh oasc.Overseer$ClusterStateUpdater.run processMessage: queueSize: 1, message = {
   [junit4]   2> 	  "operation":"leader",
   [junit4]   2> 	  "shard":"shard2",
   [junit4]   2> 	  "collection":"collection1",
   [junit4]   2> 	  "base_url":"http://127.0.0.1:32133/vvh",
   [junit4]   2> 	  "core":"collection1",
   [junit4]   2> 	  "state":"active"} current state version: 5
   [junit4]   2> 115229 T310 n:127.0.0.1:32120_vvh oasco.ZkStateWriter.writePendingUpdates going to update_collection /collections/collection1/state.json version: 2
   [junit4]   2> 115230 T341 n:127.0.0.1:32133_vvh oascc.ZkStateReader$7.process A cluster state change: WatchedEvent state:SyncConnected type:NodeDataChanged path:/collections/collection1/state.json for collection collection1 has occurred - updating... (live nodes size: 2)
   [junit4]   2> 115231 T341 n:127.0.0.1:32133_vvh oascc.ZkStateReader.updateWatchedCollection Updating data for collection1 to ver 3 
   [junit4]   2> 115233 T309 n:127.0.0.1:32120_vvh oasc.DistributedQueue$LatchWatcher.process NodeChildrenChanged fired on path /overseer/queue state SyncConnected
   [junit4]   2> 115278 T346 n:127.0.0.1:32133_vvh c:collection1 s:shard2 x:collection1 oasc.ZkController.register We are http://127.0.0.1:32133/vvh/collection1/ and leader is http://127.0.0.1:32133/vvh/collection1/
   [junit4]   2> 115279 T346 n:127.0.0.1:32133_vvh c:collection1 s:shard2 x:collection1 oasc.ZkController.register No LogReplay needed for core=collection1 baseURL=http://127.0.0.1:32133/vvh
   [junit4]   2> 115279 T346 n:127.0.0.1:32133_vvh c:collection1 s:shard2 x:collection1 oasc.ZkController.checkRecovery I am the leader, no recovery necessary
   [junit4]   2> 115279 T346 n:127.0.0.1:32133_vvh c:collection1 s:shard2 x:collection1 oasc.ZkController.publish publishing core=collection1 state=active collection=collection1
   [junit4]   2> 115280 T346 n:127.0.0.1:32133_vvh c:collection1 s:shard2 x:collection1 oasc.ZkController.publish numShards not found on descriptor - reading it from system property
   [junit4]   2> 115281 T309 n:127.0.0.1:32120_vvh oasc.DistributedQueue$LatchWatcher.process NodeChildrenChanged fired on path /overseer/queue state SyncConnected
   [junit4]   2> 115282 T310 n:127.0.0.1:32120_vvh oasc.Overseer$ClusterStateUpdater.run processMessage: queueSize: 1, message = {
   [junit4]   2> 	  "roles":null,
   [junit4]   2> 	  "state":"active",
   [junit4]   2> 	  "node_name":"127.0.0.1:32133_vvh",
   [junit4]   2> 	  "operation":"state",
   [junit4]   2> 	  "numShards":"2",
   [junit4]   2> 	  "core":"collection1",
   [junit4]   2> 	  "core_node_name":"core_node1",
   [junit4]   2> 	  "collection":"collection1",
   [junit4]   2> 	  "shard":"shard2",
   [junit4]   2> 	  "base_url":"http://127.0.0.1:32133/vvh"} current state version: 5
   [junit4]   2> 115283 T310 n:127.0.0.1:32120_vvh oasco.ReplicaMutator.updateState Update state numShards=2 message={
   [junit4]   2> 	  "roles":null,
   [junit4]   2> 	  "state":"active",
   [junit4]   2> 	  "node_name":"127.0.0.1:32133_vvh",
   [junit4]   2> 	  "operation":"state",
   [junit4]   2> 	  "numShards":"2",
   [junit4]   2> 	  "core":"collection1",
   [junit4]   2> 	  "core_node_name":"core_node1",
   [junit4]   2> 	  "collection":"collection1",
   [junit4]   2> 	  "shard":"shard2",
   [junit4]   2> 	  "base_url":"http://127.0.0.1:32133/vvh"}
   [junit4]   2> 115283 T346 n:127.0.0.1:32133_vvh c:collection1 s:shard2 x:collection1 oascc.ZkStateReader.updateWatchedCollection Updating data for collection1 to ver 3 
   [junit4]   2> 115284 T310 n:127.0.0.1:32120_vvh oasco.ZkStateWriter.writePendingUpdates going to update_collection /collections/collection1/state.json version: 3
   [junit4]   2> 115285 T341 n:127.0.0.1:32133_vvh oascc.ZkStateReader$7.process A cluster state change: WatchedEvent state:SyncConnected type:NodeDataChanged path:/collections/collection1/state.json for collection collection1 has occurred - updating... (live nodes size: 2)
   [junit4]   2> 115285 T341 n:127.0.0.1:32133_vvh oascc.ZkStateReader.updateWatchedCollection Updating data for collection1 to ver 4 
   [junit4]   2> 116857 T281 oas.SolrTestCaseJ4.writeCoreProperties Writing core.properties file to /usr/home/jenkins/jenkins-slave/workspace/Lucene-Solr-Tests-5.x-Java7/solr/build/solr-core/test/J0/temp/solr.cloud.HttpPartitionTest AD424071B5FE79DD-001/shard-2-001/cores/collection1
   [junit4]   2> 116873 T281 oasc.AbstractFullDistribZkTestBase.createJettys create jetty 2 in directory /usr/home/jenkins/jenkins-slave/workspace/Lucene-Solr-Tests-5.x-Java7/solr/build/solr-core/test/J0/temp/solr.cloud.HttpPartitionTest AD424071B5FE79DD-001/shard-2-001
   [junit4]   2> 116875 T281 oejs.Server.doStart jetty-9.2.10.v20150310
   [junit4]   2> 116877 T281 oejsh.ContextHandler.doStart Started o.e.j.s.ServletContextHandler@45e6ce45{/vvh,null,AVAILABLE}
   [junit4]   2> 116878 T281 oejs.AbstractConnector.doStart Started ServerConnector@5b5f9d90{HTTP/1.1}{127.0.0.1:32152}
   [junit4]   2> 116878 T281 oejs.Server.doStart Started @121952ms
   [junit4]   2> 116879 T281 oascse.JettySolrRunner$1.lifeCycleStarted Jetty properties: {hostPort=32151, hostContext=/vvh, coreRootDirectory=/usr/home/jenkins/jenkins-slave/workspace/Lucene-Solr-Tests-5.x-Java7/solr/build/solr-core/test/J0/temp/solr.cloud.HttpPartitionTest AD424071B5FE79DD-001/shard-2-001/cores, solr.data.dir=/usr/home/jenkins/jenkins-slave/workspace/Lucene-Solr-Tests-5.x-Java7/solr/build/solr-core/test/J0/temp/solr.cloud.HttpPartitionTest AD424071B5FE79DD-001/tempDir-001/jetty2, solrconfig=solrconfig.xml}
   [junit4]   2> 116879 T281 oass.SolrDispatchFilter.init SolrDispatchFilter.init()sun.misc.Launcher$AppClassLoader@231bf785
   [junit4]   2> 116880 T281 oasc.SolrResourceLoader.<init> new SolrResourceLoader for directory: '/usr/home/jenkins/jenkins-slave/workspace/Lucene-Solr-Tests-5.x-Java7/solr/build/solr-core/test/J0/temp/solr.cloud.HttpPartitionTest AD424071B5FE79DD-001/shard-2-001/'
   [junit4]   2> 116916 T281 oasc.SolrXmlConfig.fromFile Loading container configuration from /usr/home/jenkins/jenkins-slave/workspace/Lucene-Solr-Tests-5.x-Java7/solr/build/solr-core/test/J0/temp/solr.cloud.HttpPartitionTest AD424071B5FE79DD-001/shard-2-001/solr.xml
   [junit4]   2> 116960 T281 oasc.CorePropertiesLocator.<init> Config-defined core root directory: /usr/home/jenkins/jenkins-slave/workspace/Lucene-Solr-Tests-5.x-Java7/solr/build/solr-core/test/J0/temp/solr.cloud.HttpPartitionTest AD424071B5FE79DD-001/shard-2-001/cores
   [junit4]   2> 116960 T281 oasc.CoreContainer.<init> New CoreContainer 1265782913
   [junit4]   2> 116961 T281 oasc.CoreContainer.load Loading cores into CoreContainer [instanceDir=/usr/home/jenkins/jenkins-slave/workspace/Lucene-Solr-Tests-5.x-Java7/solr/build/solr-core/test/J0/temp/solr.cloud.HttpPartitionTest AD424071B5FE79DD-001/shard-2-001/]
   [junit4]   2> 116961 T281 oasc.CoreContainer.load loading shared library: /usr/home/jenkins/jenkins-slave/workspace/Lucene-Solr-Tests-5.x-Java7/solr/build/solr-core/test/J0/temp/solr.cloud.HttpPartitionTest AD424071B5FE79DD-001/shard-2-001/lib
   [junit4]   2> 116962 T281 oasc.SolrResourceLoader.addToClassLoader WARN Can't find (or read) directory to add to classloader: lib (resolved as: /usr/home/jenkins/jenkins-slave/workspace/Lucene-Solr-Tests-5.x-Java7/solr/build/solr-core/test/J0/temp/solr.cloud.HttpPartitionTest AD424071B5FE79DD-001/shard-2-001/lib).
   [junit4]   2> 116972 T281 oashc.HttpShardHandlerFactory.init created with socketTimeout : 90000,urlScheme : ,connTimeout : 15000,maxConnectionsPerHost : 20,maxConnections : 10000,corePoolSize : 0,maximumPoolSize : 2147483647,maxThreadIdleTime : 5,sizeOfQueue : -1,fairnessPolicy : false,useRetries : false,
   [junit4]   2> 116978 T281 oasu.UpdateShardHandler.<init> Creating UpdateShardHandler HTTP client with params: socketTimeout=340000&connTimeout=45000&retry=true
   [junit4]   2> 116978 T281 oasl.LogWatcher.createWatcher SLF4J impl is org.slf4j.impl.Log4jLoggerFactory
   [junit4]   2> 116979 T281 oasl.LogWatcher.newRegisteredLogWatcher Registering Log Listener [Log4j (org.slf4j.impl.Log4jLoggerFactory)]
   [junit4]   2> 116979 T281 oasc.CoreContainer.load Node Name: 127.0.0.1
   [junit4]   2> 116979 T281 oasc.ZkContainer.initZooKeeper Zookeeper client=127.0.0.1:32117/solr
   [junit4]   2> 116980 T281 oasc.ZkController.checkChrootPath zkHost includes chroot
   [junit4]   2> 116980 T281 oascc.SolrZkClient.createZkCredentialsToAddAutomatically Using default ZkCredentialsProvider
   [junit4]   2> 116981 T281 oascc.ConnectionManager.waitForConnected Waiting for client to connect to ZooKeeper
   [junit4]   2> 116982 T361 oascc.ConnectionManager.process Watcher org.apache.solr.common.cloud.ConnectionManager@264359c3 name:ZooKeeperConnection Watcher:127.0.0.1:32117 got event WatchedEvent state:SyncConnected type:None path:null path:null type:None
   [junit4]   2> 116983 T281 oascc.ConnectionManager.waitForConnected Client is connected to ZooKeeper
   [junit4]   2> 116983 T281 oascc.SolrZkClient.createZkACLProvider Using default ZkACLProvider
   [junit4]   2> 116985 T281 n:127.0.0.1:32151_vvh oascc.ConnectionManager.waitForConnected Waiting for client to connect to ZooKeeper
   [junit4]   2> 116987 T364 n:127.0.0.1:32151_vvh oascc.ConnectionManager.process Watcher org.apache.solr.common.cloud.ConnectionManager@54c7f0b4 name:ZooKeeperConnection Watcher:127.0.0.1:32117/solr got event WatchedEvent state:SyncConnected type:None path:null path:null type:None
   [junit4]   2> 116987 T281 n:127.0.0.1:32151_vvh oascc.ConnectionManager.waitForConnected Client is connected to ZooKeeper
   [junit4]   2> 116991 T281 n:127.0.0.1:32151_vvh oascc.ZkStateReader.createClusterStateWatchersAndUpdate Updating cluster state from ZooKeeper... 
   [junit4]   2> 117996 T281 n:127.0.0.1:32151_vvh oasc.ZkController.createEphemeralLiveNode Register node as live in ZooKeeper:/live_nodes/127.0.0.1:32151_vvh
   [junit4]   2> 117997 T281 n:127.0.0.1:32151_vvh oascc.SolrZkClient.makePath makePath: /live_nodes/127.0.0.1:32151_vvh
   [junit4]   2> 117999 T281 n:127.0.0.1:32151_vvh oasc.Overseer.close Overseer (id=null) closing
   [junit4]   2> 118002 T281 n:127.0.0.1:32151_vvh oasc.CorePropertiesLocator.discover Looking for core definitions underneath /usr/home/jenkins/jenkins-slave/workspace/Lucene-Solr-Tests-5.x-Java7/solr/build/solr-core/test/J0/temp/solr.cloud.HttpPartitionTest AD424071B5FE79DD-001/shard-2-001/cores
   [junit4]   2> 118004 T281 n:127.0.0.1:32151_vvh oasc.CoreDescriptor.<init> CORE DESCRIPTOR: {schema=schema.xml, instanceDir=/usr/home/jenkins/jenkins-slave/workspace/Lucene-Solr-Tests-5.x-Java7/solr/build/solr-core/test/J0/temp/solr.cloud.HttpPartitionTest AD424071B5FE79DD-001/shard-2-001/cores/collection1, config=solrconfig.xml, transient=false, loadOnStartup=true, coreNodeName=, collection=collection1, shard=, name=collection1, absoluteInstDir=/usr/home/jenkins/jenkins-slave/workspace/Lucene-Solr-Tests-5.x-Java7/solr/build/solr-core/test/J0/temp/solr.cloud.HttpPartitionTest AD424071B5FE79DD-001/shard-2-001/cores/collection1/, dataDir=data/}
   [junit4]   2> 118005 T281 n:127.0.0.1:32151_vvh oasc.CorePropertiesLocator.discoverUnder Found core collection1 in /usr/home/jenkins/jenkins-slave/workspace/Lucene-Solr-Tests-5.x-Java7/solr/build/solr-core/test/J0/temp/solr.cloud.HttpPartitionTest AD424071B5FE79DD-001/shard-2-001/cores/collection1/
   [junit4]   2> 118005 T281 n:127.0.0.1:32151_vvh oasc.CorePropertiesLocator.discover Found 1 core definitions
   [junit4]   2> 118007 T365 n:127.0.0.1:32151_vvh c:collection1 x:collection1 oasc.ZkController.publish publishing core=collection1 state=down collection=collection1
   [junit4]   2> 118007 T365 n:127.0.0.1:32151_vvh c:collection1 x:collection1 oasc.ZkController.publish numShards not found on descriptor - reading it from system property
   [junit4]   2> 118009 T309 n:127.0.0.1:32120_vvh oasc.DistributedQueue$LatchWatcher.process NodeChildrenChanged fired on path /overseer/queue state SyncConnected
   [junit4]   2> 118010 T365 n:127.0.0.1:32151_vvh oasc.ZkController.preRegister Registering watch for external collection collection1
   [junit4]   2> 118010 T365 n:127.0.0.1:32151_vvh oascc.ZkStateReader.addZkWatch addZkWatch collection1
   [junit4]   2> 118010 T310 n:127.0.0.1:32120_vvh oasc.Overseer$ClusterStateUpdater.run processMessage: queueSize: 1, message = {
   [junit4]   2> 	  "roles":null,
   [junit4]   2> 	  "state":"down",
   [junit4]   2> 	  "node_name":"127.0.0.1:32151_vvh",
   [junit4]   2> 	  "operation":"state",
   [junit4]   2> 	  "numShards":"2",
   [junit4]   2> 	  "core":"collection1",
   [junit4]   2> 	  "collection":"collection1",
   [junit4]   2> 	  "shard":null,
   [junit4]   2> 	  "base_url":"http://127.0.0.1:32151/vvh"} current state version: 5
   [junit4]   2> 118010 T365 n:127.0.0.1:32151_vvh oascc.ZkStateReader.addZkWatch Updating collection state at /collections/collection1/state.json from ZooKeeper... 
   [junit4]   2> 118011 T310 n:127.0.0.1:32120_vvh oasco.ReplicaMutator.updateState Update state numShards=2 message={
   [junit4]   2> 	  "roles":null,
   [junit4]   2> 	  "state":"down",
   [junit4]   2> 	  "node_name":"127.0.0.1:32151_vvh",
   [junit4]   2> 	  "operation":"state",
   [junit4]   2> 	  "numShards":"2",
   [junit4]   2> 	  "core":"collection1",
   [junit4]   2> 	  "collection":"collection1",
   [junit4]   2> 	  "shard":null,
   [junit4]   2> 	  "base_url":"http://127.0.0.1:32151/vvh"}
   [junit4]   2> 118011 T310 n:127.0.0.1:32120_vvh oasco.ReplicaMutator.updateState Collection already exists with numShards=2
   [junit4]   2> 118011 T310 n:127.

[...truncated too long message...]

0.0.1:32157_vvh oasc.Overseer$ClusterStateUpdater.run Overseer Loop exiting : 127.0.0.1:32157_vvh
   [junit4]   2> 318570 T558 n:127.0.0.1:32157_vvh oascc.ZkStateReader$3.process WARN ZooKeeper watch triggered, but Solr cannot talk to ZK
   [junit4]   2> 318572 T281 oejs.AbstractConnector.doStop Stopped ServerConnector@57fd899f{HTTP/1.1}{127.0.0.1:0}
   [junit4]   2> 318573 T281 oejsh.ContextHandler.doStop Stopped o.e.j.s.ServletContextHandler@5395fbac{/vvh,null,UNAVAILABLE}
   [junit4]   2> 318575 T281 c:control_collection s:shard1 x:collection1 oasc.ZkTestServer.send4LetterWord connecting to 127.0.0.1:32117 32117
   [junit4]   2> 318841 T282 oasc.ZkTestServer.send4LetterWord connecting to 127.0.0.1:32117 32117
   [junit4]   2> 318842 T282 oasc.ZkTestServer$ZKServerMain.runFromConfig WARN Watch limit violations: 
   [junit4]   2> 	Maximum concurrent create/delete watches above limit:
   [junit4]   2> 	
   [junit4]   2> 		5	/solr/clusterstate.json
   [junit4]   2> 		5	/solr/aliases.json
   [junit4]   2> 		4	/solr/configs/conf1
   [junit4]   2> 		3	/solr/collections/collection1/state.json
   [junit4]   2> 		2	/solr/collections/c8n_crud_1x2/state.json
   [junit4]   2> 		2	/solr/collections/c8n_1x2/state.json
   [junit4]   2> 	
   [junit4]   2> 	Maximum concurrent children watches above limit:
   [junit4]   2> 	
   [junit4]   2> 		5	/solr/live_nodes
   [junit4]   2> 		4	/solr/overseer/queue
   [junit4]   2> 		4	/solr/overseer/collection-queue-work
   [junit4]   2> 	
   [junit4]   2> 318842 T281 c:control_collection s:shard1 x:collection1 oasc.SocketProxy.close WARN Closing 12 connections to: http://127.0.0.1:32120/vvh, target: http://127.0.0.1:32121/vvh
   [junit4]   2> 318843 T281 c:control_collection s:shard1 x:collection1 oasc.SocketProxy.close WARN Closing 1 connections to: http://127.0.0.1:32133/vvh, target: http://127.0.0.1:32134/vvh
   [junit4]   2> 318843 T281 c:control_collection s:shard1 x:collection1 oasc.SocketProxy.close WARN Closing 2 connections to: http://127.0.0.1:32157/vvh, target: http://127.0.0.1:32158/vvh
   [junit4]   2> 318843 T281 c:control_collection s:shard1 x:collection1 oasc.SocketProxy.close WARN Closing 9 connections to: http://127.0.0.1:32151/vvh, target: http://127.0.0.1:32152/vvh
   [junit4]   2> NOTE: reproduce with: ant test  -Dtestcase=HttpPartitionTest -Dtests.method=test -Dtests.seed=AD424071B5FE79DD -Dtests.multiplier=2 -Dtests.slow=true -Dtests.locale=bg_BG -Dtests.timezone=America/Thunder_Bay -Dtests.asserts=true -Dtests.file.encoding=ISO-8859-1
   [junit4] FAILURE  212s J0 | HttpPartitionTest.test <<<
   [junit4]    > Throwable #1: java.lang.AssertionError: Didn't see all replicas for shard shard1 in c8n_1x2 come up within 30000 ms! ClusterState: {
   [junit4]    >   "control_collection":{
   [junit4]    >     "autoAddReplicas":"false",
   [junit4]    >     "replicationFactor":"1",
   [junit4]    >     "shards":{"shard1":{
   [junit4]    >         "range":"80000000-7fffffff",
   [junit4]    >         "state":"active",
   [junit4]    >         "replicas":{"core_node1":{
   [junit4]    >             "state":"active",
   [junit4]    >             "node_name":"127.0.0.1:32120_vvh",
   [junit4]    >             "core":"collection1",
   [junit4]    >             "base_url":"http://127.0.0.1:32120/vvh",
   [junit4]    >             "leader":"true"}}}},
   [junit4]    >     "autoCreated":"true",
   [junit4]    >     "router":{"name":"compositeId"},
   [junit4]    >     "maxShardsPerNode":"1"},
   [junit4]    >   "c8n_1x2":{
   [junit4]    >     "autoAddReplicas":"false",
   [junit4]    >     "replicationFactor":"2",
   [junit4]    >     "shards":{"shard1":{
   [junit4]    >         "range":"80000000-7fffffff",
   [junit4]    >         "state":"active",
   [junit4]    >         "replicas":{
   [junit4]    >           "core_node1":{
   [junit4]    >             "state":"recovering",
   [junit4]    >             "node_name":"127.0.0.1:32133_vvh",
   [junit4]    >             "core":"c8n_1x2_shard1_replica2",
   [junit4]    >             "base_url":"http://127.0.0.1:32133/vvh"},
   [junit4]    >           "core_node2":{
   [junit4]    >             "state":"active",
   [junit4]    >             "node_name":"127.0.0.1:32120_vvh",
   [junit4]    >             "core":"c8n_1x2_shard1_replica1",
   [junit4]    >             "base_url":"http://127.0.0.1:32120/vvh",
   [junit4]    >             "leader":"true"}}}},
   [junit4]    >     "router":{"name":"compositeId"},
   [junit4]    >     "maxShardsPerNode":"1"},
   [junit4]    >   "collection1":{
   [junit4]    >     "autoAddReplicas":"false",
   [junit4]    >     "replicationFactor":"1",
   [junit4]    >     "shards":{
   [junit4]    >       "shard1":{
   [junit4]    >         "range":"80000000-ffffffff",
   [junit4]    >         "state":"active",
   [junit4]    >         "replicas":{"core_node2":{
   [junit4]    >             "state":"active",
   [junit4]    >             "node_name":"127.0.0.1:32151_vvh",
   [junit4]    >             "core":"collection1",
   [junit4]    >             "base_url":"http://127.0.0.1:32151/vvh",
   [junit4]    >             "leader":"true"}}},
   [junit4]    >       "shard2":{
   [junit4]    >         "range":"0-7fffffff",
   [junit4]    >         "state":"active",
   [junit4]    >         "replicas":{
   [junit4]    >           "core_node1":{
   [junit4]    >             "state":"active",
   [junit4]    >             "node_name":"127.0.0.1:32133_vvh",
   [junit4]    >             "core":"collection1",
   [junit4]    >             "base_url":"http://127.0.0.1:32133/vvh",
   [junit4]    >             "leader":"true"},
   [junit4]    >           "core_node3":{
   [junit4]    >             "state":"active",
   [junit4]    >             "node_name":"127.0.0.1:32157_vvh",
   [junit4]    >             "core":"collection1",
   [junit4]    >             "base_url":"http://127.0.0.1:32157/vvh"}}}},
   [junit4]    >     "autoCreated":"true",
   [junit4]    >     "router":{"name":"compositeId"},
   [junit4]    >     "maxShardsPerNode":"1"}}
   [junit4]    > 	at __randomizedtesting.SeedInfo.seed([AD424071B5FE79DD:25167FAB1B021425]:0)
   [junit4]    > 	at org.apache.solr.cloud.AbstractFullDistribZkTestBase.ensureAllReplicasAreActive(AbstractFullDistribZkTestBase.java:1920)
   [junit4]    > 	at org.apache.solr.cloud.HttpPartitionTest.testRf2(HttpPartitionTest.java:237)
   [junit4]    > 	at org.apache.solr.cloud.HttpPartitionTest.test(HttpPartitionTest.java:105)
   [junit4]    > 	at org.apache.solr.BaseDistributedSearchTestCase$ShardsRepeatRule$ShardsFixedStatement.callStatement(BaseDistributedSearchTestCase.java:960)
   [junit4]    > 	at org.apache.solr.BaseDistributedSearchTestCase$ShardsRepeatRule$ShardsStatement.evaluate(BaseDistributedSearchTestCase.java:935)
   [junit4]    > 	at java.lang.Thread.run(Thread.java:745)
   [junit4]   2> 318902 T281 c:control_collection s:shard1 x:collection1 oas.SolrTestCaseJ4.deleteCore ###deleteCore
   [junit4]   2> NOTE: leaving temporary files on disk at: /usr/home/jenkins/jenkins-slave/workspace/Lucene-Solr-Tests-5.x-Java7/solr/build/solr-core/test/J0/temp/solr.cloud.HttpPartitionTest AD424071B5FE79DD-001
   [junit4]   2> 211625 T280 ccr.ThreadLeakControl.checkThreadLeaks WARNING Will linger awaiting termination of 1 leaked thread(s).
   [junit4]   2> NOTE: test params are: codec=Asserting(Lucene50): {text=FST50, multiDefault=TestBloomFilteredLucenePostings(BloomFilteringPostingsFormat(Lucene50(blocksize=128))), intDefault=FSTOrd50, _version_=FSTOrd50, range_facet_l_dv=Lucene50(blocksize=128), timestamp=FSTOrd50, range_facet_l=FSTOrd50, id=Lucene50(blocksize=128), a_t=FSTOrd50, range_facet_i_dv=FSTOrd50}, docValues:{range_facet_l_dv=DocValuesFormat(name=Asserting), timestamp=DocValuesFormat(name=Lucene50), range_facet_i_dv=DocValuesFormat(name=Lucene50)}, sim=DefaultSimilarity, locale=bg_BG, timezone=America/Thunder_Bay
   [junit4]   2> NOTE: FreeBSD 9.1-RELEASE-p3 amd64/Oracle Corporation 1.7.0_65 (64-bit)/cpus=16,threads=1,free=114124096,total=234356736
   [junit4]   2> NOTE: All tests run in this JVM: [TestDefaultSimilarityFactory, TestReplicaProperties, TestHashPartitioner, OutOfBoxZkACLAndCredentialsProvidersTest, InfoHandlerTest, TestAddFieldRealTimeGet, TestQueryUtils, HttpPartitionTest]
   [junit4] Completed [63/488] on J0 in 212.42s, 1 test, 1 failure <<< FAILURES!

[...truncated 1347 lines...]
BUILD FAILED
/usr/home/jenkins/jenkins-slave/workspace/Lucene-Solr-Tests-5.x-Java7/build.xml:536: The following error occurred while executing this line:
/usr/home/jenkins/jenkins-slave/workspace/Lucene-Solr-Tests-5.x-Java7/build.xml:484: The following error occurred while executing this line:
/usr/home/jenkins/jenkins-slave/workspace/Lucene-Solr-Tests-5.x-Java7/build.xml:61: The following error occurred while executing this line:
/usr/home/jenkins/jenkins-slave/workspace/Lucene-Solr-Tests-5.x-Java7/extra-targets.xml:39: The following error occurred while executing this line:
/usr/home/jenkins/jenkins-slave/workspace/Lucene-Solr-Tests-5.x-Java7/solr/build.xml:229: The following error occurred while executing this line:
/usr/home/jenkins/jenkins-slave/workspace/Lucene-Solr-Tests-5.x-Java7/solr/common-build.xml:511: The following error occurred while executing this line:
/usr/home/jenkins/jenkins-slave/workspace/Lucene-Solr-Tests-5.x-Java7/lucene/common-build.xml:1433: The following error occurred while executing this line:
/usr/home/jenkins/jenkins-slave/workspace/Lucene-Solr-Tests-5.x-Java7/lucene/common-build.xml:991: There were test failures: 488 suites, 1958 tests, 1 failure, 71 ignored (26 assumptions)

Total time: 52 minutes 52 seconds
Build step 'Invoke Ant' marked build as failure
Archiving artifacts
Sending artifact delta relative to Lucene-Solr-Tests-5.x-Java7 #3081
Archived 5 artifacts
Archive block size is 32768
Received 0 blocks and 223501262 bytes
Compression is 0.0%
Took 42 sec
Recording test results
Email was triggered for: Failure
Sending email for trigger: Failure



Mime
View raw message