lucene-dev mailing list archives

Site index · List index
Message view « Date » · « Thread »
Top « Date » · « Thread »
From Policeman Jenkins Server <jenk...@thetaphi.de>
Subject [JENKINS] Lucene-Solr-trunk-Linux (32bit/jdk1.8.0_45) - Build # 12617 - Failure!
Date Sun, 10 May 2015 00:29:25 GMT
Build: http://jenkins.thetaphi.de/job/Lucene-Solr-trunk-Linux/12617/
Java: 32bit/jdk1.8.0_45 -client -XX:+UseConcMarkSweepGC

1 tests failed.
FAILED:  org.apache.solr.cloud.CollectionsAPIAsyncDistributedZkTest.testSolrJAPICalls

Error Message:
Shard split did not complete. Last recorded state: running expected:<[completed]> but was:<[running]>

Stack Trace:
org.junit.ComparisonFailure: Shard split did not complete. Last recorded state: running expected:<[completed]> but was:<[running]>
	at __randomizedtesting.SeedInfo.seed([9E35CA37475A538D:C65146564130FB59]:0)
	at org.junit.Assert.assertEquals(Assert.java:125)
	at org.apache.solr.cloud.CollectionsAPIAsyncDistributedZkTest.testSolrJAPICalls(CollectionsAPIAsyncDistributedZkTest.java:101)
	at sun.reflect.NativeMethodAccessorImpl.invoke0(Native Method)
	at sun.reflect.NativeMethodAccessorImpl.invoke(NativeMethodAccessorImpl.java:62)
	at sun.reflect.DelegatingMethodAccessorImpl.invoke(DelegatingMethodAccessorImpl.java:43)
	at java.lang.reflect.Method.invoke(Method.java:497)
	at com.carrotsearch.randomizedtesting.RandomizedRunner.invoke(RandomizedRunner.java:1627)
	at com.carrotsearch.randomizedtesting.RandomizedRunner$6.evaluate(RandomizedRunner.java:836)
	at com.carrotsearch.randomizedtesting.RandomizedRunner$7.evaluate(RandomizedRunner.java:872)
	at com.carrotsearch.randomizedtesting.RandomizedRunner$8.evaluate(RandomizedRunner.java:886)
	at org.apache.solr.BaseDistributedSearchTestCase$ShardsRepeatRule$ShardsFixedStatement.callStatement(BaseDistributedSearchTestCase.java:960)
	at org.apache.solr.BaseDistributedSearchTestCase$ShardsRepeatRule$ShardsStatement.evaluate(BaseDistributedSearchTestCase.java:935)
	at com.carrotsearch.randomizedtesting.rules.SystemPropertiesRestoreRule$1.evaluate(SystemPropertiesRestoreRule.java:57)
	at org.apache.lucene.util.TestRuleSetupTeardownChained$1.evaluate(TestRuleSetupTeardownChained.java:50)
	at org.apache.lucene.util.AbstractBeforeAfterRule$1.evaluate(AbstractBeforeAfterRule.java:46)
	at org.apache.lucene.util.TestRuleThreadAndTestName$1.evaluate(TestRuleThreadAndTestName.java:49)
	at org.apache.lucene.util.TestRuleIgnoreAfterMaxFailures$1.evaluate(TestRuleIgnoreAfterMaxFailures.java:65)
	at org.apache.lucene.util.TestRuleMarkFailure$1.evaluate(TestRuleMarkFailure.java:48)
	at com.carrotsearch.randomizedtesting.rules.StatementAdapter.evaluate(StatementAdapter.java:36)
	at com.carrotsearch.randomizedtesting.ThreadLeakControl$StatementRunner.run(ThreadLeakControl.java:365)
	at com.carrotsearch.randomizedtesting.ThreadLeakControl.forkTimeoutingTask(ThreadLeakControl.java:798)
	at com.carrotsearch.randomizedtesting.ThreadLeakControl$3.evaluate(ThreadLeakControl.java:458)
	at com.carrotsearch.randomizedtesting.RandomizedRunner.runSingleTest(RandomizedRunner.java:845)
	at com.carrotsearch.randomizedtesting.RandomizedRunner$3.evaluate(RandomizedRunner.java:747)
	at com.carrotsearch.randomizedtesting.RandomizedRunner$4.evaluate(RandomizedRunner.java:781)
	at com.carrotsearch.randomizedtesting.RandomizedRunner$5.evaluate(RandomizedRunner.java:792)
	at com.carrotsearch.randomizedtesting.rules.StatementAdapter.evaluate(StatementAdapter.java:36)
	at com.carrotsearch.randomizedtesting.rules.SystemPropertiesRestoreRule$1.evaluate(SystemPropertiesRestoreRule.java:57)
	at org.apache.lucene.util.AbstractBeforeAfterRule$1.evaluate(AbstractBeforeAfterRule.java:46)
	at com.carrotsearch.randomizedtesting.rules.StatementAdapter.evaluate(StatementAdapter.java:36)
	at org.apache.lucene.util.TestRuleStoreClassName$1.evaluate(TestRuleStoreClassName.java:42)
	at com.carrotsearch.randomizedtesting.rules.NoShadowingOrOverridesOnMethodsRule$1.evaluate(NoShadowingOrOverridesOnMethodsRule.java:39)
	at com.carrotsearch.randomizedtesting.rules.NoShadowingOrOverridesOnMethodsRule$1.evaluate(NoShadowingOrOverridesOnMethodsRule.java:39)
	at com.carrotsearch.randomizedtesting.rules.StatementAdapter.evaluate(StatementAdapter.java:36)
	at com.carrotsearch.randomizedtesting.rules.StatementAdapter.evaluate(StatementAdapter.java:36)
	at com.carrotsearch.randomizedtesting.rules.StatementAdapter.evaluate(StatementAdapter.java:36)
	at org.apache.lucene.util.TestRuleAssertionsRequired$1.evaluate(TestRuleAssertionsRequired.java:54)
	at org.apache.lucene.util.TestRuleMarkFailure$1.evaluate(TestRuleMarkFailure.java:48)
	at org.apache.lucene.util.TestRuleIgnoreAfterMaxFailures$1.evaluate(TestRuleIgnoreAfterMaxFailures.java:65)
	at org.apache.lucene.util.TestRuleIgnoreTestSuites$1.evaluate(TestRuleIgnoreTestSuites.java:55)
	at com.carrotsearch.randomizedtesting.rules.StatementAdapter.evaluate(StatementAdapter.java:36)
	at com.carrotsearch.randomizedtesting.ThreadLeakControl$StatementRunner.run(ThreadLeakControl.java:365)
	at java.lang.Thread.run(Thread.java:745)




Build Log:
[...truncated 10572 lines...]
   [junit4] Suite: org.apache.solr.cloud.CollectionsAPIAsyncDistributedZkTest
   [junit4]   2> Creating dataDir: /home/jenkins/workspace/Lucene-Solr-trunk-Linux/solr/build/solr-core/test/J0/temp/solr.cloud.CollectionsAPIAsyncDistributedZkTest 9E35CA37475A538D-001/init-core-data-001
   [junit4]   2> 1146954 T6344 oas.SolrTestCaseJ4.buildSSLConfig Randomized ssl (false) and clientAuth (false)
   [junit4]   2> 1146954 T6344 oas.BaseDistributedSearchTestCase.initHostContext Setting hostContext system property: /xhc/ob
   [junit4]   2> 1146957 T6344 oasc.ZkTestServer.run STARTING ZK TEST SERVER
   [junit4]   2> 1146957 T6345 oasc.ZkTestServer$2$1.setClientPort client port:0.0.0.0/0.0.0.0:0
   [junit4]   2> 1146957 T6345 oasc.ZkTestServer$ZKServerMain.runFromConfig Starting server
   [junit4]   2> 1147057 T6344 oasc.ZkTestServer.run start zk server on port:52244
   [junit4]   2> 1147058 T6344 oascc.SolrZkClient.createZkCredentialsToAddAutomatically Using default ZkCredentialsProvider
   [junit4]   2> 1147059 T6344 oascc.ConnectionManager.waitForConnected Waiting for client to connect to ZooKeeper
   [junit4]   2> 1147061 T6352 oascc.ConnectionManager.process Watcher org.apache.solr.common.cloud.ConnectionManager@d1d0c4 name:ZooKeeperConnection Watcher:127.0.0.1:52244 got event WatchedEvent state:SyncConnected type:None path:null path:null type:None
   [junit4]   2> 1147061 T6344 oascc.ConnectionManager.waitForConnected Client is connected to ZooKeeper
   [junit4]   2> 1147061 T6344 oascc.SolrZkClient.createZkACLProvider Using default ZkACLProvider
   [junit4]   2> 1147062 T6344 oascc.SolrZkClient.makePath makePath: /solr
   [junit4]   2> 1147063 T6344 oascc.SolrZkClient.createZkCredentialsToAddAutomatically Using default ZkCredentialsProvider
   [junit4]   2> 1147064 T6344 oascc.ConnectionManager.waitForConnected Waiting for client to connect to ZooKeeper
   [junit4]   2> 1147065 T6355 oascc.ConnectionManager.process Watcher org.apache.solr.common.cloud.ConnectionManager@158fc7e name:ZooKeeperConnection Watcher:127.0.0.1:52244/solr got event WatchedEvent state:SyncConnected type:None path:null path:null type:None
   [junit4]   2> 1147065 T6344 oascc.ConnectionManager.waitForConnected Client is connected to ZooKeeper
   [junit4]   2> 1147065 T6344 oascc.SolrZkClient.createZkACLProvider Using default ZkACLProvider
   [junit4]   2> 1147066 T6344 oascc.SolrZkClient.makePath makePath: /collections/collection1
   [junit4]   2> 1147067 T6344 oascc.SolrZkClient.makePath makePath: /collections/collection1/shards
   [junit4]   2> 1147068 T6344 oascc.SolrZkClient.makePath makePath: /collections/control_collection
   [junit4]   2> 1147069 T6344 oascc.SolrZkClient.makePath makePath: /collections/control_collection/shards
   [junit4]   2> 1147070 T6344 oasc.AbstractZkTestCase.putConfig put /home/jenkins/workspace/Lucene-Solr-trunk-Linux/solr/core/src/test-files/solr/collection1/conf/solrconfig-tlog.xml to /configs/conf1/solrconfig.xml
   [junit4]   2> 1147071 T6344 oascc.SolrZkClient.makePath makePath: /configs/conf1/solrconfig.xml
   [junit4]   2> 1147072 T6344 oasc.AbstractZkTestCase.putConfig put /home/jenkins/workspace/Lucene-Solr-trunk-Linux/solr/core/src/test-files/solr/collection1/conf/schema.xml to /configs/conf1/schema.xml
   [junit4]   2> 1147073 T6344 oascc.SolrZkClient.makePath makePath: /configs/conf1/schema.xml
   [junit4]   2> 1147074 T6344 oasc.AbstractZkTestCase.putConfig put /home/jenkins/workspace/Lucene-Solr-trunk-Linux/solr/core/src/test-files/solr/collection1/conf/solrconfig.snippet.randomindexconfig.xml to /configs/conf1/solrconfig.snippet.randomindexconfig.xml
   [junit4]   2> 1147074 T6344 oascc.SolrZkClient.makePath makePath: /configs/conf1/solrconfig.snippet.randomindexconfig.xml
   [junit4]   2> 1147075 T6344 oasc.AbstractZkTestCase.putConfig put /home/jenkins/workspace/Lucene-Solr-trunk-Linux/solr/core/src/test-files/solr/collection1/conf/stopwords.txt to /configs/conf1/stopwords.txt
   [junit4]   2> 1147076 T6344 oascc.SolrZkClient.makePath makePath: /configs/conf1/stopwords.txt
   [junit4]   2> 1147077 T6344 oasc.AbstractZkTestCase.putConfig put /home/jenkins/workspace/Lucene-Solr-trunk-Linux/solr/core/src/test-files/solr/collection1/conf/protwords.txt to /configs/conf1/protwords.txt
   [junit4]   2> 1147077 T6344 oascc.SolrZkClient.makePath makePath: /configs/conf1/protwords.txt
   [junit4]   2> 1147079 T6344 oasc.AbstractZkTestCase.putConfig put /home/jenkins/workspace/Lucene-Solr-trunk-Linux/solr/core/src/test-files/solr/collection1/conf/currency.xml to /configs/conf1/currency.xml
   [junit4]   2> 1147079 T6344 oascc.SolrZkClient.makePath makePath: /configs/conf1/currency.xml
   [junit4]   2> 1147080 T6344 oasc.AbstractZkTestCase.putConfig put /home/jenkins/workspace/Lucene-Solr-trunk-Linux/solr/core/src/test-files/solr/collection1/conf/enumsConfig.xml to /configs/conf1/enumsConfig.xml
   [junit4]   2> 1147081 T6344 oascc.SolrZkClient.makePath makePath: /configs/conf1/enumsConfig.xml
   [junit4]   2> 1147082 T6344 oasc.AbstractZkTestCase.putConfig put /home/jenkins/workspace/Lucene-Solr-trunk-Linux/solr/core/src/test-files/solr/collection1/conf/open-exchange-rates.json to /configs/conf1/open-exchange-rates.json
   [junit4]   2> 1147083 T6344 oascc.SolrZkClient.makePath makePath: /configs/conf1/open-exchange-rates.json
   [junit4]   2> 1147084 T6344 oasc.AbstractZkTestCase.putConfig put /home/jenkins/workspace/Lucene-Solr-trunk-Linux/solr/core/src/test-files/solr/collection1/conf/mapping-ISOLatin1Accent.txt to /configs/conf1/mapping-ISOLatin1Accent.txt
   [junit4]   2> 1147084 T6344 oascc.SolrZkClient.makePath makePath: /configs/conf1/mapping-ISOLatin1Accent.txt
   [junit4]   2> 1147085 T6344 oasc.AbstractZkTestCase.putConfig put /home/jenkins/workspace/Lucene-Solr-trunk-Linux/solr/core/src/test-files/solr/collection1/conf/old_synonyms.txt to /configs/conf1/old_synonyms.txt
   [junit4]   2> 1147086 T6344 oascc.SolrZkClient.makePath makePath: /configs/conf1/old_synonyms.txt
   [junit4]   2> 1147087 T6344 oasc.AbstractZkTestCase.putConfig put /home/jenkins/workspace/Lucene-Solr-trunk-Linux/solr/core/src/test-files/solr/collection1/conf/synonyms.txt to /configs/conf1/synonyms.txt
   [junit4]   2> 1147087 T6344 oascc.SolrZkClient.makePath makePath: /configs/conf1/synonyms.txt
   [junit4]   2> 1147163 T6344 oas.SolrTestCaseJ4.writeCoreProperties Writing core.properties file to /home/jenkins/workspace/Lucene-Solr-trunk-Linux/solr/build/solr-core/test/J0/temp/solr.cloud.CollectionsAPIAsyncDistributedZkTest 9E35CA37475A538D-001/control-001/cores/collection1
   [junit4]   2> 1147164 T6344 oejs.Server.doStart jetty-9.2.10.v20150310
   [junit4]   2> 1147166 T6344 oejsh.ContextHandler.doStart Started o.e.j.s.ServletContextHandler@3535d6{/xhc/ob,null,AVAILABLE}
   [junit4]   2> 1147167 T6344 oejs.AbstractConnector.doStart Started ServerConnector@162111{HTTP/1.1}{127.0.0.1:37816}
   [junit4]   2> 1147168 T6344 oejs.Server.doStart Started @1147854ms
   [junit4]   2> 1147168 T6344 oascse.JettySolrRunner$1.lifeCycleStarted Jetty properties: {hostContext=/xhc/ob, hostPort=37816, coreRootDirectory=/home/jenkins/workspace/Lucene-Solr-trunk-Linux/solr/build/solr-core/test/J0/../../../../../../../../../home/jenkins/workspace/Lucene-Solr-trunk-Linux/solr/build/solr-core/test/J0/temp/solr.cloud.CollectionsAPIAsyncDistributedZkTest 9E35CA37475A538D-001/control-001/cores}
   [junit4]   2> 1147169 T6344 oass.SolrDispatchFilter.init SolrDispatchFilter.init()sun.misc.Launcher$AppClassLoader@e2f2a
   [junit4]   2> 1147169 T6344 oasc.SolrResourceLoader.<init> new SolrResourceLoader for directory: '/home/jenkins/workspace/Lucene-Solr-trunk-Linux/solr/build/solr-core/test/J0/../../../../../../../../../home/jenkins/workspace/Lucene-Solr-trunk-Linux/solr/build/solr-core/test/J0/temp/solr.cloud.CollectionsAPIAsyncDistributedZkTest 9E35CA37475A538D-001/control-001/'
   [junit4]   2> 1147190 T6344 oasc.SolrXmlConfig.fromFile Loading container configuration from /home/jenkins/workspace/Lucene-Solr-trunk-Linux/solr/build/solr-core/test/J0/../../../../../../../../../home/jenkins/workspace/Lucene-Solr-trunk-Linux/solr/build/solr-core/test/J0/temp/solr.cloud.CollectionsAPIAsyncDistributedZkTest 9E35CA37475A538D-001/control-001/solr.xml
   [junit4]   2> 1147196 T6344 oasc.CorePropertiesLocator.<init> Config-defined core root directory: /home/jenkins/workspace/Lucene-Solr-trunk-Linux/solr/build/solr-core/test/J0/../../../../../../../../../home/jenkins/workspace/Lucene-Solr-trunk-Linux/solr/build/solr-core/test/J0/temp/solr.cloud.CollectionsAPIAsyncDistributedZkTest 9E35CA37475A538D-001/control-001/cores
   [junit4]   2> 1147197 T6344 oasc.CoreContainer.<init> New CoreContainer 6232254
   [junit4]   2> 1147197 T6344 oasc.CoreContainer.load Loading cores into CoreContainer [instanceDir=/home/jenkins/workspace/Lucene-Solr-trunk-Linux/solr/build/solr-core/test/J0/../../../../../../../../../home/jenkins/workspace/Lucene-Solr-trunk-Linux/solr/build/solr-core/test/J0/temp/solr.cloud.CollectionsAPIAsyncDistributedZkTest 9E35CA37475A538D-001/control-001/]
   [junit4]   2> 1147198 T6344 oasc.CoreContainer.load loading shared library: /home/jenkins/workspace/Lucene-Solr-trunk-Linux/solr/build/solr-core/test/J0/../../../../../../../../../home/jenkins/workspace/Lucene-Solr-trunk-Linux/solr/build/solr-core/test/J0/temp/solr.cloud.CollectionsAPIAsyncDistributedZkTest 9E35CA37475A538D-001/control-001/lib
   [junit4]   2> 1147198 T6344 oasc.SolrResourceLoader.addToClassLoader WARN Can't find (or read) directory to add to classloader: lib (resolved as: /home/jenkins/workspace/Lucene-Solr-trunk-Linux/solr/build/solr-core/test/J0/../../../../../../../../../home/jenkins/workspace/Lucene-Solr-trunk-Linux/solr/build/solr-core/test/J0/temp/solr.cloud.CollectionsAPIAsyncDistributedZkTest 9E35CA37475A538D-001/control-001/lib).
   [junit4]   2> 1147208 T6344 oashc.HttpShardHandlerFactory.init created with socketTimeout : 90000,urlScheme : ,connTimeout : 15000,maxConnectionsPerHost : 20,maxConnections : 10000,corePoolSize : 0,maximumPoolSize : 2147483647,maxThreadIdleTime : 5,sizeOfQueue : -1,fairnessPolicy : false,useRetries : false,
   [junit4]   2> 1147211 T6344 oasu.UpdateShardHandler.<init> Creating UpdateShardHandler HTTP client with params: socketTimeout=340000&connTimeout=45000&retry=true
   [junit4]   2> 1147212 T6344 oasl.LogWatcher.createWatcher SLF4J impl is org.slf4j.impl.Log4jLoggerFactory
   [junit4]   2> 1147212 T6344 oasl.LogWatcher.newRegisteredLogWatcher Registering Log Listener [Log4j (org.slf4j.impl.Log4jLoggerFactory)]
   [junit4]   2> 1147213 T6344 oasc.CoreContainer.load Node Name: 127.0.0.1
   [junit4]   2> 1147213 T6344 oasc.ZkContainer.initZooKeeper Zookeeper client=127.0.0.1:52244/solr
   [junit4]   2> 1147214 T6344 oasc.ZkController.checkChrootPath zkHost includes chroot
   [junit4]   2> 1147214 T6344 oascc.SolrZkClient.createZkCredentialsToAddAutomatically Using default ZkCredentialsProvider
   [junit4]   2> 1147215 T6344 oascc.ConnectionManager.waitForConnected Waiting for client to connect to ZooKeeper
   [junit4]   2> 1147216 T6369 oascc.ConnectionManager.process Watcher org.apache.solr.common.cloud.ConnectionManager@1518d5d name:ZooKeeperConnection Watcher:127.0.0.1:52244 got event WatchedEvent state:SyncConnected type:None path:null path:null type:None
   [junit4]   2> 1147216 T6344 oascc.ConnectionManager.waitForConnected Client is connected to ZooKeeper
   [junit4]   2> 1147217 T6344 oascc.SolrZkClient.createZkACLProvider Using default ZkACLProvider
   [junit4]   2> 1147218 T6344 n:127.0.0.1:37816_xhc%2Fob oascc.ConnectionManager.waitForConnected Waiting for client to connect to ZooKeeper
   [junit4]   2> 1147219 T6372 n:127.0.0.1:37816_xhc%2Fob oascc.ConnectionManager.process Watcher org.apache.solr.common.cloud.ConnectionManager@17c0533 name:ZooKeeperConnection Watcher:127.0.0.1:52244/solr got event WatchedEvent state:SyncConnected type:None path:null path:null type:None
   [junit4]   2> 1147219 T6344 n:127.0.0.1:37816_xhc%2Fob oascc.ConnectionManager.waitForConnected Client is connected to ZooKeeper
   [junit4]   2> 1147220 T6344 n:127.0.0.1:37816_xhc%2Fob oascc.SolrZkClient.makePath makePath: /overseer/queue
   [junit4]   2> 1147222 T6344 n:127.0.0.1:37816_xhc%2Fob oascc.SolrZkClient.makePath makePath: /overseer/collection-queue-work
   [junit4]   2> 1147223 T6344 n:127.0.0.1:37816_xhc%2Fob oascc.SolrZkClient.makePath makePath: /overseer/collection-map-running
   [junit4]   2> 1147225 T6344 n:127.0.0.1:37816_xhc%2Fob oascc.SolrZkClient.makePath makePath: /overseer/collection-map-completed
   [junit4]   2> 1147226 T6344 n:127.0.0.1:37816_xhc%2Fob oascc.SolrZkClient.makePath makePath: /overseer/collection-map-failure
   [junit4]   2> 1147227 T6344 n:127.0.0.1:37816_xhc%2Fob oascc.SolrZkClient.makePath makePath: /live_nodes
   [junit4]   2> 1147228 T6344 n:127.0.0.1:37816_xhc%2Fob oascc.SolrZkClient.makePath makePath: /aliases.json
   [junit4]   2> 1147229 T6344 n:127.0.0.1:37816_xhc%2Fob oascc.SolrZkClient.makePath makePath: /clusterstate.json
   [junit4]   2> 1147230 T6344 n:127.0.0.1:37816_xhc%2Fob oasc.ZkController.createEphemeralLiveNode Register node as live in ZooKeeper:/live_nodes/127.0.0.1:37816_xhc%2Fob
   [junit4]   2> 1147231 T6344 n:127.0.0.1:37816_xhc%2Fob oascc.SolrZkClient.makePath makePath: /live_nodes/127.0.0.1:37816_xhc%2Fob
   [junit4]   2> 1147232 T6344 n:127.0.0.1:37816_xhc%2Fob oascc.SolrZkClient.makePath makePath: /overseer_elect
   [junit4]   2> 1147232 T6344 n:127.0.0.1:37816_xhc%2Fob oascc.SolrZkClient.makePath makePath: /overseer_elect/election
   [junit4]   2> 1147233 T6344 n:127.0.0.1:37816_xhc%2Fob oasc.Overseer.close Overseer (id=null) closing
   [junit4]   2> 1147235 T6344 n:127.0.0.1:37816_xhc%2Fob oasc.OverseerElectionContext.runLeaderProcess I am going to be the leader 127.0.0.1:37816_xhc%2Fob
   [junit4]   2> 1147235 T6344 n:127.0.0.1:37816_xhc%2Fob oascc.SolrZkClient.makePath makePath: /overseer_elect/leader
   [junit4]   2> 1147236 T6344 n:127.0.0.1:37816_xhc%2Fob oasc.Overseer.start Overseer (id=93796258173026307-127.0.0.1:37816_xhc%2Fob-n_0000000000) starting
   [junit4]   2> 1147237 T6344 n:127.0.0.1:37816_xhc%2Fob oascc.SolrZkClient.makePath makePath: /overseer/queue-work
   [junit4]   2> 1147240 T6344 n:127.0.0.1:37816_xhc%2Fob oasc.OverseerAutoReplicaFailoverThread.<init> Starting OverseerAutoReplicaFailoverThread autoReplicaFailoverWorkLoopDelay=10000 autoReplicaFailoverWaitAfterExpiration=30000 autoReplicaFailoverBadNodeExpiration=60000
   [junit4]   2> 1147240 T6374 n:127.0.0.1:37816_xhc%2Fob oasc.OverseerCollectionProcessor.run Process current queue of collection creations
   [junit4]   2> 1147240 T6344 n:127.0.0.1:37816_xhc%2Fob oascc.ZkStateReader.createClusterStateWatchersAndUpdate Updating cluster state from ZooKeeper... 
   [junit4]   2> 1147241 T6373 n:127.0.0.1:37816_xhc%2Fob oasc.Overseer$ClusterStateUpdater.run Starting to work on the main queue
   [junit4]   2> 1147243 T6344 n:127.0.0.1:37816_xhc%2Fob oasc.CorePropertiesLocator.discover Looking for core definitions underneath /home/jenkins/workspace/Lucene-Solr-trunk-Linux/solr/build/solr-core/test/J0/../../../../../../../../../home/jenkins/workspace/Lucene-Solr-trunk-Linux/solr/build/solr-core/test/J0/temp/solr.cloud.CollectionsAPIAsyncDistributedZkTest 9E35CA37475A538D-001/control-001/cores
   [junit4]   2> 1147244 T6344 n:127.0.0.1:37816_xhc%2Fob oasc.CoreDescriptor.<init> CORE DESCRIPTOR: {name=collection1, config=solrconfig.xml, transient=false, schema=schema.xml, loadOnStartup=true, instanceDir=/home/jenkins/workspace/Lucene-Solr-trunk-Linux/solr/build/solr-core/test/J0/../../../../../../../../../home/jenkins/workspace/Lucene-Solr-trunk-Linux/solr/build/solr-core/test/J0/temp/solr.cloud.CollectionsAPIAsyncDistributedZkTest 9E35CA37475A538D-001/control-001/cores/collection1, collection=control_collection, absoluteInstDir=/home/jenkins/workspace/Lucene-Solr-trunk-Linux/solr/build/solr-core/test/J0/../../../../../../../../../home/jenkins/workspace/Lucene-Solr-trunk-Linux/solr/build/solr-core/test/J0/temp/solr.cloud.CollectionsAPIAsyncDistributedZkTest 9E35CA37475A538D-001/control-001/cores/collection1/, coreNodeName=, dataDir=data/, shard=}
   [junit4]   2> 1147245 T6344 n:127.0.0.1:37816_xhc%2Fob oasc.CorePropertiesLocator.discoverUnder Found core collection1 in /home/jenkins/workspace/Lucene-Solr-trunk-Linux/solr/build/solr-core/test/J0/../../../../../../../../../home/jenkins/workspace/Lucene-Solr-trunk-Linux/solr/build/solr-core/test/J0/temp/solr.cloud.CollectionsAPIAsyncDistributedZkTest 9E35CA37475A538D-001/control-001/cores/collection1/
   [junit4]   2> 1147245 T6344 n:127.0.0.1:37816_xhc%2Fob oasc.CorePropertiesLocator.discover Found 1 core definitions
   [junit4]   2> 1147246 T6376 n:127.0.0.1:37816_xhc%2Fob c:control_collection x:collection1 oasc.ZkController.publish publishing core=collection1 state=down collection=control_collection
   [junit4]   2> 1147246 T6376 n:127.0.0.1:37816_xhc%2Fob c:control_collection x:collection1 oasc.ZkController.publish numShards not found on descriptor - reading it from system property
   [junit4]   2> 1147247 T6376 n:127.0.0.1:37816_xhc%2Fob oasc.ZkController.waitForCoreNodeName look for our core node name
   [junit4]   2> 1147247 T6372 n:127.0.0.1:37816_xhc%2Fob oasc.DistributedQueue$LatchWatcher.process NodeChildrenChanged fired on path /overseer/queue state SyncConnected
   [junit4]   2> 1147248 T6373 n:127.0.0.1:37816_xhc%2Fob oasc.Overseer$ClusterStateUpdater.run processMessage: queueSize: 1, message = {
   [junit4]   2> 	  "core":"collection1",
   [junit4]   2> 	  "roles":null,
   [junit4]   2> 	  "base_url":"http://127.0.0.1:37816/xhc/ob",
   [junit4]   2> 	  "node_name":"127.0.0.1:37816_xhc%2Fob",
   [junit4]   2> 	  "numShards":"1",
   [junit4]   2> 	  "state":"down",
   [junit4]   2> 	  "shard":null,
   [junit4]   2> 	  "collection":"control_collection",
   [junit4]   2> 	  "operation":"state"} current state version: 0
   [junit4]   2> 1147248 T6373 n:127.0.0.1:37816_xhc%2Fob oasco.ReplicaMutator.updateState Update state numShards=1 message={
   [junit4]   2> 	  "core":"collection1",
   [junit4]   2> 	  "roles":null,
   [junit4]   2> 	  "base_url":"http://127.0.0.1:37816/xhc/ob",
   [junit4]   2> 	  "node_name":"127.0.0.1:37816_xhc%2Fob",
   [junit4]   2> 	  "numShards":"1",
   [junit4]   2> 	  "state":"down",
   [junit4]   2> 	  "shard":null,
   [junit4]   2> 	  "collection":"control_collection",
   [junit4]   2> 	  "operation":"state"}
   [junit4]   2> 1147249 T6373 n:127.0.0.1:37816_xhc%2Fob oasco.ClusterStateMutator.createCollection building a new cName: control_collection
   [junit4]   2> 1147249 T6373 n:127.0.0.1:37816_xhc%2Fob oasco.ReplicaMutator.updateState Assigning new node to shard shard=shard1
   [junit4]   2> 1147250 T6372 n:127.0.0.1:37816_xhc%2Fob oascc.ZkStateReader$2.process A cluster state change: WatchedEvent state:SyncConnected type:NodeDataChanged path:/clusterstate.json, has occurred - updating... (live nodes size: 1)
   [junit4]   2> 1148247 T6376 n:127.0.0.1:37816_xhc%2Fob oasc.ZkController.waitForShardId waiting to find shard id in clusterstate for collection1
   [junit4]   2> 1148248 T6376 n:127.0.0.1:37816_xhc%2Fob oasc.ZkController.createCollectionZkNode Check for collection zkNode:control_collection
   [junit4]   2> 1148248 T6376 n:127.0.0.1:37816_xhc%2Fob oasc.ZkController.createCollectionZkNode Collection zkNode exists
   [junit4]   2> 1148248 T6376 n:127.0.0.1:37816_xhc%2Fob oascc.ZkStateReader.readConfigName Load collection config from:/collections/control_collection
   [junit4]   2> 1148249 T6376 n:127.0.0.1:37816_xhc%2Fob oascc.ZkStateReader.readConfigName path=/collections/control_collection configName=conf1 specified config exists in ZooKeeper
   [junit4]   2> 1148249 T6376 n:127.0.0.1:37816_xhc%2Fob oasc.SolrResourceLoader.<init> new SolrResourceLoader for directory: '/home/jenkins/workspace/Lucene-Solr-trunk-Linux/solr/build/solr-core/test/J0/../../../../../../../../../home/jenkins/workspace/Lucene-Solr-trunk-Linux/solr/build/solr-core/test/J0/temp/solr.cloud.CollectionsAPIAsyncDistributedZkTest 9E35CA37475A538D-001/control-001/cores/collection1/'
   [junit4]   2> 1148264 T6376 n:127.0.0.1:37816_xhc%2Fob oasc.Config.<init> loaded config solrconfig.xml with version 0 
   [junit4]   2> 1148269 T6376 n:127.0.0.1:37816_xhc%2Fob oasc.SolrConfig.refreshRequestParams current version of requestparams : -1
   [junit4]   2> 1148273 T6376 n:127.0.0.1:37816_xhc%2Fob oasc.SolrConfig.<init> Using Lucene MatchVersion: 6.0.0
   [junit4]   2> 1148294 T6376 n:127.0.0.1:37816_xhc%2Fob oasc.SolrConfig.<init> Loaded SolrConfig: solrconfig.xml
   [junit4]   2> 1148295 T6376 n:127.0.0.1:37816_xhc%2Fob oass.IndexSchema.readSchema Reading Solr Schema from /configs/conf1/schema.xml
   [junit4]   2> 1148305 T6376 n:127.0.0.1:37816_xhc%2Fob oass.IndexSchema.readSchema [collection1] Schema name=test
   [junit4]   2> 1148398 T6376 n:127.0.0.1:37816_xhc%2Fob oass.OpenExchangeRatesOrgProvider.init Initialized with rates=open-exchange-rates.json, refreshInterval=1440.
   [junit4]   2> 1148404 T6376 n:127.0.0.1:37816_xhc%2Fob oass.IndexSchema.readSchema default search field in schema is text
   [junit4]   2> 1148405 T6376 n:127.0.0.1:37816_xhc%2Fob oass.IndexSchema.readSchema unique key field: id
   [junit4]   2> 1148414 T6376 n:127.0.0.1:37816_xhc%2Fob oass.FileExchangeRateProvider.reload Reloading exchange rates from file currency.xml
   [junit4]   2> 1148417 T6376 n:127.0.0.1:37816_xhc%2Fob oass.FileExchangeRateProvider.reload Reloading exchange rates from file currency.xml
   [junit4]   2> 1148418 T6376 n:127.0.0.1:37816_xhc%2Fob oass.OpenExchangeRatesOrgProvider.reload Reloading exchange rates from open-exchange-rates.json
   [junit4]   2> 1148419 T6376 n:127.0.0.1:37816_xhc%2Fob oass.OpenExchangeRatesOrgProvider$OpenExchangeRates.<init> WARN Unknown key IMPORTANT NOTE
   [junit4]   2> 1148419 T6376 n:127.0.0.1:37816_xhc%2Fob oass.OpenExchangeRatesOrgProvider$OpenExchangeRates.<init> WARN Expected key, got STRING
   [junit4]   2> 1148419 T6376 n:127.0.0.1:37816_xhc%2Fob oass.OpenExchangeRatesOrgProvider.reload Reloading exchange rates from open-exchange-rates.json
   [junit4]   2> 1148420 T6376 n:127.0.0.1:37816_xhc%2Fob oass.OpenExchangeRatesOrgProvider$OpenExchangeRates.<init> WARN Unknown key IMPORTANT NOTE
   [junit4]   2> 1148420 T6376 n:127.0.0.1:37816_xhc%2Fob oass.OpenExchangeRatesOrgProvider$OpenExchangeRates.<init> WARN Expected key, got STRING
   [junit4]   2> 1148420 T6376 n:127.0.0.1:37816_xhc%2Fob oasc.CoreContainer.create Creating SolrCore 'collection1' using configuration from collection control_collection
   [junit4]   2> 1148420 T6376 n:127.0.0.1:37816_xhc%2Fob x:collection1 oasc.SolrCore.initDirectoryFactory org.apache.solr.core.MockDirectoryFactory
   [junit4]   2> 1148421 T6376 n:127.0.0.1:37816_xhc%2Fob x:collection1 oasc.SolrCore.<init> [[collection1] ] Opening new SolrCore at [/home/jenkins/workspace/Lucene-Solr-trunk-Linux/solr/build/solr-core/test/J0/../../../../../../../../../home/jenkins/workspace/Lucene-Solr-trunk-Linux/solr/build/solr-core/test/J0/temp/solr.cloud.CollectionsAPIAsyncDistributedZkTest 9E35CA37475A538D-001/control-001/cores/collection1/], dataDir=[null]
   [junit4]   2> 1148421 T6376 n:127.0.0.1:37816_xhc%2Fob x:collection1 oasc.JmxMonitoredMap.<init> JMX monitoring is enabled. Adding Solr mbeans to JMX Server: com.sun.jmx.mbeanserver.JmxMBeanServer@a9889
   [junit4]   2> 1148422 T6376 n:127.0.0.1:37816_xhc%2Fob x:collection1 oasc.CachingDirectoryFactory.get return new directory for /home/jenkins/workspace/Lucene-Solr-trunk-Linux/solr/build/solr-core/test/J0/../../../../../../../../../home/jenkins/workspace/Lucene-Solr-trunk-Linux/solr/build/solr-core/test/J0/temp/solr.cloud.CollectionsAPIAsyncDistributedZkTest 9E35CA37475A538D-001/control-001/cores/collection1/data
   [junit4]   2> 1148423 T6376 n:127.0.0.1:37816_xhc%2Fob x:collection1 oasc.SolrCore.getNewIndexDir New index directory detected: old=null new=/home/jenkins/workspace/Lucene-Solr-trunk-Linux/solr/build/solr-core/test/J0/../../../../../../../../../home/jenkins/workspace/Lucene-Solr-trunk-Linux/solr/build/solr-core/test/J0/temp/solr.cloud.CollectionsAPIAsyncDistributedZkTest 9E35CA37475A538D-001/control-001/cores/collection1/data/index/
   [junit4]   2> 1148423 T6376 n:127.0.0.1:37816_xhc%2Fob x:collection1 oasc.SolrCore.initIndex WARN [collection1] Solr index directory '/home/jenkins/workspace/Lucene-Solr-trunk-Linux/solr/build/solr-core/test/J0/../../../../../../../../../home/jenkins/workspace/Lucene-Solr-trunk-Linux/solr/build/solr-core/test/J0/temp/solr.cloud.CollectionsAPIAsyncDistributedZkTest 9E35CA37475A538D-001/control-001/cores/collection1/data/index' doesn't exist. Creating new index...
   [junit4]   2> 1148423 T6376 n:127.0.0.1:37816_xhc%2Fob x:collection1 oasc.CachingDirectoryFactory.get return new directory for /home/jenkins/workspace/Lucene-Solr-trunk-Linux/solr/build/solr-core/test/J0/../../../../../../../../../home/jenkins/workspace/Lucene-Solr-trunk-Linux/solr/build/solr-core/test/J0/temp/solr.cloud.CollectionsAPIAsyncDistributedZkTest 9E35CA37475A538D-001/control-001/cores/collection1/data/index
   [junit4]   2> 1148424 T6376 n:127.0.0.1:37816_xhc%2Fob x:collection1 oasu.RandomMergePolicy.<init> RandomMergePolicy wrapping class org.apache.lucene.index.TieredMergePolicy: [TieredMergePolicy: maxMergeAtOnce=21, maxMergeAtOnceExplicit=30, maxMergedSegmentMB=53.4638671875, floorSegmentMB=1.939453125, forceMergeDeletesPctAllowed=3.0104268233529763, segmentsPerTier=33.0, maxCFSSegmentSizeMB=8.796093022207999E12, noCFSRatio=0.8973011182782827
   [junit4]   2> 1148424 T6376 n:127.0.0.1:37816_xhc%2Fob x:collection1 oasc.SolrDeletionPolicy.onCommit SolrDeletionPolicy.onCommit: commits: num=1
   [junit4]   2> 		commit{dir=MockDirectoryWrapper(RAMDirectory@13e2ff lockFactory=org.apache.lucene.store.SingleInstanceLockFactory@136002),segFN=segments_1,generation=1}
   [junit4]   2> 1148425 T6376 n:127.0.0.1:37816_xhc%2Fob x:collection1 oasc.SolrDeletionPolicy.updateCommits newest commit generation = 1
   [junit4]   2> 1148429 T6376 n:127.0.0.1:37816_xhc%2Fob x:collection1 oasup.UpdateRequestProcessorChain.init creating updateRequestProcessorChain "nodistrib"
   [junit4]   2> 1148430 T6376 n:127.0.0.1:37816_xhc%2Fob x:collection1 oasup.UpdateRequestProcessorChain.init creating updateRequestProcessorChain "dedupe"
   [junit4]   2> 1148430 T6376 n:127.0.0.1:37816_xhc%2Fob x:collection1 oasup.UpdateRequestProcessorChain.init inserting DistributedUpdateProcessorFactory into updateRequestProcessorChain "dedupe"
   [junit4]   2> 1148430 T6376 n:127.0.0.1:37816_xhc%2Fob x:collection1 oasup.UpdateRequestProcessorChain.init creating updateRequestProcessorChain "stored_sig"
   [junit4]   2> 1148431 T6376 n:127.0.0.1:37816_xhc%2Fob x:collection1 oasup.UpdateRequestProcessorChain.init inserting DistributedUpdateProcessorFactory into updateRequestProcessorChain "stored_sig"
   [junit4]   2> 1148431 T6376 n:127.0.0.1:37816_xhc%2Fob x:collection1 oasup.UpdateRequestProcessorChain.init creating updateRequestProcessorChain "distrib-dup-test-chain-explicit"
   [junit4]   2> 1148431 T6376 n:127.0.0.1:37816_xhc%2Fob x:collection1 oasup.UpdateRequestProcessorChain.init creating updateRequestProcessorChain "distrib-dup-test-chain-implicit"
   [junit4]   2> 1148431 T6376 n:127.0.0.1:37816_xhc%2Fob x:collection1 oasup.UpdateRequestProcessorChain.init inserting DistributedUpdateProcessorFactory into updateRequestProcessorChain "distrib-dup-test-chain-implicit"
   [junit4]   2> 1148432 T6376 n:127.0.0.1:37816_xhc%2Fob x:collection1 oasc.SolrCore.loadUpdateProcessorChains no updateRequestProcessorChain defined as default, creating implicit default
   [junit4]   2> 1148433 T6376 n:127.0.0.1:37816_xhc%2Fob x:collection1 oashl.XMLLoader.init xsltCacheLifetimeSeconds=60
   [junit4]   2> 1148435 T6376 n:127.0.0.1:37816_xhc%2Fob x:collection1 oashl.XMLLoader.init xsltCacheLifetimeSeconds=60
   [junit4]   2> 1148436 T6376 n:127.0.0.1:37816_xhc%2Fob x:collection1 oashl.XMLLoader.init xsltCacheLifetimeSeconds=60
   [junit4]   2> 1148437 T6376 n:127.0.0.1:37816_xhc%2Fob x:collection1 oashl.XMLLoader.init xsltCacheLifetimeSeconds=60
   [junit4]   2> 1148443 T6376 n:127.0.0.1:37816_xhc%2Fob x:collection1 oasc.RequestHandlers.initHandlersFromConfig Registered paths: /admin/mbeans,standard,/update/csv,/update/json/docs,/admin/luke,/admin/segments,/get,/admin/system,/replication,/admin/properties,/config,/schema,/admin/plugins,/admin/logging,/update/json,/admin/threads,/admin/ping,/update,/admin/file
   [junit4]   2> 1148443 T6376 n:127.0.0.1:37816_xhc%2Fob x:collection1 oasc.SolrCore.initStatsCache Using default statsCache cache: org.apache.solr.search.stats.LocalStatsCache
   [junit4]   2> 1148444 T6376 n:127.0.0.1:37816_xhc%2Fob x:collection1 oasu.UpdateHandler.<init> Using UpdateLog implementation: org.apache.solr.update.UpdateLog
   [junit4]   2> 1148444 T6376 n:127.0.0.1:37816_xhc%2Fob x:collection1 oasu.UpdateLog.init Initializing UpdateLog: dataDir= defaultSyncLevel=FLUSH numRecordsToKeep=100 maxNumLogsToKeep=10
   [junit4]   2> 1148444 T6376 n:127.0.0.1:37816_xhc%2Fob x:collection1 oasu.CommitTracker.<init> Hard AutoCommit: disabled
   [junit4]   2> 1148445 T6376 n:127.0.0.1:37816_xhc%2Fob x:collection1 oasu.CommitTracker.<init> Soft AutoCommit: disabled
   [junit4]   2> 1148445 T6376 n:127.0.0.1:37816_xhc%2Fob x:collection1 oasu.RandomMergePolicy.<init> RandomMergePolicy wrapping class org.apache.lucene.index.AlcoholicMergePolicy: [AlcoholicMergePolicy: minMergeSize=0, mergeFactor=10, maxMergeSize=1333266302, maxMergeSizeForForcedMerge=9223372036854775807, calibrateSizeByDeletes=true, maxMergeDocs=2147483647, maxCFSSegmentSizeMB=8.796093022207999E12, noCFSRatio=0.1]
   [junit4]   2> 1148446 T6376 n:127.0.0.1:37816_xhc%2Fob x:collection1 oasc.SolrDeletionPolicy.onInit SolrDeletionPolicy.onInit: commits: num=1
   [junit4]   2> 		commit{dir=MockDirectoryWrapper(RAMDirectory@13e2ff lockFactory=org.apache.lucene.store.SingleInstanceLockFactory@136002),segFN=segments_1,generation=1}
   [junit4]   2> 1148447 T6376 n:127.0.0.1:37816_xhc%2Fob x:collection1 oasc.SolrDeletionPolicy.updateCommits newest commit generation = 1
   [junit4]   2> 1148447 T6376 n:127.0.0.1:37816_xhc%2Fob x:collection1 oass.SolrIndexSearcher.<init> Opening Searcher@b801c3[collection1] main
   [junit4]   2> 1148447 T6376 n:127.0.0.1:37816_xhc%2Fob x:collection1 oascc.ZkStateReader.readConfigName Load collection config from:/collections/control_collection
   [junit4]   2> 1148448 T6376 n:127.0.0.1:37816_xhc%2Fob x:collection1 oascc.ZkStateReader.readConfigName path=/collections/control_collection configName=conf1 specified config exists in ZooKeeper
   [junit4]   2> 1148448 T6376 n:127.0.0.1:37816_xhc%2Fob x:collection1 oasr.ManagedResourceStorage.newStorageIO Setting up ZooKeeper-based storage for the RestManager with znodeBase: /configs/conf1
   [junit4]   2> 1148448 T6376 n:127.0.0.1:37816_xhc%2Fob x:collection1 oasr.ManagedResourceStorage$ZooKeeperStorageIO.configure Configured ZooKeeperStorageIO with znodeBase: /configs/conf1
   [junit4]   2> 1148448 T6376 n:127.0.0.1:37816_xhc%2Fob x:collection1 oasr.RestManager.init Initializing RestManager with initArgs: {}
   [junit4]   2> 1148449 T6376 n:127.0.0.1:37816_xhc%2Fob x:collection1 oasr.ManagedResourceStorage.load Reading _rest_managed.json using ZooKeeperStorageIO:path=/configs/conf1
   [junit4]   2> 1148449 T6376 n:127.0.0.1:37816_xhc%2Fob x:collection1 oasr.ManagedResourceStorage$ZooKeeperStorageIO.openInputStream No data found for znode /configs/conf1/_rest_managed.json
   [junit4]   2> 1148449 T6376 n:127.0.0.1:37816_xhc%2Fob x:collection1 oasr.ManagedResourceStorage.load Loaded null at path _rest_managed.json using ZooKeeperStorageIO:path=/configs/conf1
   [junit4]   2> 1148449 T6376 n:127.0.0.1:37816_xhc%2Fob x:collection1 oasr.RestManager.init Initializing 0 registered ManagedResources
   [junit4]   2> 1148450 T6376 n:127.0.0.1:37816_xhc%2Fob x:collection1 oash.ReplicationHandler.inform Commits will be reserved for  10000
   [junit4]   2> 1148451 T6376 n:127.0.0.1:37816_xhc%2Fob x:collection1 oasc.ZkController.getConfDirListeners watch zkdir /configs/conf1
   [junit4]   2> 1148451 T6376 n:127.0.0.1:37816_xhc%2Fob x:collection1 oasc.CoreContainer.registerCore registering core: collection1
   [junit4]   2> 1148452 T6377 n:127.0.0.1:37816_xhc%2Fob x:collection1 oasc.SolrCore.registerSearcher [collection1] Registered new searcher Searcher@b801c3[collection1] main{ExitableDirectoryReader(UninvertingDirectoryReader())}
   [junit4]   2> 1148452 T6380 n:127.0.0.1:37816_xhc%2Fob c:control_collection s:shard1 x:collection1 oasc.ZkController.register Register replica - core:collection1 address:http://127.0.0.1:37816/xhc/ob collection:control_collection shard:shard1
   [junit4]   2> 1148452 T6344 n:127.0.0.1:37816_xhc%2Fob oass.SolrDispatchFilter.init user.dir=/home/jenkins/workspace/Lucene-Solr-trunk-Linux/solr/build/solr-core/test/J0
   [junit4]   2> 1148452 T6380 n:127.0.0.1:37816_xhc%2Fob c:control_collection s:shard1 x:collection1 oascc.SolrZkClient.makePath makePath: /collections/control_collection/leader_elect/shard1/election
   [junit4]   2> 1148453 T6344 n:127.0.0.1:37816_xhc%2Fob oass.SolrDispatchFilter.init SolrDispatchFilter.init() done
   [junit4]   2> 1148455 T6380 n:127.0.0.1:37816_xhc%2Fob c:control_collection s:shard1 x:collection1 oasc.ShardLeaderElectionContext.runLeaderProcess Running the leader process for shard shard1
   [junit4]   2> 1148455 T6344 oascc.SolrZkClient.createZkCredentialsToAddAutomatically Using default ZkCredentialsProvider
   [junit4]   2> 1148456 T6344 oascc.ConnectionManager.waitForConnected Waiting for client to connect to ZooKeeper
   [junit4]   2> 1148456 T6372 n:127.0.0.1:37816_xhc%2Fob oasc.DistributedQueue$LatchWatcher.process NodeChildrenChanged fired on path /overseer/queue state SyncConnected
   [junit4]   2> 1148456 T6380 n:127.0.0.1:37816_xhc%2Fob c:control_collection s:shard1 x:collection1 oasc.ShardLeaderElectionContext.waitForReplicasToComeUp Enough replicas found to continue.
   [junit4]   2> 1148457 T6380 n:127.0.0.1:37816_xhc%2Fob c:control_collection s:shard1 x:collection1 oasc.ShardLeaderElectionContext.runLeaderProcess I may be the new leader - try and sync
   [junit4]   2> 1148457 T6373 n:127.0.0.1:37816_xhc%2Fob oasc.Overseer$ClusterStateUpdater.run processMessage: queueSize: 1, message = {
   [junit4]   2> 	  "operation":"leader",
   [junit4]   2> 	  "shard":"shard1",
   [junit4]   2> 	  "collection":"control_collection"} current state version: 1
   [junit4]   2> 1148457 T6383 oascc.ConnectionManager.process Watcher org.apache.solr.common.cloud.ConnectionManager@176c4bf name:ZooKeeperConnection Watcher:127.0.0.1:52244/solr got event WatchedEvent state:SyncConnected type:None path:null path:null type:None
   [junit4]   2> ASYNC  NEW_CORE C16013 name=collection1 org.apache.solr.core.SolrCore@b5091c url=http://127.0.0.1:37816/xhc/ob/collection1 node=127.0.0.1:37816_xhc%2Fob C16013_STATE=coll:control_collection core:collection1 props:{core=collection1, base_url=http://127.0.0.1:37816/xhc/ob, node_name=127.0.0.1:37816_xhc%2Fob, state=down}
   [junit4]   2> 1148457 T6380 n:127.0.0.1:37816_xhc%2Fob c:control_collection s:shard1 x:collection1 C16013 oasc.SyncStrategy.sync Sync replicas to http://127.0.0.1:37816/xhc/ob/collection1/
   [junit4]   2> 1148457 T6344 oascc.ConnectionManager.waitForConnected Client is connected to ZooKeeper
   [junit4]   2> 1148459 T6380 n:127.0.0.1:37816_xhc%2Fob c:control_collection s:shard1 x:collection1 C16013 oasc.SyncStrategy.syncReplicas Sync Success - now sync replicas to me
   [junit4]   2> 1148459 T6380 n:127.0.0.1:37816_xhc%2Fob c:control_collection s:shard1 x:collection1 C16013 oasc.SyncStrategy.syncToMe http://127.0.0.1:37816/xhc/ob/collection1/ has no replicas
   [junit4]   2> 1148459 T6380 n:127.0.0.1:37816_xhc%2Fob c:control_collection s:shard1 x:collection1 oasc.ShardLeaderElectionContext.runLeaderProcess I am the new leader: http://127.0.0.1:37816/xhc/ob/collection1/ shard1
   [junit4]   2> 1148459 T6344 oascc.SolrZkClient.createZkACLProvider Using default ZkACLProvider
   [junit4]   2> 1148460 T6344 oascc.ZkStateReader.createClusterStateWatchersAndUpdate Updating cluster state from ZooKeeper... 
   [junit4]   2> 1148459 T6380 n:127.0.0.1:37816_xhc%2Fob c:control_collection s:shard1 x:collection1 oascc.SolrZkClient.makePath makePath: /collections/control_collection/leaders/shard1
   [junit4]   2> 1148462 T6344 oasc.ChaosMonkey.monkeyLog monkey: init - expire sessions:false cause connection loss:false
   [junit4]   2> 1148462 T6344 oasc.AbstractFullDistribZkTestBase.createJettys Creating collection1 with stateFormat=2
   [junit4]   2> 1148462 T6344 oascc.SolrZkClient.createZkCredentialsToAddAutomatically Using default ZkCredentialsProvider
   [junit4]   2> 1148463 T6344 oascc.ConnectionManager.waitForConnected Waiting for client to connect to ZooKeeper
   [junit4]   2> 1148463 T6372 n:127.0.0.1:37816_xhc%2Fob oasc.DistributedQueue$LatchWatcher.process NodeChildrenChanged fired on path /overseer/queue state SyncConnected
   [junit4]   2> 1148463 T6386 oascc.ConnectionManager.process Watcher org.apache.solr.common.cloud.ConnectionManager@927195 name:ZooKeeperConnection Watcher:127.0.0.1:52244/solr got event WatchedEvent state:SyncConnected type:None path:null path:null type:None
   [junit4]   2> 1148464 T6344 oascc.ConnectionManager.waitForConnected Client is connected to ZooKeeper
   [junit4]   2> 1148464 T6373 n:127.0.0.1:37816_xhc%2Fob oasc.Overseer$ClusterStateUpdater.run processMessage: queueSize: 1, message = {
   [junit4]   2> 	  "operation":"leader",
   [junit4]   2> 	  "shard":"shard1",
   [junit4]   2> 	  "collection":"control_collection",
   [junit4]   2> 	  "base_url":"http://127.0.0.1:37816/xhc/ob",
   [junit4]   2> 	  "core":"collection1",
   [junit4]   2> 	  "state":"active"} current state version: 1
   [junit4]   2> 1148464 T6344 oascc.SolrZkClient.createZkACLProvider Using default ZkACLProvider
   [junit4]   2> 1148465 T6373 n:127.0.0.1:37816_xhc%2Fob oasc.Overseer$ClusterStateUpdater.run processMessage: queueSize: 1, message = {
   [junit4]   2> 	  "operation":"create",
   [junit4]   2> 	  "name":"collection1",
   [junit4]   2> 	  "numShards":"1",
   [junit4]   2> 	  "stateFormat":"2"} current state version: 1
   [junit4]   2> 1148466 T6373 n:127.0.0.1:37816_xhc%2Fob oasco.ClusterStateMutator.createCollection building a new cName: collection1
   [junit4]   2> 1148466 T6372 n:127.0.0.1:37816_xhc%2Fob oascc.ZkStateReader$2.process A cluster state change: WatchedEvent state:SyncConnected type:NodeDataChanged path:/clusterstate.json, has occurred - updating... (live nodes size: 1)
   [junit4]   2> 1148466 T6383 oascc.ZkStateReader$2.process A cluster state change: WatchedEvent state:SyncConnected type:NodeDataChanged path:/clusterstate.json, has occurred - updating... (live nodes size: 1)
   [junit4]   2> 1148469 T6372 n:127.0.0.1:37816_xhc%2Fob oasc.DistributedQueue$LatchWatcher.process NodeChildrenChanged fired on path /overseer/queue state SyncConnected
   [junit4]   2> 1148469 T6373 n:127.0.0.1:37816_xhc%2Fob oasco.ZkStateWriter.writePendingUpdates going to create_collection /collections/collection1/state.json
   [junit4]   2> 1148471 T6372 n:127.0.0.1:37816_xhc%2Fob oascc.ZkStateReader$2.process A cluster state change: WatchedEvent state:SyncConnected type:NodeDataChanged path:/clusterstate.json, has occurred - updating... (live nodes size: 1)
   [junit4]   2> 1148471 T6383 oascc.ZkStateReader$2.process A cluster state change: WatchedEvent state:SyncConnected type:NodeDataChanged path:/clusterstate.json, has occurred - updating... (live nodes size: 1)
   [junit4]   2> 1148514 T6380 n:127.0.0.1:37816_xhc%2Fob c:control_collection s:shard1 x:collection1 oasc.ZkController.register We are http://127.0.0.1:37816/xhc/ob/collection1/ and leader is http://127.0.0.1:37816/xhc/ob/collection1/
   [junit4]   2> 1148514 T6380 n:127.0.0.1:37816_xhc%2Fob c:control_collection s:shard1 x:collection1 oasc.ZkController.register No LogReplay needed for core=collection1 baseURL=http://127.0.0.1:37816/xhc/ob
   [junit4]   2> 1148514 T6380 n:127.0.0.1:37816_xhc%2Fob c:control_collection s:shard1 x:collection1 oasc.ZkController.checkRecovery I am the leader, no recovery necessary
   [junit4]   2> 1148514 T6380 n:127.0.0.1:37816_xhc%2Fob c:control_collection s:shard1 x:collection1 oasc.ZkController.publish publishing core=collection1 state=active collection=control_collection
   [junit4]   2> 1148515 T6380 n:127.0.0.1:37816_xhc%2Fob c:control_collection s:shard1 x:collection1 oasc.ZkController.publish numShards not found on descriptor - reading it from system property
   [junit4]   2> 1148516 T6372 n:127.0.0.1:37816_xhc%2Fob oasc.DistributedQueue$LatchWatcher.process NodeChildrenChanged fired on path /overseer/queue state SyncConnected
   [junit4]   2> 1148516 T6373 n:127.0.0.1:37816_xhc%2Fob oasc.Overseer$ClusterStateUpdater.run processMessage: queueSize: 1, message = {
   [junit4]   2> 	  "core":"collection1",
   [junit4]   2> 	  "core_node_name":"core_node1",
   [junit4]   2> 	  "roles":null,
   [junit4]   2> 	  "base_url":"http://127.0.0.1:37816/xhc/ob",
   [junit4]   2> 	  "node_name":"127.0.0.1:37816_xhc%2Fob",
   [junit4]   2> 	  "numShards":"1",
   [junit4]   2> 	  "state":"active",
   [junit4]   2> 	  "shard":"shard1",
   [junit4]   2> 	  "collection":"control_collection",
   [junit4]   2> 	  "operation":"state"} current state version: 3
   [junit4]   2> 1148517 T6373 n:127.0.0.1:37816_xhc%2Fob oasco.ReplicaMutator.updateState Update state numShards=1 message={
   [junit4]   2> 	  "core":"collection1",
   [junit4]   2> 	  "core_node_name":"core_node1",
   [junit4]   2> 	  "roles":null,
   [junit4]   2> 	  "base_url":"http://127.0.0.1:37816/xhc/ob",
   [junit4]   2> 	  "node_name":"127.0.0.1:37816_xhc%2Fob",
   [junit4]   2> 	  "numShards":"1",
   [junit4]   2> 	  "state":"active",
   [junit4]   2> 	  "shard":"shard1",
   [junit4]   2> 	  "collection":"control_collection",
   [junit4]   2> 	  "operation":"state"}
   [junit4]   2> 1148523 T6344 oas.SolrTestCaseJ4.writeCoreProperties Writing core.properties file to /home/jenkins/workspace/Lucene-Solr-trunk-Linux/solr/build/solr-core/test/J0/temp/solr.cloud.CollectionsAPIAsyncDistributedZkTest 9E35CA37475A538D-001/shard-1-001/cores/collection1
   [junit4]   2> 1148524 T6344 oasc.AbstractFullDistribZkTestBase.createJettys create jetty 1 in directory /home/jenkins/workspace/Lucene-Solr-trunk-Linux/solr/build/solr-core/test/J0/temp/solr.cloud.CollectionsAPIAsyncDistributedZkTest 9E35CA37475A538D-001/shard-1-001
   [junit4]   2> 1148525 T6344 oejs.Server.doStart jetty-9.2.10.v20150310
   [junit4]   2> 1148526 T6344 oejsh.ContextHandler.doStart Started o.e.j.s.ServletContextHandler@3faf7c{/xhc/ob,null,AVAILABLE}
   [junit4]   2> 1148527 T6344 oejs.AbstractConnector.doStart Started ServerConnector@7da98{HTTP/1.1}{127.0.0.1:56854}
   [junit4]   2> 1148527 T6344 oejs.Server.doStart Started @1149213ms
   [junit4]   2> 1148528 T6344 oascse.JettySolrRunner$1.lifeCycleStarted Jetty properties: {solrconfig=solrconfig.xml, hostContext=/xhc/ob, hostPort=56854, coreRootDirectory=/home/jenkins/workspace/Lucene-Solr-trunk-Linux/solr/build/solr-core/test/J0/temp/solr.cloud.CollectionsAPIAsyncDistributedZkTest 9E35CA37475A538D-001/shard-1-001/cores}
   [junit4]   2> 1148528 T6344 oass.SolrDispatchFilter.init SolrDispatchFilter.init()sun.misc.Launcher$AppClassLoader@e2f2a
   [junit4]   2> 1148528 T6344 oasc.SolrResourceLoader.<init> new SolrResourceLoader for directory: '/home/jenkins/workspace/Lucene-Solr-trunk-Linux/solr/build/solr-core/test/J0/temp/solr.cloud.CollectionsAPIAsyncDistributedZkTest 9E35CA37475A538D-001/shard-1-001/'
   [junit4]   2> 1148546 T6344 oasc.SolrXmlConfig.fromFile Loading container configuration from /home/jenkins/workspace/Lucene-Solr-trunk-Linux/solr/build/solr-core/test/J0/temp/solr.cloud.CollectionsAPIAsyncDistributedZkTest 9E35CA37475A538D-001/shard-1-001/solr.xml
   [junit4]   2> 1148551 T6344 oasc.CorePropertiesLocator.<init> Config-defined core root directory: /home/jenkins/workspace/Lucene-Solr-trunk-Linux/solr/build/solr-core/test/J0/temp/solr.cloud.CollectionsAPIAsyncDistributedZkTest 9E35CA37475A538D-001/shard-1-001/cores
   [junit4]   2> 1148551 T6344 oasc.CoreContainer.<init> New CoreContainer 32507219
   [junit4]   2> 1148552 T6344 oasc.CoreContainer.load Loading cores into CoreContainer [instanceDir=/home/jenkins/workspace/Lucene-Solr-trunk-Linux/solr/build/solr-core/test/J0/temp/solr.cloud.CollectionsAPIAsyncDistributedZkTest 9E35CA37475A538D-001/shard-1-001/]
   [junit4]   2> 1148552 T6344 oasc.CoreContainer.load loading shared library: /home/jenkins/workspace/Lucene-Solr-trunk-Linux/solr/build/solr-core/test/J0/temp/solr.cloud.CollectionsAPIAsyncDistributedZkTest 9E35CA37475A538D-001/shard-1-001/lib
   [junit4]   2> 1148552 T6344 oasc.SolrResourceLoader.addToClassLoader WARN Can't find (or read) directory to add to classloader: lib (resolved as: /home/jenkins/workspace/Lucene-Solr-trunk-Linux/solr/build/solr-core/test/J0/temp/solr.cloud.CollectionsAPIAsyncDistributedZkTest 9E35CA37475A538D-001/shard-1-001/lib).
   [junit4]   2> 1148559 T6344 oashc.HttpShardHandlerFactory.init created with socketTimeout : 90000,urlScheme : ,connTimeout : 15000,maxConnectionsPerHost : 20,maxConnections : 10000,corePoolSize : 0,maximumPoolSize : 2147483647,maxThreadIdleTime : 5,sizeOfQueue : -1,fairnessPolicy : false,useRetries : false,
   [junit4]   2> 1148560 T6344 oasu.UpdateShardHandler.<init> Creating UpdateShardHandler HTTP client with params: socketTimeout=340000&connTimeout=45000&retry=true
   [junit4]   2> 1148561 T6344 oasl.LogWatcher.createWatcher SLF4J impl is org.slf4j.impl.Log4jLoggerFactory
   [junit4]   2> 1148561 T6344 oasl.LogWatcher.newRegisteredLogWatcher Registering Log Listener [Log4j (org.slf4j.impl.Log4jLoggerFactory)]
   [junit4]   2> 1148562 T6344 oasc.CoreContainer.load Node Name: 127.0.0.1
   [junit4]   2> 1148562 T6344 oasc.ZkContainer.initZooKeeper Zookeeper client=127.0.0.1:52244/solr
   [junit4]   2> 1148562 T6344 oasc.ZkController.checkChrootPath zkHost includes chroot
   [junit4]   2> 1148563 T6344 oascc.SolrZkClient.createZkCredentialsToAddAutomatically Using default ZkCredentialsProvider
   [junit4]   2> 1148563 T6344 oascc.ConnectionManager.waitForConnected Waiting for client to connect to ZooKeeper
   [junit4]   2> 1148564 T6400 oascc.ConnectionManager.process Watcher org.apache.solr.common.cloud.ConnectionManager@ac5747 name:ZooKeeperConnection Watcher:127.0.0.1:52244 got event WatchedEvent state:SyncConnected type:None path:null path:null type:None
   [junit4]   2> 1148565 T6344 oascc.ConnectionManager.waitForConnected Client is connected to ZooKeeper
   [junit4]   2> 1148565 T6344 oascc.SolrZkClient.createZkACLProvider Using default ZkACLProvider
   [junit4]   2> 1148567 T6344 n:127.0.0.1:56854_xhc%2Fob oascc.ConnectionManager.waitForConnected Waiting for client to connect to ZooKeeper
   [junit4]   2> 1148567 T6403 n:127.0.0.1:56854_xhc%2Fob oascc.ConnectionManager.process Watcher org.apache.solr.common.cloud.ConnectionManager@d97be4 name:ZooKeeperConnection Watcher:127.0.0.1:52244/solr got event WatchedEvent state:SyncConnected type:None path:null path:null type:None
   [junit4]   2> 1148568 T6344 n:127.0.0.1:56854_xhc%2Fob oascc.ConnectionManager.waitForConnected Client is connected to ZooKeeper
   [junit4]   2> 1148571 T6344 n:127.0.0.1:56854_xhc%2Fob oascc.ZkStateReader.createClusterStateWatchersAndUpdate Updating cluster state from ZooKeeper... 
   [junit4]   2> 1148619 T6403 n:127.0.0.1:56854_xhc%2Fob oascc.ZkStateReader$2.process A cluster state change: WatchedEvent state:SyncConnected type:NodeDataChanged path:/clusterstate.json, has occurred - updating... (live nodes size: 1)
   [junit4]   2> 1148619 T6383 oascc.ZkStateReader$2.process A cluster state change: WatchedEvent state:SyncConnected type:NodeDataChanged path:/clusterstate.json, has occurred - updating... (live nodes size: 1)
   [junit4]   2> 1148619 T6372 n:127.0.0.1:37816_xhc%2Fob oascc.ZkStateReader$2.process A cluster state change: WatchedEvent state:SyncConnected type:NodeDataChanged path:/clusterstate.json, has occurred - updating... (live nodes size: 1)
   [junit4]   2> 1149573 T6344 n:127.0.0.1:56854_xhc%2Fob oasc.ZkController.createEphemeralLiveNode Register node as live in ZooKeeper:/live_nodes/127.0.0.1:56854_xhc%2Fob
   [junit4]   2> 1149574 T6344 n:127.0.0.1:56854_xhc%2Fob oascc.SolrZkClient.makePath makePath: /live_nodes/127.0.0.1:56854_xhc%2Fob
   [junit4]   2> 1149576 T6344 n:127.0.0.1:56854_xhc%2Fob oasc.Overseer.close Overseer (id=null) closing
   [junit4]   2> 1149577 T6344 n:127.0.0.1:56854_xhc%2Fob oasc.CorePropertiesLocator.discover Looking for core definitions underneath /home/jenkins/workspace/Lucene-Solr-trunk-Linux/solr/build/solr-core/test/J0/temp/solr.cloud.CollectionsAPIAsyncDistributedZkTest 9E35CA37475A538D-001/shard-1-001/cores
   [junit4]   2> 1149578 T6344 n:127.0.0.1:56854_xhc%2Fob oasc.CoreDescriptor.<init> CORE DESCRIPTOR: {name=collection1, config=solrconfig.xml, transient=false, schema=schema.xml, loadOnStartup=true, instanceDir=/home/jenkins/workspace/Lucene-Solr-trunk-Linux/solr/build/solr-core/test/J0/temp/solr.cloud.CollectionsAPIAsyncDistributedZkTest 9E35CA37475A538D-001/shard-1-001/cores/collection1, collection=collection1, absoluteInstDir=/home/jenkins/workspace/Lucene-Solr-trunk-Linux/solr/build/solr-core/test/J0/temp/solr.cloud.CollectionsAPIAsyncDistributedZkTest 9E35CA37475A538D-001/shard-1-001/cores/collection1/, coreNodeName=, dataDir=data/, shard=}
   [junit4]   2> 1149578 T6344 n:127.0.0.1:56854_xhc%2Fob oasc.CorePropertiesLocator.discoverUnder Found core collection1 in /home/jenkins/workspace/Lucene-Solr-trunk-Linux/solr/build/solr-core/test/J0/temp/solr.cloud.CollectionsAPIAsyncDistributedZkTest 9E35CA37475A538D-001/shard-1-001/cores/collection1/
   [junit4]   2> 1149579 T6344 n:127.0.0.1:56854_xhc%2Fob oasc.CorePropertiesLocator.discover Found 1 core definitions
   [junit4]   2> 1149580 T6404 n:127.0.0.1:56854_xhc%2Fob c:collection1 x:collection1 oasc.ZkController.publish publishing core=collection1 state=down collection=collection1
   [junit4]   2> 1149581 T6404 n:127.0.0.1:56854_xhc%2Fob c:collection1 x:collection1 oasc.ZkController.publish numShards not found on descriptor - reading it from system property
   [junit4]   2> 1149582 T6372 n:127.0.0.1:37816_xhc%2Fob oasc.DistributedQueue$LatchWatcher.process NodeChildrenChanged fired on path /overseer/queue state SyncConnected
   [junit4]   2> 1149582 T6404 n:127.0.0.1:56854_xhc%2Fob oasc.ZkController.preRegister Registering watch for external collection collection1
   [junit4]   2> 1149582 T6404 n:127.0.0.1:56854_xhc%2Fob oascc.ZkStateReader.addZkWatch addZkWatch collection1
   [junit4]   2> 1149582 T6373 n:127.0.0.1:37816_xhc%2Fob oasc.Overseer$ClusterStateUpdater.run processMessage: queueSize: 1, message = {
   [junit4]   2> 	  "core":"collection1",
   [junit4]   2> 	  "roles":null,
   [junit4]   2> 	  "base_url":"http://127.0.0.1:56854/xhc/ob",
   [junit4]   2> 	  "node_name":"127.0.0.1:56854_xhc%2Fob",
   [junit4]   2> 	  "numShards":"1",
   [junit4]   2> 	  "state":"down",
   [junit4]   2> 	  "shard":null,
   [junit4]   2> 	  "collection":"collection1",
   [junit4]   2> 	  "operation":"state"} current state version: 4
   [junit4]   2> 1149583 T6404 n:127.0.0.1:56854_xhc%2Fob oascc.ZkStateReader.addZkWatch Updating collection state at /collections/collection1/state.json from ZooKeeper... 
   [junit4]   2> 1149583 T6373 n:127.0.0.1:37816_xhc%2Fob oasco.ReplicaMutator.updateState Update state numShards=1 message={
   [junit4]   2> 	  "core":"collection1",
   [junit4]   2> 	  "roles":null,
   [junit4]   2> 	  "base_url":"http://127.0.0.1:56854/xhc/ob",
   [junit4]   2> 	  "node_name":"127.0.0.1:56854_xhc%2Fob",
   [junit4]   2> 	  "numShards":"1",
   [junit4]   2> 	  "state":"down",
   [junit4]   2> 	  "shard":null,
   [junit4]   2> 	  "collection":"collection1",
   [junit4]   2> 	  "operation":"state"}
   [junit4]   2> 1149583 T6404 n:127.0.0.1:56854_xhc%2Fob oascc.ZkStateReader.updateWatchedCollection Updating data for collection1 to ver 0 
   [junit4]   2> 1149584 T6373 n:127.0.0.1:37816_xhc%2Fob oasco.ReplicaMutator.updateState Collection already exists with numShards=1
   [junit4]   2> 1149584 T6404 n:127.0.0.1:56854_xhc%2Fob oasc.ZkController.waitForCoreNodeName look for our core node name
   [junit4]   2> 1149584 T6373 n:127.0.0.1:37816_xhc%2Fob oasco.ReplicaMutator.updateState Assigning new node to shard shard=shard1
   [junit4]   2> 1149686 T6373 n:127.0.0.1:37816_xhc%2Fob oasco.ZkStateWriter.writePendingUpdates going to update_collection /collections/collection1/state.json version: 0
   [junit4]   2> 1149687 T6403 n:127.0.0.1:56854_xhc%2Fob oascc.ZkStateReader$7.process A cluster state change: WatchedEvent state:SyncConnected type:NodeDataChanged path:/collections/collection1/state.json for collection collection1 has occurred - updating... (live nodes size: 2)
   [junit4]   2> 1149688 T6403 n:127.0.0.1:56854_xhc%2Fob oascc.ZkStateReader.updateWatchedCollection Updating data for collection1 to ver 1 
   [junit4]   2> 1150584 T6404 n:127.0.0.1:56854_xhc%2Fob oasc.ZkController.waitForShardId waiting to find shard id in clusterstate for collection1
   [junit4]   2> 1150585 T6404 n:127.0.0.1:56854_xhc%2Fob oasc.ZkController.createCollectionZkNode Check for collection zkNode:collection1
   [junit4]   2> 1150585 T6404 n:127.0.0.1:56854_xhc%2Fob oasc.ZkController.createCollectionZkNode Collection zkNode exists
   [junit4]   2> 1150585 T6404 n:127.0.0.1:56854_xhc%2Fob oascc.ZkStateReader.readConfigName Load collection config from:/collections/collection1
   [junit4]   2> 1150586 T6404 n:127.0.0.1:56854_xhc%2Fob oascc.ZkStateReader.readConfigName path=/collections/collection1 configName=conf1 specified config exists in ZooKeeper
   [junit4]   2> 1150586 T6404 n:127.0.0.1:56854_xhc%2Fob oasc.SolrResourceLoader.<init> new SolrResourceLoader for directory: '/home/jenkins/workspace/Lucene-Solr-trunk-Linux/solr/build/solr-core/test/J0/temp/solr.cloud.CollectionsAPIAsyncDistributedZkTest 9E35CA37475A538D-001/shard-1-001/cores/collection1/'
   [junit4]   2> 1150601 T6404 n:127.0.0.1:56854_xhc%2Fob oasc.Config.<init> loaded config solrconfig.xml with version 0 
   [junit4]   2> 1150605 T6404 n:127.0.0.1:56854_xhc%2Fob oasc.SolrConfig.refreshRequestParams current version of requestparams : -1
   [junit4]   2> 1150620 T6404 n:127.0.0.1:56854_xhc%2Fob oasc.SolrConfig.<init> Using Lucene MatchVersion: 6.0.0
   [junit4]   2> 1150631 T6404 n:127.0.0.1:56854_xhc%2Fob oasc.SolrConfig.<init> Loaded SolrConfig: solrconfig.xml
   [junit4]   2> 1150632 T6404 n:127.0.0.1:56854_xhc%2Fob oass.IndexSchema.readSchema Reading Solr Schema from /configs/conf1/schema.xml
   [junit4]   2> 1150640 T6404 n:127.0.0.1:56854_xhc%2Fob oass.IndexSchema.readSchema [collection1] Schema name=test
   [junit4]   2> 1150728 T6404 n:127.0.0.1:56854_xhc%2Fob oass.OpenExchangeRatesOrgProvider.init Initialized with rates=open-exchange-rates.json, refreshInterval=1440.
   [junit4]   2> 1150734 T6404 n:127.0.0.1:56854_xhc%2Fob oass.IndexSchema.readSchema default search field in schema is text
   [junit4]   2> 1150735 T6404 n:127.0.0.1:56854_xhc%2Fob oass.IndexSchema.readSchema unique key field: id
   [junit4]   2> 1150744 T6404 n:127.0.0.1:56854_xhc%2Fob oass.FileExchangeRateProvider.reload Reloading exchange rates from file currency.xml
   [junit4]   2> 1150746 T6404 n:127.0.0.1:56854_xhc%2Fob oass.FileExchangeRateProvider.reload Reloading exchange rates from file currency.xml
   [junit4]   2> 1150748 T6404 n:127.0.0.1:56854_xhc%2Fob oass.OpenExchangeRatesOrgProvider.reload Reloading exchange rates from open-exchange-rates.json
   [junit4]   2> 1150748 T6404 n:127.0.0.1:56854_xhc%2Fob oass.OpenExchangeRatesOrgProvider$OpenExchangeRates.<init> WARN Unknown key IMPORTANT NOTE
   [junit4]   2> 1150749 T6404 n:127.0.0.1:56854_xhc%2Fob oass.OpenExchangeRatesOrgProvider$OpenExchangeRates.<init> WARN Expected key, got STRING
   [junit4]   2> 1150749 T6404 n:127.0.0.1:56854_xhc%2Fob oass.OpenExchangeRatesOrgProvider.reload Reloading exchange rates from open-exchange-rates.json
   [junit4]   2> 1150750 T6404 n:127.0.0.1:56854_xhc%2Fob oass.OpenExchangeRatesOrgProvider$OpenExchangeRates.<init> WARN Unknown key IMPORTANT NOTE
   [junit4]   2> 1150750 T6404 n:127.0.0.1:56854_xhc%2Fob oass.OpenExchangeRatesOrgProvider$OpenExchangeRates.<init> WARN Expected key, got STRING
   [junit4]   2> 1150750 T6404 n:127.0.0.1:56854_xhc%2Fob oasc.CoreContainer.create Creating SolrCore 'collection1' using configuration from collection collection1
   [junit4]   2> 1150751 T6404 n:127.0.0.1:56854_xhc%2Fob x:collection1 oasc.SolrCore.initDirectoryFactory org.apache.solr.core.MockDirectoryFactory
   [junit4]   2> 1150751 T6404 n:127.0.0.1:56854_xhc%2Fob x:collection1 oasc.SolrCore.<init> [[collection1] ] Opening new SolrCore at [/home/jenkins/workspace/Lucene-Solr-trunk-Linux/solr/build/solr-core/test/J0/temp/solr.cloud.CollectionsAPIAsyncDistributedZkTest 9E35CA37475A538D-001/shard-1-001/cores/collection1/], dataDir=[null]
   [junit4]   2> 1150751 T6404 n:127.0.0.1:56854_xhc%2Fob x:collection1 oasc.JmxMonitoredMap.<init> JMX monitoring is enabled. Adding Solr mbeans to JMX Server: com.sun.jmx.mbeanserver.JmxMBeanServer@a9889
   [junit4]   2> 1150752 T6404 n:127.0.0.1:56854_xhc%2Fob x:collection1 oasc.CachingDirectoryFactory.get return new directory for /home/jenkins/workspace/Lucene-Solr-trunk-Linux/solr/build/solr-core/test/J0/temp/solr.cloud.CollectionsAPIAsyncDistributedZkTest 9E35CA37475A538D-001/shard-1-001/cores/collection1/data
   [junit4]   2> 1150752 T6404 n:127.0.0.1:56854_xhc%2Fob x:collection1 oasc.SolrCore.getNewIndexDir New index directory detected: old=null new=/home/jenkins/workspace/Lucene-Solr-trunk-Linux/solr/build/solr-core/test/J0/temp/solr.cloud.CollectionsAPIAsyncDistributedZkTest 9E35CA37475A538D-001/shard-1-001/cores/collection1/data/index/
   [junit4]   2> 1150752 T6404 n:127.0.0.1:56854_xhc%2Fob x:collection1 oasc.SolrCore.initIndex WARN [collection1] Solr index directory '/home/jenkins/workspace/Lucene-Solr-trunk-Linux/solr/build/solr-core/test/J0/temp/solr.cloud.CollectionsAPIAsyncDistributedZkTest 9E35CA37475A538D-001/shard-1-001/cores/collection1/data/index' doesn't exist. Creating new index...
   [junit4]   2> 1150752 T6404 n:127.0.0.1:56854_xhc%2Fob x:collection1 oasc.CachingDirectoryFactory.get return new directory for /home/jenkins/workspace/Lucene-Solr-trunk-Linux/solr/build/solr-core/test/J0/temp/solr.cloud.CollectionsAPIAsyncDistributedZkTest 9E35CA37475A538D-001/shard-1-001/cores/collection1/data/index
   [junit4]   2> 1150753 T6404 n:127.0.0.1:56854_xhc%2Fob x:collection1 oasu.RandomMergePolicy.<init> RandomMergePolicy wrapping class org.apache.lucene.index.TieredMergePolicy: [TieredMergePolicy: maxMergeAtOnce=21, maxMergeAtOnceExplicit=30, maxMergedSegmentMB=53.4638671875, floorSegmentMB=1.939453125, forceMergeDeletesPctAllowed=3.0104268233529763, segmentsPerTier=33.0, maxCFSSegmentSizeMB=8.796093022207999E12, noCFSRatio=0.8973011182782827
   [junit4]   2> 1150754 T6404 n:127.0.0.1:56854_xhc%2Fob x:collection1 oasc.SolrDeletionPolicy.onCommit SolrDeletionPolicy.onCommit: commits: num=1
   [junit4]   2> 		commit{dir=MockDirectoryWrapper(RAMDirectory@816efe lockFactory=org.apache.lucene.store.SingleInstanceLockFactory@1dc5f76),segFN=segments_1,generation=1}
   [junit4]   2> 1150754 T6404 n:127.0.0.1:56854_xhc%2Fob x:collection1 oasc.SolrDeletionPolicy.updateCommits newest commit generation = 1
   [junit4]   2> 1150759 T6404 n:127.0.0.1:56854_xhc%2Fob x:collection1 oasup.UpdateRequestProcessorChain.init creating updateRequestProcessorChain "nodistrib"
   [junit4]   2> 1150760 T6404 n:127.0.0.1:56854_xhc%2Fob x:collection1 oasup.UpdateRequestProcessorChain.init creating updateRequestProcessorChain "dedupe"
   [junit4]   2> 1150760 T6404 n:127.0.0.1:56854_xhc%2Fob x:collection1 oasup.UpdateRequestProcessorChain.init inserting DistributedUpdateProcessorFactory into updateRequestProcessorChain "dedupe"
   [junit4]   2> 1150760 T6404 n:127.0.0.1:56854_xhc%2Fob x:collection1 oasup.UpdateRequestProcessorChain.init creating updateRequestProcessorChain "stored_sig"
   [junit4]   2> 1150760 T6404 n:127.0.0.1:56854_xhc%2Fob x:collection1 oasup.UpdateRequestProcessorChain.init inserting DistributedUpdateProcessorFactory into updateRequestProcessorChain "stored_sig"
   [junit4]   2> 1150761 T6404 n:127.0.0.1:56854_xhc%2Fob x:collection1 oasup.UpdateRequestProcessorChain.init creating updateRequestProcessorChain "distrib-dup-test-chain-explicit"
   [junit4]   2> 1150761 T6404 n:127.0.0.1:56854_xhc%2Fob x:collection1 oasup.UpdateRequestProcessorChain.init creating updateRequestProcessorChain "distrib-dup-test-chain-implicit"
   [junit4]   2> 1150761 T6404 n:127.0.0.1:56854_xhc%2Fob x:collection1 oasup.UpdateRequestProcessorChain.init inserting DistributedUpdateProcessorFactory into updateRequestProcessorChain "distrib-dup-test-chain-implicit"
   [junit4]   2> 1150761 T6404 n:127.0.0.1:56854_xhc%2Fob x:collection1 oasc.SolrCore.loadUpdateProcessorChains no updateRequestProcessorChain defined as default, creating implicit default
   [junit4]   2> 1150763 T6404 n:127.0.0.1:56854_xhc%2Fob x:collection1 oashl.XMLLoader.init xsltCacheLifetimeSeconds=60
   [junit4]   2> 1150764 T6404 n:127.0.0.1:56854_xhc%2Fob x:collection1 oashl.XMLLoader.init xsltCacheLifetimeSeconds=60
   [junit4]   2> 1150766 T6404 n:127.0.0.1:56854_xhc%2Fob x:collection1 oashl.XMLLoader.init xsltCacheLifetimeSeconds=60
   [junit4]   2> 1150767 T6404 n:127.0.0.1:56854_xhc%2Fob x:collection1 oashl.XMLLoader.init xsltCacheLifetimeSeconds=60
   [junit4]   2> 1150774 T6404 n:127.0.0.1:56854_xhc%2Fob x:collection1 oasc.RequestHandlers.initHandlersFromConfig Registered paths: /admin/mbeans,standard,/update/csv,/update/json/docs,/admin/luke,/admin/segments,/get,/admin/system,/replication,/admin/properties,/config,/schema,/admin/plugins,/admin/logging,/update/json,/admin/threads,/admin/ping,/update,/admin/file
   [junit4]   2> 1150775 T6404 n:127.0.0.1:56854_xhc%2Fob x:collection1 oasc.SolrCore.initStatsCache Using default statsCache cache: org.apache.solr.search.stats.LocalStatsCache
   [junit4]   2> 1150775 T6404 n:127.0.0.1:56854_xhc%2Fob x:collection1 oasu.UpdateHandler.<init> Using UpdateLog implementation: org.apache.solr.update.UpdateLog
   [junit4]   2> 1150776 T6404 n:127.0.0.1:56854_xhc%2Fob x:collection1 oasu.UpdateLog.init Initializing UpdateLog: dataDir= defaultSyncLevel=FLUSH numRecordsToKeep=100 maxNumLogsToKeep=10
   [junit4]   2> 1150776 T6404 n:127.0.0.1:56854_xhc%2Fob x:collection1 oasu.CommitTracker.<init> Hard AutoCommit: disabled
   [junit4]   2> 1150776 T6404 n:127.0.0.1:56854_xhc%2Fob x:collection1 oasu.CommitTracker.<init> Soft AutoCommit: disabled
   [junit4]   2> 1150778 T6404 n:127.0.0.1:56854_xhc%2Fob x:collection1 oasu.RandomMergePolicy.<init> RandomMergePolicy wrapping class org.apache.lucene.index.AlcoholicMergePolicy: [AlcoholicMergePolicy: minMergeSize=0, mergeFactor=10, maxMergeSize=1333266302, maxMergeSizeForForcedMerge=9223372036854775807, calibrateSizeByDeletes=true, maxMergeDocs=2147483647, maxCFSSegmentSizeMB=8.796093022207999E12, noCFSRatio=0.1]
   [junit4]   2> 1150779 T6404 n:127.0.0.1:56854_xhc%2Fob x:collection1 oasc.SolrDeletionPolicy.onInit SolrDeletionPolicy.onInit: commits: num=1
   [junit4]   2> 		commit{dir=MockDirectoryWrapper(RAMDirectory@816efe lockFactory=org.apache.lucene.store.SingleInstanceLockFactory@1dc5f76),segFN=segments_1,generation=1}
   [junit4]   2> 1150779 T6404 n:127.0.0.1:56854_xhc%2Fob x:collection1 oasc.SolrDeletionPolicy.updateCommits newest commit generation = 1
   [junit4]   2> 1150779 T6404 n:127.0.0.1:56854_xhc%2Fob x:collection1 oass.SolrIndexSearcher.<init> Opening Searcher@5da78b[collection1] main
   [junit4]   2> 1150779 T6404 n:127.0.0.1:56854_xhc%2Fob x:collection1 oascc.ZkStateReader.readConfigName Load collection config from:/collections/collection1
   [junit4]   2> 1150780 T6404 n:127.0.0.1:56854_xhc%2Fob x:collection1 oascc.ZkStateReader.readConfigName path=/collections/collection1 configName=conf1 specified config exists in ZooKeeper
   [junit4]   2> 1150780 T6404 n:127.0.0.1:56854_xhc%2Fob x:collection1 oasr.ManagedResourceStorage.newStorageIO Setting up ZooKeeper-based storage for the RestManager with znodeBase: /configs/conf1
   [junit4]   2> 1150781 T6404 n:127.0.0.1:56854_xhc%2Fob x:collection1 oasr.ManagedResourceStorage$ZooKeeperStorageIO.configure Configured ZooKeeperStorageIO with znodeBase: /configs/conf1
   [junit4]   2> 1150781 T6404 n:127.0.0.1:56854_xhc%2Fob x:collection1 oasr.RestManager.init Initializing RestManager with initArgs: {}
   [junit4]   2> 1150781 T6404 n:127.0.0.1:56854_xhc%2Fob x:collection1 oasr.ManagedResourceStorage.load Reading _rest_managed.json using ZooKeeperStorageIO:path=/configs/conf1
   [junit4]   2> 1150781 T6404 n:127.0.0.1:56854_xhc%2Fob x:collection1 oasr.ManagedResourceStorage$ZooKeeperStorageIO.openInputStream No data found for znode /configs/conf1/_rest_managed.json
   [junit4]   2> 1150782 T6404 n:127.0.0.1:56854_xhc%2Fob x:collection1 oasr.ManagedResourceStorage.load Loaded null at path _rest_managed.json using ZooKeeperStorageIO:path=/configs/conf1
   [junit4]   2> 1150782 T6404 n:127.0.0.1:56854_xhc%2Fob x:collection1 oasr.RestManager.init Initializing 0 registered ManagedResources
   [junit4]   2> 1150782 T6404 n:127.0.0.1:56854_xhc%2Fob x:collection1 oash.ReplicationHandler.inform Commits will be reserved for  10000
   [junit4]   2> 1150783 T6405 n:127.0.0.1:56854_xhc%2Fob x:collection1 oasc.SolrCore.registerSearcher [collection1] Registered new searcher Searcher@5da78b[collection1] main{ExitableDirectoryReader(UninvertingDirectoryReader())}
   [junit4]   2> 1150783 T6404 n:127.0.0.1:56854_xhc%2Fob x:collection1 oasc.ZkController.getConfDirListeners watch zkdir /configs/conf1
   [junit4]   2> 1150784 T6404 n:127.0.0.1:56854_xhc%2Fob x:collection1 oasc.CoreContainer.registerCore registering core: collection1
   [junit4]   2> 1150784 T6408 n:127.0.0.1:56854_xhc%2Fob c:collection1 s:shard1 x:collection1 oasc.ZkController.register Register replica - core:collection1 address:http://127.0.0.1:56854/xhc/ob collection:collection1 shard:shard1
   [junit4]   2> 1150785 T6344 n:127.0.0.1:56854_xhc%2Fob oass.SolrDispatchFilter.init user.dir=/home/jenkins/workspace/Lucene-Solr-trunk-Linux/solr/build/solr-core/test/J0
   [junit4]   2> 1150785 T6408 n:127.0.0.1:56854_xhc%2Fob c:collection1 s:shard1 x:collection1 oascc.SolrZkClient.makePath makePath: /collections/collection1/leader_elect/shard1/election
   [junit4]   2> 1150785 T6344 n:127.0.0.1:56854_xhc%2Fob oass.SolrDispatchFilter.init SolrDispatchFilter.init() done
   [junit4]   2> 1150788 T6408 n:127.0.0.1:56854_xhc%2Fob c:collection1 s:shard1 x:collection1 oasc.ShardLeaderElectionContext.runLeaderProcess Running the leader process for shard shard1
   [junit4]   2> 1150789 T6344 oas.SolrTestCaseJ4.setUp ###Starting testSolrJAPICalls
   [junit4]   2> 1150789 T6372 n:127.0.0.1:37816_xhc%2Fob oasc.DistributedQueue$LatchWatcher.process NodeChildrenChanged fired on path /overseer/queue state SyncConnected
   [junit4]   2> 1150789 T6408 n:127.0.0.1:56854_xhc%2Fob c:collection1 s:shard1 x:collection1 oasc.ShardLeaderElectionContext.waitForReplicasToComeUp Enough replicas found to continue.
   [junit4]   2> 1150789 T6408 n:127.0.0.1:56854_xhc%2Fob c:collection1 s:shard1 x:collection1 oasc.ShardLeaderElectionContext.runLeaderProcess I may be the new leader - try and sync
   [junit4]   2> 1150789 T6373 n:127.0.0.1:37816_xhc%2Fob oasc.Overseer$ClusterStateUpdater.run processMessage: queueSize: 1, message = {
   [junit4]   2> 	  "operation":"leader",
   [junit4]   2> 	  "shard":"shard1",
   [junit4]   2> 	  "collection":"collection1"} current state version: 4
   [junit4]   2> ASYNC  NEW_CORE C16014 name=collection1 org.apache.solr.core.SolrCore@15943da url=http://127.0.0.1:56854/xhc/ob/collection1 node=127.0.0.1:56854_xhc%2Fob C16014_STATE=coll:collection1 core:collection1 props:{core=collection1, base_url=http://127.0.0.1:56854/xhc/ob, node_name=127.0.0.1:56854_xhc%2Fob, state=down}
   [junit4]   2> 1150790 T6408 n:127.0.0.1:56854_xhc%2Fob c:collection1 s:shard1 x:collection1 C16014 oasc.SyncStrategy.sync Sync replicas to http://127.0.0.1:56854/xhc/ob/collection1/
   [junit4]   2> 1150790 T6408 n:127.0.0.1:56854_xhc%2Fob c:collection1 s:shard1 x:collection1 C16014 oasc.SyncStrategy.syncReplicas Sync Success - now sync replicas to me
   [junit4]   2> 1150791 T6373 n:127.0.0.1:37816_xhc%2Fob oasco.ZkStateWriter.writePendingUpdates going to update_collection /collections/collection1/state.json version: 1
   [junit4]   2> 1150791 T6408 n:127.0.0.1:56854_xhc%2Fob c:collection1 s:shard1 x:collection1 C16014 oasc.SyncStrategy.syncToMe http://127.0.0.1:56854/xhc/ob/collection1/ has no replicas
   [junit4]   2> 1150791 T6408 n:127.0.0.1:56854_xhc%2Fob c:collection1 s:shard1 x:collection1 oasc.ShardLeaderElectionContext.runLeaderProcess I am the new leader: http://127.0.0.1:56854/xhc/ob/collection1/ shard1
   [junit4]   2> 1150791 T6403 n:127.0.0.1:56854_xhc%2Fob oascc.ZkStateReader$7.process A cluster state change: WatchedEvent state:SyncConnected type:NodeDataChanged path:/collections/collection1/state.json for collection collection1 has occurred - updating... (live nodes size: 2)
   [junit4]   2> 1150791 T6408 n:127.0.0.1:56854_xhc%2Fob c:collection1 s:shard1 x:collection1 oascc.SolrZkClient.makePath makePath: /collections/collection1/leaders/shard1
   [junit4]   2> 1150792 T6403 n:127.0.0.1:56854_xhc%2Fob oascc.ZkStateReader.updateWatchedCollection Updating data for collection1 to ver 2 
   [junit4]   2> 1150794 T6372 n:127.0.0.1:37816_xhc%2Fob oasc.DistributedQueue$LatchWatcher.process NodeChildrenChanged fired on path /overseer/queue state SyncConnected
   [junit4]   2> 1150794 T6373 n:127.0.0.1:37816_xhc%2Fob oasc.Overseer$ClusterStateUpdater.run processMessage: queueSize: 1, message = {
   [junit4]   2> 	  "operation":"leader",
   [junit4]   2> 	  "shard":"shard1",
   [junit4]   2> 	  "collection":"collection1",
   [junit4]   2> 	  "base_url":"http://127.0.0.1:56854/xhc/ob",
   [junit4]   2> 	  "core":"collection1",
   [junit4]   2> 	  "state":"active"} current state version: 4
   [junit4]   2> 1150795 T6393 n:127.0.0.1:56854_xhc%2Fob oasha.CollectionsHandler.handleCreateAction Creating Collection : async=1001&collection.configName=conf1&name=testasynccollectioncreation&action=CREATE&numShards=1&wt=javabin&version=2
   [junit4]   2> 1150795 T6373 n:127.0.0.1:37816_xhc%2Fob oasco.ZkStateWriter.writePendingUpdates going to update_collection /collections/collection1/state.json version: 2
   [junit4]   2> 1150796 T6403 n:127.0.0.1:56854_xhc%2Fob oascc.ZkStateReader$7.process A cluster state change: WatchedEvent state:SyncConnected type:NodeDataChanged path:/collections/collection1/state.json for collection collection1 has occurred - updating... (live nodes size: 2)
   [junit4]   2> 1150796 T6403 n:127.0.0.1:56854_xhc%2Fob oascc.ZkStateReader.updateWatchedCollection Updating data for collection1 to ver 3 
   [junit4]   2> 1150796 T6393 n:127.0.0.1:56854_xhc%2Fob oass.HttpSolrCall.handleAdminRequest [admin] webapp=null path=/admin/collections params={async=1001&collection.configName=conf1&name=testasynccollectioncreation&action=CREATE&numShards=1&wt=javabin&version=2} status=0 QTime=1 
   [junit4]   2> 1150796 T6372 n:127.0.0.1:37816_xhc%2Fob oasc.DistributedQueue$LatchWatcher.process NodeChildrenChanged fired on path /overseer/collection-queue-work state SyncConnected
   [junit4]   2> 1150799 T6374 n:127.0.0.1:37816_xhc%2Fob oasc.OverseerCollectionProcessor.run Overseer Collection Processor: Get the message id:/overseer/collection-queue-work/qn-0000000000 message:{
   [junit4]   2> 	  "operation":"create",
   [junit4]   2> 	  "fromApi":"true",
   [junit4]   2> 	  "name":"testasynccollectioncreation",
   [junit4]   2> 	  "collection.configName":"conf1",
   [junit4]   2> 	  "numShards":"1",
   [junit4]   2> 	  "async":"1001",
   [junit4]   2> 	  "stateFormat":"2"}
   [junit4]   2> 1150800 T6410 n:127.0.0.1:37816_xhc%2Fob c:testasynccollectioncreation oasc.OverseerCollectionProcessor.processMessage WARN OverseerCollectionProcessor.processMessage : create , {
   [junit4]   2> 	  "operation":"create",
   [junit4]   2> 	  "fromApi":"true",
   [junit4]   2> 	  "name":"testasynccollectioncreation",
   [junit4]   2> 	  "collection.configName":"conf1",
   [junit4]   2> 	  "numShards":"1",
   [junit4]   2> 	  "async":"1001",
   [junit4]   2> 	  "stateFormat":"2"}
   [junit4]   2> 1150800 T6394 n:127.0.0.1:56854_xhc%2Fob oass.HttpSolrCall.handleAdminRequest [admin] webapp=null path=/admin/collections params={requestid=1001&action=REQUESTSTATUS&wt=javabin&version=2} status=0 QTime=0 
   [junit4]   2> 1150802 T6410 n:127.0.0.1:37816_xhc%2Fob c:testasynccollectioncreation oasc.OverseerCollectionProcessor.createConfNode creating collections conf node /collections/testasynccollectioncreation 
   [junit4]   2> 1150802 T6410 n:127.0.0.1:37816_xhc%2Fob c:testasynccollectioncreation oascc.SolrZkClient.makePath makePath: /collections/testasynccollectioncreation
   [junit4]   2> 1150804 T6372 n:127.0.0.1:37816_xhc%2Fob oasc.DistributedQueue$LatchWatcher.process NodeChildrenChanged fired on path /overseer/queue state SyncConnected
   [junit4]   2> 1150804 T6373 n:127.0.0.1:37816_xhc%2Fob oasc.Overseer$ClusterStateUpdater.run processMessage: queueSize: 1, message = {
   [junit4]   2> 	  "operation":"create",
   [junit4]   2> 	  "fromApi":"true",
   [junit4]   2> 	  "name":"testasynccollectioncreation",
   [junit4]   2> 	  "collection.configName":"conf1",
   [junit4]   2> 	  "numShards":"1",
   [junit4]   2> 	  "async":"1001",
   [junit4]   2> 	  "stateFormat":"2"} current state version: 4
   [junit4]   2> 1150804 T6373 n:127.0.0.1:37816_xhc%2Fob oasco.ClusterStateMutator.createCollection building a new cName: testasynccollectioncreation
   [junit4]   2> 1150805 T6373 n:127.0.0.1:37816_xhc%2Fob oasco.ZkStateWriter.writePendingUpdates going to create_collection /collections/testasynccollectioncreation/state.json
   [junit4]   2> 1150806 T6372 n:127.0.0.1:37816_xhc%2Fob oascc.ZkStateReader$2.process A cluster state change: WatchedEvent state:SyncConnected type:NodeDataChanged path:/clusterstate.json, has occurred - updating... (live nodes size: 2)
   [junit4]   2> 1150806 T6403 n:127.0.0.1:56854_xhc%2Fob oascc.ZkStateReader$2.process A cluster state change: WatchedEvent state:SyncConnected type:NodeDataChanged path:/clusterstate.json, has occurred - updating... (live nodes size: 2)
   [junit4]   2> 1150806 T6383 oascc.ZkStateReader$2.process A cluster state change: WatchedEvent state:SyncConnected type:NodeDataChanged path:/clusterstate.json, has occurred - updating... (live nodes size: 2)
   [junit4]   2> 1150844 T6408 n:127.0.0.1:56854_xhc%2Fob c:collection1 s:shard1 x:collection1 oasc.ZkController.register We are http://127.0.0.1:56854/xhc/ob/collection1/ and leader is http://127.0.0.1:56854/xhc/ob/collection1/
   [junit4]   2> 1150844 T6408 n:127.0.0.1:56854_xhc%2Fob c:collection1 s:shard1 x:collection1 oasc.ZkController.register No LogReplay needed for core=collection1 baseURL=http://127.0.0.1:56854/xhc/ob
   [junit4]   2> 1150845 T6408 n:127.0.0.1:56854_xhc%2Fob c:collection1 s:shard1 x:collection1 oasc.ZkController.checkRecovery I am the leader, no recovery necessary
   [junit4]   2> 1150845 T6408 n:127.0.0.1:56854_xhc%2Fob c:collection1 s:shard1 x:collection1 oasc.ZkController.publish publishing core=collection1 state=active collection=collection1
   [junit4]   2> 1150845 T6408 n:127.0.0.1:56854_xhc%2Fob c:collection1 s:shard1 x:collection1 oasc.ZkController.publish numShards not found on descriptor - reading it from system property
   [junit4]   2> 1150846 T6372 n:127.0.0.1:37816_xhc%2Fob oasc.DistributedQueue$LatchWatcher.process NodeChildrenChanged fired on path /overseer/queue state SyncConnected
   [junit4]   2> 1150847 T6373 n:127.0.0.1:37816_xhc%2Fob oasc.Overseer$ClusterStateUpdater.run processMessage: queueSize: 1, message = {
   [junit4]   2> 	  "core":"collection1",
   [junit4]   2> 	  "core_node_name":"core_node1",
   [junit4]   2> 	  "roles":null,
   [junit4]   2> 	  "base_url":"http://127.0.0.1:56854/xhc/ob",
   [junit4]   2> 	  "node_name":"127.0.0.1:56854_xhc%2Fob",
   [junit4]   2> 	  "numShards":"1",
   [junit4]   2> 	  "state":"active",
   [junit4]   2> 	  "shard":"shard1",
   [junit4]   2> 	  "collection":"collection1",
   [junit4]   2> 	  "operation":"state"} current state version: 5
   [junit4]   2> 1150847 T6373 n:127.0.0.1:37816_xhc%2Fob oasco.ReplicaMutator.updateState Update state numShards=1 message={
   [junit4]   2> 	  "core":"collection1",
   [junit4]   2> 	  "core_node_name":"core_node1",
   [junit4]   2> 	  "roles":null,
   [junit4]   2> 	  "base_url":"http://127.0.0.1:56854/xhc/ob",
   [junit4]   2> 	  "node_name":"127.0.0.1:56854_xhc%2Fob",
   [junit4]   2> 	  "numShards":"1",
   [junit4]   2> 	  "state":"active",
   [junit4]   2> 	  "shard":"shard1",
   [junit4]   2> 	  "collection":"collection1",
   [junit4]   2> 	  "operation":"state"}
   [junit4]   2> 1150848 T6408 n:127.0.0.1:56854_xhc%2Fob c:collection1 s:shard1 x:collection1 oascc.ZkStateReader.updateWatchedCollection Updating data for collection1 to ver 3 
   [junit4]   2> 1150904 T6410 n:127.0.0.1:37816_xhc%2Fob c:testasynccollectioncreation oasc.OverseerCollectionProcessor.createCollection Creating SolrCores for new collection testasynccollectioncreation, shardNames [shard1] , replicationFactor : 1
   [junit4]   2> 1150904 T6410 n:127.0.0.1:37816_xhc%2Fob c:testasynccollectioncreation oasc.OverseerCollectionProcessor.createCollection Creating core testasynccollectioncreation_shard1_replica1 as part of shard shard1 of collection testasynccollectioncreation on 127.0.0.1:37816_xhc%2Fob
   [junit4]   2> 1150909 T6362 n:127.0.0.1:37816_xhc%2Fob oass.HttpSolrCall.handleAdminRequest [admin] webapp=null path=/admin/cores params={async=100148521223007605&qt=/admin/cores&collection.configName=conf1&name=testasynccollectioncreation_shard1_replica1&action=CREATE&numShards=1&collection=testasynccollectioncreation&shard=shard1&wt=javabin&version=2} status=0 QTime=1 
   [junit4]   2> 1150909 T6413 n:127.0.0.1:37816_xhc%2Fob oasha.CoreAdminHandler.handleCreateAction core create command async=100148521223007605&qt=/admin/cores&collection.configName=conf1&name=testasynccollectioncreation_shard1_replica1&action=CREATE&numShards=1&collection=testasynccollectioncreation&shard=shard1&wt=javabin&version=2
   [junit4]   2> 1150910 T6413 n:127.0.0.1:37816_xhc%2Fob oasc.CoreDescriptor.<init> CORE DESCRIPTOR: {name=testasynccollectioncreation_shard1_replica1, config=solrconfig.xml, transient=false, schema=schema.xml, loadOnStartup=true, instanceDir=testasynccollectioncreation_shard1_replica1, collection=testasynccollectioncreation, absoluteInstDir=/home/jenkins/workspace/Lucene-Solr-trunk-Linux/solr/build/solr-core/test/J0/../../../../../../../../../home/jenkins/workspace/Lucene-Solr-trunk-Linux/solr/build/solr-core/test/J0/temp/solr.cloud.CollectionsAPIAsyncDistributedZkTest 9E35CA37475A538D-001/control-001/cores/testasynccollectioncreation_shard1_replica1/, numShards=1, dataDir=data/, shard=shard1}
   [junit4]   2> 1150911 T6363 n:127.0.0.1:37816_xhc%2Fob oasha.CoreAdminHandler.handleRequestActionStatus Checking request status for : 100148521223007605
   [junit4]   2> 1150911 T6413 n:127.0.0.1:37816_xhc%2Fob c:testasynccollectioncreation x:testasynccollectioncreation_shard1_replica1 oasc.ZkController.publish publishing core=testasynccollectioncreation_shard1_replica1 state=down collection=testasynccollectioncreation
   [junit4]   2> 1150911 T6363 n:127.0.0.1:37816_xhc%2Fob oass.HttpSolrCall.handleAdminRequest [admin] webapp=null path=/admin/cores params={qt=/admin/cores&requestid=100148521223007605&action=REQUESTSTATUS&wt=javabin&version=2} status=0 QTime=0 
   [junit4]   2> 1150912 T6372 n:127.0.0.1:37816_xhc%2Fob oasc.DistributedQueue$LatchWatcher.process NodeChildrenChanged fired on path /overseer/queue state SyncConnected
   [junit4]   2> 1150913 T6413 n:127.0.0.1:37816_xhc%2Fob oasc.ZkController.preRegister Registering watch for external collection testasynccollectioncreation
   [junit4]   2> 1150913 T6373 n:127.0.0.1:37816_xhc%2Fob oasc.Overseer$ClusterStateUpdater.run processMessage: queueSize: 1, message = {
   [junit4]   2> 	  "core":"testasynccollectioncreation_shard1_replica1",
   [junit4]   2> 	  "roles":null,
   [junit4]   2> 	  "base_url":"http://127.0.0.1:37816/xhc/ob",
   [junit4]   2> 	  "node_name":"127.0.0.1:37816_xhc%2Fob",
   [junit4]   2> 	  "numShards":"1",
   [junit4]   2> 	  "state":"down",
   [junit4]   2> 	  "shard":"shard1",
   [junit4]   2> 	  "collection":"testasynccollectioncreation",
   [junit4]   2> 	  "operation":"state"} current state version: 5
   [junit4]   2> 1150913 T6413 n:127.0.0.1:37816_xhc%2Fob oascc.ZkStateReader.addZkWatch addZkWatch testasynccollectioncreation
   [junit4]   2> 1150913 T6373 n:127.0.0.1:37816_xhc%2Fob oasco.ReplicaMutator.updateState Update state numShards=1 message={
   [junit4]   2> 	  "core":"testasynccollectioncreation_shard1_replica1",
   [junit4]   2> 	  "roles":null,
   [junit4]   2> 	  "base_url":"http://127.0.0.1:37816/xhc/ob",
   [junit4]   2> 	  "node_name":"127.0.0.1:37816_xhc%2Fob",
   [junit4]   2> 	  "numShards":"1",
   [junit4]   2> 	  "state":"down",
   [junit4]   2> 	  "shard":"shard1",
   [junit4]   2> 	  "collection":"testasynccollectioncreation",
   [junit4]   2> 	  "operation":"state"}
   [junit4]   2> 1150914 T6413 n:127.0.0.1:37816_xhc%2Fob oascc.ZkStateReader.addZkWatch Updating collection state at /collections/testasynccollectioncreation/state.json from ZooKeeper... 
   [junit4]   2> 1150914 T6373 n:127.0.0.1:37816_xhc%2Fob oasco.ZkStateWriter.writePendingUpdates going to update_collection /collections/collection1/state.json version: 3
   [junit4]   2> 1150914 T6403 n:127.0.0.1:56854_xhc%2Fob oascc.ZkStateReader$7.process A cluster state change: WatchedEvent state:SyncConnected type:NodeDataChanged path:/collections/collection1/state.json for collection collection1 has occurred - updating... (live nodes size: 2)
   [junit4]   2> 1150915 T6413 n:127.0.0.1:37816_xhc%2Fob oascc.ZkStateReader.updateWatchedCollection Updating data for testasynccollectioncreation to ver 0 
   [junit4]   2> 1150915 T6403 n:127.0.0.1:56854_xhc%2Fob oascc.ZkStateReader.updateWatchedCollection Updating data for collection1 to ver 4 
   [junit4]   2> 1150915 T6413 n:127.0.0.1:37816_xhc%2Fob oasc.ZkController.waitForCoreNodeName look for our core node name
   [junit4]   2> 1151017 T6373 n:127.0.0.1:37816_xhc%2Fob oasco.ZkStateWriter.writePendingUpdates going to update_collection /collections/testasynccollectioncreation/state.json version: 0
   [junit4]   2> 1151017 T6372 n:127.0.0.1:37816_xhc%2Fob oascc.ZkStateReader$7.process A cluster state change: WatchedEvent state:SyncConnected type:NodeDataChanged path:/collections/testasynccollectioncreation/state.json for collection testasynccollectioncreation has occurred - updating... (live nodes size: 2)
   [junit4]   2> 1151018 T6372 n:127.0.0.1:37816_xhc%2Fob oascc.ZkStateReader.updateWatchedCollection Updating data for testasynccollectioncreation to ver 1 
   [junit4]   2> 1151803 T6395 n:127.0.0.1:56854_xhc%2Fob oass.HttpSolrCall.handleAdminRequest [admin] webapp=null path=/admin/collections params={requestid=1001&action=REQUESTSTATUS&wt=javabin&version=2} status=0 QTime=0 
   [junit4]   2> 1151914 T6364 n:127.0.0.1:37816_xhc%2Fob oasha.CoreAdminHandler.handleRequestActionStatus Checking request status for : 100148521223007605
   [junit4]   2> 1151914 T6364 n:127.0.0.1:37816_xhc%2Fob oass.HttpSolrCall.handleAdminRequest [admin] webapp=null path=/admin/cores params={qt=/admin/cores&requestid=100148521223007605&action=REQUESTSTATUS&wt=javabin&version=2} status=0 QTime=0 
   [junit4]   2> 1151915 T6413 n:127.0.0.1:37816_xhc%2Fob oasc.ZkController.waitForShardId waiting to find shard id in clusterstate for testasynccollectioncreation_shard1_replica1
   [junit4]   2> 1151916 T6413 n:127.0.0.1:37816_xhc%2Fob oasc.ZkController.createCollectionZkNode Check for collection zkNode:testasynccollectioncreation
   [junit4]   2> 1151916 T6413 n:127.0.0.1:37816_xhc%2Fob oasc.ZkController.createCollectionZkNode Collection zkNode exists
   [junit4]   2> 1151916 T6413 n:127.0.0.1:37816_xhc%2Fob oascc.ZkStateReader.readConfigName Load collection config from:/collections/testasynccollectioncreation
   [junit4]   2> 1151917 T6413 n:127.0.0.1:37816_xhc%2Fob oascc.ZkStateReader.readConfigName path=/c

[...truncated too long message...]

Context.runLeaderProcess(ElectionContext.java:330)
   [junit4]   2> 		at org.apache.solr.cloud.LeaderElector.runIamLeaderProcess(LeaderElector.java:198)
   [junit4]   2> 		at org.apache.solr.cloud.LeaderElector.checkIfIamLeader(LeaderElector.java:159)
   [junit4]   2> 		at org.apache.solr.cloud.LeaderElector.access$200(LeaderElector.java:56)
   [junit4]   2> 		at org.apache.solr.cloud.LeaderElector$ElectionWatcher.process(LeaderElector.java:390)
   [junit4]   2> 		at org.apache.solr.common.cloud.SolrZkClient$3$1.run(SolrZkClient.java:264)
   [junit4]   2> 		at java.util.concurrent.Executors$RunnableAdapter.call(Executors.java:511)
   [junit4]   2> 		at java.util.concurrent.FutureTask.run(FutureTask.java:266)
   [junit4]   2> 		at org.apache.solr.common.util.ExecutorUtil$MDCAwareThreadPoolExecutor$1.run(ExecutorUtil.java:148)
   [junit4]   2> 		at java.util.concurrent.ThreadPoolExecutor.runWorker(ThreadPoolExecutor.java:1142)
   [junit4]   2> 		at java.util.concurrent.ThreadPoolExecutor$Worker.run(ThreadPoolExecutor.java:617)
   [junit4]   2> 		at java.lang.Thread.run(Thread.java:745)
   [junit4]   2> 	Caused by: org.apache.zookeeper.KeeperException$SessionExpiredException: KeeperErrorCode = Session expired for /collections
   [junit4]   2> 		at org.apache.zookeeper.KeeperException.create(KeeperException.java:127)
   [junit4]   2> 		at org.apache.zookeeper.KeeperException.create(KeeperException.java:51)
   [junit4]   2> 		at org.apache.zookeeper.ZooKeeper.exists(ZooKeeper.java:1045)
   [junit4]   2> 		at org.apache.solr.common.cloud.SolrZkClient$4.execute(SolrZkClient.java:294)
   [junit4]   2> 		at org.apache.solr.common.cloud.SolrZkClient$4.execute(SolrZkClient.java:291)
   [junit4]   2> 		at org.apache.solr.common.cloud.ZkCmdExecutor.retryOperation(ZkCmdExecutor.java:61)
   [junit4]   2> 		at org.apache.solr.common.cloud.SolrZkClient.exists(SolrZkClient.java:291)
   [junit4]   2> 		at org.apache.solr.common.cloud.SolrZkClient.makePath(SolrZkClient.java:486)
   [junit4]   2> 		at org.apache.solr.common.cloud.SolrZkClient.makePath(SolrZkClient.java:455)
   [junit4]   2> 		at org.apache.solr.common.cloud.SolrZkClient.makePath(SolrZkClient.java:442)
   [junit4]   2> 		at org.apache.solr.cloud.ShardLeaderElectionContextBase$1.execute(ElectionContext.java:146)
   [junit4]   2> 		at org.apache.solr.common.util.RetryUtil.retryOnThrowable(RetryUtil.java:31)
   [junit4]   2> 		at org.apache.solr.cloud.ShardLeaderElectionContextBase.runLeaderProcess(ElectionContext.java:142)
   [junit4]   2> 		... 12 more
   [junit4]   2> 	
   [junit4]   2> 1282401 T6454 n:127.0.0.1:56854_xhc%2Fob oascc.ZkStateReader$3.process WARN ZooKeeper watch triggered, but Solr cannot talk to ZK
   [junit4]   2> 1282402 T6344 oejs.AbstractConnector.doStop Stopped ServerConnector@7da98{HTTP/1.1}{127.0.0.1:0}
   [junit4]   2> 1282403 T6344 oejsh.ContextHandler.doStop Stopped o.e.j.s.ServletContextHandler@3faf7c{/xhc/ob,null,UNAVAILABLE}
   [junit4]   2> 1282404 T6344 oasc.ZkTestServer.send4LetterWord connecting to 127.0.0.1:52244 52244
   [junit4]   2> 1282440 T6345 oasc.ZkTestServer.send4LetterWord connecting to 127.0.0.1:52244 52244
   [junit4]   2> 1282441 T6345 oasc.ZkTestServer$ZKServerMain.runFromConfig WARN Watch limit violations: 
   [junit4]   2> 	Maximum concurrent create/delete watches above limit:
   [junit4]   2> 	
   [junit4]   2> 		3	/solr/aliases.json
   [junit4]   2> 		3	/solr/clusterstate.json
   [junit4]   2> 		2	/solr/configs/conf1
   [junit4]   2> 		2	/solr/collections/testasynccollectioncreation/state.json
   [junit4]   2> 	
   [junit4]   2> 	Maximum concurrent children watches above limit:
   [junit4]   2> 	
   [junit4]   2> 		3	/solr/live_nodes
   [junit4]   2> 		2	/solr/overseer/queue
   [junit4]   2> 		2	/solr/overseer/collection-queue-work
   [junit4]   2> 	
   [junit4]   2> NOTE: reproduce with: ant test  -Dtestcase=CollectionsAPIAsyncDistributedZkTest -Dtests.method=testSolrJAPICalls -Dtests.seed=9E35CA37475A538D -Dtests.multiplier=3 -Dtests.slow=true -Dtests.locale=en_IN -Dtests.timezone=Australia/Currie -Dtests.asserts=true -Dtests.file.encoding=ISO-8859-1
   [junit4] FAILURE  135s J0 | CollectionsAPIAsyncDistributedZkTest.testSolrJAPICalls <<<
   [junit4]    > Throwable #1: org.junit.ComparisonFailure: Shard split did not complete. Last recorded state: running expected:<[completed]> but was:<[running]>
   [junit4]    > 	at __randomizedtesting.SeedInfo.seed([9E35CA37475A538D:C65146564130FB59]:0)
   [junit4]    > 	at org.apache.solr.cloud.CollectionsAPIAsyncDistributedZkTest.testSolrJAPICalls(CollectionsAPIAsyncDistributedZkTest.java:101)
   [junit4]    > 	at org.apache.solr.BaseDistributedSearchTestCase$ShardsRepeatRule$ShardsFixedStatement.callStatement(BaseDistributedSearchTestCase.java:960)
   [junit4]    > 	at org.apache.solr.BaseDistributedSearchTestCase$ShardsRepeatRule$ShardsStatement.evaluate(BaseDistributedSearchTestCase.java:935)
   [junit4]    > 	at java.lang.Thread.run(Thread.java:745)
   [junit4]   2> 1282451 T6344 oas.SolrTestCaseJ4.deleteCore ###deleteCore
   [junit4]   2> NOTE: leaving temporary files on disk at: /home/jenkins/workspace/Lucene-Solr-trunk-Linux/solr/build/solr-core/test/J0/temp/solr.cloud.CollectionsAPIAsyncDistributedZkTest 9E35CA37475A538D-001
   [junit4]   2> 135500 T6343 ccr.ThreadLeakControl.checkThreadLeaks WARNING Will linger awaiting termination of 1 leaked thread(s).
   [junit4]   2> NOTE: test params are: codec=Asserting(Lucene50), sim=RandomSimilarityProvider(queryNorm=true,coord=crazy): {}, locale=en_IN, timezone=Australia/Currie
   [junit4]   2> NOTE: Linux 3.13.0-52-generic i386/Oracle Corporation 1.8.0_45 (32-bit)/cpus=12,threads=1,free=121859584,total=423895040
   [junit4]   2> NOTE: All tests run in this JVM: [DateRangeFieldTest, TestRandomDVFaceting, RecoveryAfterSoftCommitTest, TestHashQParserPlugin, TestReversedWildcardFilterFactory, TestReplicationHandler, DateFieldTest, RankQueryTest, TestWordDelimiterFilterFactory, VMParamsZkACLAndCredentialsProvidersTest, TestSweetSpotSimilarityFactory, TestLazyCores, IndexSchemaTest, TestArbitraryIndexDir, DateMathParserTest, HdfsUnloadDistributedZkTest, InfoHandlerTest, LeaderInitiatedRecoveryOnCommitTest, UpdateRequestProcessorFactoryTest, TestDistributedSearch, DistributedSpellCheckComponentTest, TestTolerantSearch, TestStressLucene, SignatureUpdateProcessorFactoryTest, TestReRankQParserPlugin, PrimitiveFieldTypeTest, FastVectorHighlighterTest, TestFaceting, TestRandomFaceting, HighlighterConfigTest, QueryElevationComponentTest, ParsingFieldUpdateProcessorsTest, SuggesterWFSTTest, RequestLoggingTest, TestAddFieldRealTimeGet, LeaderFailoverAfterPartitionTest, QueryResultKeyTest, DistributedFacetPivotLargeTest, DebugComponentTest, TestCloudSchemaless, SSLMigrationTest, TestCloudInspectUtil, TestSolrIndexConfig, TestJmxIntegration, DeleteShardTest, UniqFieldsUpdateProcessorFactoryTest, TestHighFrequencyDictionaryFactory, TestJoin, TestConfigReload, AddSchemaFieldsUpdateProcessorFactoryTest, DistributedSuggestComponentTest, TestDFRSimilarityFactory, MultiTermTest, BasicDistributedZkTest, OutOfBoxZkACLAndCredentialsProvidersTest, TestCodecSupport, ClusterStateTest, TestTrackingShardHandlerFactory, TestJmxMonitoredMap, TestCollapseQParserPlugin, DistribJoinFromCollectionTest, TestMiniSolrCloudCluster, TestQuerySenderListener, PingRequestHandlerTest, TestOrdValues, MigrateRouteKeyTest, TestCloudManagedSchema, TestFunctionQuery, ExitableDirectoryReaderTest, TestDynamicFieldResource, SolrIndexConfigTest, SegmentsInfoRequestHandlerTest, SyncSliceTest, ZkNodePropsTest, PeerSyncTest, StandardRequestHandlerTest, SolrTestCaseJ4Test, TestDynamicFieldCollectionResource, TestInfoStreamLogging, TermVectorComponentTest, ClusterStateUpdateTest, ShardRoutingCustomTest, TermVectorComponentDistributedTest, TestRealTimeGet, HardAutoCommitTest, TestSolr4Spatial, BadIndexSchemaTest, TestSort, TestIndexSearcher, SimplePostToolTest, TestCoreDiscovery, CoreAdminHandlerTest, DocValuesTest, TestCSVLoader, TestPseudoReturnFields, FieldMutatingUpdateProcessorTest, DefaultValueUpdateProcessorTest, TestSolrDeletionPolicy1, XsltUpdateRequestHandlerTest, LukeRequestHandlerTest, DirectSolrSpellCheckerTest, RequestHandlersTest, TestValueSourceCache, LoggingHandlerTest, JSONWriterTest, MBeansHandlerTest, TestBinaryResponseWriter, AlternateDirectoryTest, TestDocSet, TestSearchPerf, TestFuzzyAnalyzedSuggestions, SpellPossibilityIteratorTest, SynonymTokenizerTest, TestLMDirichletSimilarityFactory, TestBM25SimilarityFactory, TimeZoneUtilsTest, PluginInfoTest, ChaosMonkeyNothingIsSafeTest, CollectionsAPIAsyncDistributedZkTest]
   [junit4] Completed [384/488] on J0 in 135.78s, 1 test, 1 failure <<< FAILURES!

[...truncated 337 lines...]
BUILD FAILED
/home/jenkins/workspace/Lucene-Solr-trunk-Linux/build.xml:526: The following error occurred while executing this line:
/home/jenkins/workspace/Lucene-Solr-trunk-Linux/build.xml:474: The following error occurred while executing this line:
/home/jenkins/workspace/Lucene-Solr-trunk-Linux/build.xml:61: The following error occurred while executing this line:
/home/jenkins/workspace/Lucene-Solr-trunk-Linux/extra-targets.xml:39: The following error occurred while executing this line:
/home/jenkins/workspace/Lucene-Solr-trunk-Linux/solr/build.xml:229: The following error occurred while executing this line:
/home/jenkins/workspace/Lucene-Solr-trunk-Linux/solr/common-build.xml:512: The following error occurred while executing this line:
/home/jenkins/workspace/Lucene-Solr-trunk-Linux/lucene/common-build.xml:1415: The following error occurred while executing this line:
/home/jenkins/workspace/Lucene-Solr-trunk-Linux/lucene/common-build.xml:973: There were test failures: 488 suites, 1956 tests, 1 failure, 57 ignored (25 assumptions)

Total time: 50 minutes 58 seconds
Build step 'Invoke Ant' marked build as failure
Archiving artifacts
Recording test results
Email was triggered for: Failure - Any
Sending email for trigger: Failure - Any



Mime
View raw message