lucene-dev mailing list archives

Site index · List index
Message view « Date » · « Thread »
Top « Date » · « Thread »
From Policeman Jenkins Server <jenk...@thetaphi.de>
Subject [JENKINS] Lucene-Solr-5.x-MacOSX (64bit/jdk1.7.0) - Build # 2154 - Still Failing!
Date Mon, 20 Apr 2015 07:28:49 GMT
Build: http://jenkins.thetaphi.de/job/Lucene-Solr-5.x-MacOSX/2154/
Java: 64bit/jdk1.7.0 -XX:-UseCompressedOops -XX:+UseConcMarkSweepGC

1 tests failed.
FAILED:  org.apache.solr.schema.TestCloudManagedSchemaConcurrent.test

Error Message:
QUERY FAILED: xpath=/response/lst[@name='responseHeader']/int[@name='status'][.='0']  request=/schema/dynamicfields/newdynamicfieldPut0_*?wt=xml&updateTimeoutSecs=15  response=<?xml version="1.0" encoding="UTF-8"?> <response>  <lst name="responseHeader">   <int name="status">500</int>   <int name="QTime">29608</int> </lst> <lst name="error">   <str name="msg">7 out of 8 replicas failed to update their schema to version 4 within 15 seconds! Failed cores: [https://127.0.0.1:50913/wb_/collection1/, https://127.0.0.1:50894/wb_/collection1/, https://127.0.0.1:50920/wb_/collection1/, https://127.0.0.1:50897/wb_/collection1/, https://127.0.0.1:50930/wb_/collection1/, https://127.0.0.1:50901/wb_/collection1/, https://127.0.0.1:50939/wb_/collection1/]</str>   <str name="trace">org.apache.solr.common.SolrException: 7 out of 8 replicas failed to update their schema to version 4 within 15 seconds! Failed cores: [https://127.0.0.1:50913/wb_/collection1/, https://127.0.0.1:50894/wb_/collection1/, https://127.0.0.1:50920/wb_/collection1/, https://127.0.0.1:50897/wb_/collection1/, https://127.0.0.1:50930/wb_/collection1/, https://127.0.0.1:50901/wb_/collection1/, https://127.0.0.1:50939/wb_/collection1/]  at org.apache.solr.schema.ManagedIndexSchema.waitForSchemaZkVersionAgreement(ManagedIndexSchema.java:260)  at org.apache.solr.rest.schema.BaseFieldResource.waitForSchemaUpdateToPropagate(BaseFieldResource.java:120)  at org.apache.solr.rest.schema.DynamicFieldResource.put(DynamicFieldResource.java:185)  at org.restlet.resource.ServerResource.doHandle(ServerResource.java:432)  at org.restlet.resource.ServerResource.doConditionalHandle(ServerResource.java:350)  at org.restlet.resource.ServerResource.handle(ServerResource.java:952)  at org.restlet.resource.Finder.handle(Finder.java:246)  at org.restlet.routing.Filter.doHandle(Filter.java:159)  at org.restlet.routing.Filter.handle(Filter.java:206)  at org.restlet.routing.Router.doHandle(Router.java:431)  at org.restlet.routing.Router.handle(Router.java:648)  at org.restlet.routing.Filter.doHandle(Filter.java:159)  at org.restlet.routing.Filter.handle(Filter.java:206)  at org.restlet.routing.Filter.doHandle(Filter.java:159)  at org.restlet.routing.Filter.handle(Filter.java:206)  at org.restlet.routing.Filter.doHandle(Filter.java:159)  at org.restlet.engine.application.StatusFilter.doHandle(StatusFilter.java:155)  at org.restlet.routing.Filter.handle(Filter.java:206)  at org.restlet.routing.Filter.doHandle(Filter.java:159)  at org.restlet.routing.Filter.handle(Filter.java:206)  at org.restlet.engine.CompositeHelper.handle(CompositeHelper.java:211)  at org.restlet.engine.application.ApplicationHelper.handle(ApplicationHelper.java:84)  at org.restlet.Application.handle(Application.java:381)  at org.restlet.routing.Filter.doHandle(Filter.java:159)  at org.restlet.routing.Filter.handle(Filter.java:206)  at org.restlet.routing.Router.doHandle(Router.java:431)  at org.restlet.routing.Router.handle(Router.java:648)  at org.restlet.routing.Filter.doHandle(Filter.java:159)  at org.restlet.routing.Filter.handle(Filter.java:206)  at org.restlet.routing.Router.doHandle(Router.java:431)  at org.restlet.routing.Router.handle(Router.java:648)  at org.restlet.routing.Filter.doHandle(Filter.java:159)  at org.restlet.routing.Filter.handle(Filter.java:206)  at org.restlet.engine.CompositeHelper.handle(CompositeHelper.java:211)  at org.restlet.Component.handle(Component.java:392)  at org.restlet.Server.handle(Server.java:516)  at org.restlet.engine.ServerHelper.handle(ServerHelper.java:72)  at org.restlet.engine.adapter.HttpServerHelper.handle(HttpServerHelper.java:152)  at org.restlet.ext.servlet.ServerServlet.service(ServerServlet.java:1089)  at javax.servlet.http.HttpServlet.service(HttpServlet.java:848)  at org.eclipse.jetty.servlet.ServletHolder.handle(ServletHolder.java:669)  at org.eclipse.jetty.servlet.ServletHandler.doHandle(ServletHandler.java:457)  at org.eclipse.jetty.server.session.SessionHandler.doHandle(SessionHandler.java:229)  at org.eclipse.jetty.server.handler.ScopedHandler.handle(ScopedHandler.java:137)  at org.eclipse.jetty.server.handler.GzipHandler.handle(GzipHandler.java:301)  at org.eclipse.jetty.server.handler.ContextHandler.doHandle(ContextHandler.java:1077)  at org.eclipse.jetty.servlet.ServletHandler.doScope(ServletHandler.java:384)  at org.eclipse.jetty.server.session.SessionHandler.doScope(SessionHandler.java:193)  at org.eclipse.jetty.server.handler.ContextHandler.doScope(ContextHandler.java:1009)  at org.eclipse.jetty.server.handler.ScopedHandler.handle(ScopedHandler.java:135)  at org.eclipse.jetty.server.Dispatcher.forward(Dispatcher.java:276)  at org.eclipse.jetty.server.Dispatcher.forward(Dispatcher.java:103)  at org.apache.solr.servlet.SolrDispatchFilter.doFilter(SolrDispatchFilter.java:402)  at org.apache.solr.servlet.SolrDispatchFilter.doFilter(SolrDispatchFilter.java:223)  at org.eclipse.jetty.servlet.ServletHandler$CachedChain.doFilter(ServletHandler.java:1419)  at org.apache.solr.client.solrj.embedded.JettySolrRunner$DebugFilter.doFilter(JettySolrRunner.java:104)  at org.eclipse.jetty.servlet.ServletHandler$CachedChain.doFilter(ServletHandler.java:1419)  at org.eclipse.jetty.servlet.ServletHandler.doHandle(ServletHandler.java:455)  at org.eclipse.jetty.server.session.SessionHandler.doHandle(SessionHandler.java:229)  at org.eclipse.jetty.server.handler.ScopedHandler.handle(ScopedHandler.java:137)  at org.eclipse.jetty.server.handler.GzipHandler.handle(GzipHandler.java:301)  at org.eclipse.jetty.server.handler.ContextHandler.doHandle(ContextHandler.java:1077)  at org.eclipse.jetty.servlet.ServletHandler.doScope(ServletHandler.java:384)  at org.eclipse.jetty.server.session.SessionHandler.doScope(SessionHandler.java:193)  at org.eclipse.jetty.server.handler.ContextHandler.doScope(ContextHandler.java:1009)  at org.eclipse.jetty.server.handler.ScopedHandler.handle(ScopedHandler.java:135)  at org.eclipse.jetty.server.handler.HandlerWrapper.handle(HandlerWrapper.java:116)  at org.eclipse.jetty.server.Server.handle(Server.java:368)  at org.eclipse.jetty.server.AbstractHttpConnection.handleRequest(AbstractHttpConnection.java:489)  at org.eclipse.jetty.server.AbstractHttpConnection.content(AbstractHttpConnection.java:953)  at org.eclipse.jetty.server.AbstractHttpConnection$RequestHandler.content(AbstractHttpConnection.java:1014)  at org.eclipse.jetty.http.HttpParser.parseNext(HttpParser.java:861)  at org.eclipse.jetty.http.HttpParser.parseAvailable(HttpParser.java:240)  at org.eclipse.jetty.server.AsyncHttpConnection.handle(AsyncHttpConnection.java:82)  at org.eclipse.jetty.io.nio.SslConnection.handle(SslConnection.java:196)  at org.eclipse.jetty.io.nio.SelectChannelEndPoint.handle(SelectChannelEndPoint.java:628)  at org.eclipse.jetty.io.nio.SelectChannelEndPoint$1.run(SelectChannelEndPoint.java:52)  at org.eclipse.jetty.util.thread.QueuedThreadPool.runJob(QueuedThreadPool.java:608)  at org.eclipse.jetty.util.thread.QueuedThreadPool$3.run(QueuedThreadPool.java:543)  at java.lang.Thread.run(Thread.java:745) </str>   <int name="code">500</int> </lst> </response> 

Stack Trace:
java.lang.AssertionError: QUERY FAILED: xpath=/response/lst[@name='responseHeader']/int[@name='status'][.='0']  request=/schema/dynamicfields/newdynamicfieldPut0_*?wt=xml&updateTimeoutSecs=15  response=<?xml version="1.0" encoding="UTF-8"?>
<response>

<lst name="responseHeader">
  <int name="status">500</int>
  <int name="QTime">29608</int>
</lst>
<lst name="error">
  <str name="msg">7 out of 8 replicas failed to update their schema to version 4 within 15 seconds! Failed cores: [https://127.0.0.1:50913/wb_/collection1/, https://127.0.0.1:50894/wb_/collection1/, https://127.0.0.1:50920/wb_/collection1/, https://127.0.0.1:50897/wb_/collection1/, https://127.0.0.1:50930/wb_/collection1/, https://127.0.0.1:50901/wb_/collection1/, https://127.0.0.1:50939/wb_/collection1/]</str>
  <str name="trace">org.apache.solr.common.SolrException: 7 out of 8 replicas failed to update their schema to version 4 within 15 seconds! Failed cores: [https://127.0.0.1:50913/wb_/collection1/, https://127.0.0.1:50894/wb_/collection1/, https://127.0.0.1:50920/wb_/collection1/, https://127.0.0.1:50897/wb_/collection1/, https://127.0.0.1:50930/wb_/collection1/, https://127.0.0.1:50901/wb_/collection1/, https://127.0.0.1:50939/wb_/collection1/]
	at org.apache.solr.schema.ManagedIndexSchema.waitForSchemaZkVersionAgreement(ManagedIndexSchema.java:260)
	at org.apache.solr.rest.schema.BaseFieldResource.waitForSchemaUpdateToPropagate(BaseFieldResource.java:120)
	at org.apache.solr.rest.schema.DynamicFieldResource.put(DynamicFieldResource.java:185)
	at org.restlet.resource.ServerResource.doHandle(ServerResource.java:432)
	at org.restlet.resource.ServerResource.doConditionalHandle(ServerResource.java:350)
	at org.restlet.resource.ServerResource.handle(ServerResource.java:952)
	at org.restlet.resource.Finder.handle(Finder.java:246)
	at org.restlet.routing.Filter.doHandle(Filter.java:159)
	at org.restlet.routing.Filter.handle(Filter.java:206)
	at org.restlet.routing.Router.doHandle(Router.java:431)
	at org.restlet.routing.Router.handle(Router.java:648)
	at org.restlet.routing.Filter.doHandle(Filter.java:159)
	at org.restlet.routing.Filter.handle(Filter.java:206)
	at org.restlet.routing.Filter.doHandle(Filter.java:159)
	at org.restlet.routing.Filter.handle(Filter.java:206)
	at org.restlet.routing.Filter.doHandle(Filter.java:159)
	at org.restlet.engine.application.StatusFilter.doHandle(StatusFilter.java:155)
	at org.restlet.routing.Filter.handle(Filter.java:206)
	at org.restlet.routing.Filter.doHandle(Filter.java:159)
	at org.restlet.routing.Filter.handle(Filter.java:206)
	at org.restlet.engine.CompositeHelper.handle(CompositeHelper.java:211)
	at org.restlet.engine.application.ApplicationHelper.handle(ApplicationHelper.java:84)
	at org.restlet.Application.handle(Application.java:381)
	at org.restlet.routing.Filter.doHandle(Filter.java:159)
	at org.restlet.routing.Filter.handle(Filter.java:206)
	at org.restlet.routing.Router.doHandle(Router.java:431)
	at org.restlet.routing.Router.handle(Router.java:648)
	at org.restlet.routing.Filter.doHandle(Filter.java:159)
	at org.restlet.routing.Filter.handle(Filter.java:206)
	at org.restlet.routing.Router.doHandle(Router.java:431)
	at org.restlet.routing.Router.handle(Router.java:648)
	at org.restlet.routing.Filter.doHandle(Filter.java:159)
	at org.restlet.routing.Filter.handle(Filter.java:206)
	at org.restlet.engine.CompositeHelper.handle(CompositeHelper.java:211)
	at org.restlet.Component.handle(Component.java:392)
	at org.restlet.Server.handle(Server.java:516)
	at org.restlet.engine.ServerHelper.handle(ServerHelper.java:72)
	at org.restlet.engine.adapter.HttpServerHelper.handle(HttpServerHelper.java:152)
	at org.restlet.ext.servlet.ServerServlet.service(ServerServlet.java:1089)
	at javax.servlet.http.HttpServlet.service(HttpServlet.java:848)
	at org.eclipse.jetty.servlet.ServletHolder.handle(ServletHolder.java:669)
	at org.eclipse.jetty.servlet.ServletHandler.doHandle(ServletHandler.java:457)
	at org.eclipse.jetty.server.session.SessionHandler.doHandle(SessionHandler.java:229)
	at org.eclipse.jetty.server.handler.ScopedHandler.handle(ScopedHandler.java:137)
	at org.eclipse.jetty.server.handler.GzipHandler.handle(GzipHandler.java:301)
	at org.eclipse.jetty.server.handler.ContextHandler.doHandle(ContextHandler.java:1077)
	at org.eclipse.jetty.servlet.ServletHandler.doScope(ServletHandler.java:384)
	at org.eclipse.jetty.server.session.SessionHandler.doScope(SessionHandler.java:193)
	at org.eclipse.jetty.server.handler.ContextHandler.doScope(ContextHandler.java:1009)
	at org.eclipse.jetty.server.handler.ScopedHandler.handle(ScopedHandler.java:135)
	at org.eclipse.jetty.server.Dispatcher.forward(Dispatcher.java:276)
	at org.eclipse.jetty.server.Dispatcher.forward(Dispatcher.java:103)
	at org.apache.solr.servlet.SolrDispatchFilter.doFilter(SolrDispatchFilter.java:402)
	at org.apache.solr.servlet.SolrDispatchFilter.doFilter(SolrDispatchFilter.java:223)
	at org.eclipse.jetty.servlet.ServletHandler$CachedChain.doFilter(ServletHandler.java:1419)
	at org.apache.solr.client.solrj.embedded.JettySolrRunner$DebugFilter.doFilter(JettySolrRunner.java:104)
	at org.eclipse.jetty.servlet.ServletHandler$CachedChain.doFilter(ServletHandler.java:1419)
	at org.eclipse.jetty.servlet.ServletHandler.doHandle(ServletHandler.java:455)
	at org.eclipse.jetty.server.session.SessionHandler.doHandle(SessionHandler.java:229)
	at org.eclipse.jetty.server.handler.ScopedHandler.handle(ScopedHandler.java:137)
	at org.eclipse.jetty.server.handler.GzipHandler.handle(GzipHandler.java:301)
	at org.eclipse.jetty.server.handler.ContextHandler.doHandle(ContextHandler.java:1077)
	at org.eclipse.jetty.servlet.ServletHandler.doScope(ServletHandler.java:384)
	at org.eclipse.jetty.server.session.SessionHandler.doScope(SessionHandler.java:193)
	at org.eclipse.jetty.server.handler.ContextHandler.doScope(ContextHandler.java:1009)
	at org.eclipse.jetty.server.handler.ScopedHandler.handle(ScopedHandler.java:135)
	at org.eclipse.jetty.server.handler.HandlerWrapper.handle(HandlerWrapper.java:116)
	at org.eclipse.jetty.server.Server.handle(Server.java:368)
	at org.eclipse.jetty.server.AbstractHttpConnection.handleRequest(AbstractHttpConnection.java:489)
	at org.eclipse.jetty.server.AbstractHttpConnection.content(AbstractHttpConnection.java:953)
	at org.eclipse.jetty.server.AbstractHttpConnection$RequestHandler.content(AbstractHttpConnection.java:1014)
	at org.eclipse.jetty.http.HttpParser.parseNext(HttpParser.java:861)
	at org.eclipse.jetty.http.HttpParser.parseAvailable(HttpParser.java:240)
	at org.eclipse.jetty.server.AsyncHttpConnection.handle(AsyncHttpConnection.java:82)
	at org.eclipse.jetty.io.nio.SslConnection.handle(SslConnection.java:196)
	at org.eclipse.jetty.io.nio.SelectChannelEndPoint.handle(SelectChannelEndPoint.java:628)
	at org.eclipse.jetty.io.nio.SelectChannelEndPoint$1.run(SelectChannelEndPoint.java:52)
	at org.eclipse.jetty.util.thread.QueuedThreadPool.runJob(QueuedThreadPool.java:608)
	at org.eclipse.jetty.util.thread.QueuedThreadPool$3.run(QueuedThreadPool.java:543)
	at java.lang.Thread.run(Thread.java:745)
</str>
  <int name="code">500</int>
</lst>
</response>

	at __randomizedtesting.SeedInfo.seed([2F52CE5B675B573E:A706F181C9A73AC6]:0)
	at org.junit.Assert.fail(Assert.java:93)
	at org.apache.solr.schema.TestCloudManagedSchemaConcurrent.verifySuccess(TestCloudManagedSchemaConcurrent.java:107)
	at org.apache.solr.schema.TestCloudManagedSchemaConcurrent.addDynamicFieldPut(TestCloudManagedSchemaConcurrent.java:135)
	at org.apache.solr.schema.TestCloudManagedSchemaConcurrent.access$300(TestCloudManagedSchemaConcurrent.java:45)
	at org.apache.solr.schema.TestCloudManagedSchemaConcurrent$Operation$3.execute(TestCloudManagedSchemaConcurrent.java:286)
	at org.apache.solr.schema.TestCloudManagedSchemaConcurrent.concurrentOperationsTest(TestCloudManagedSchemaConcurrent.java:450)
	at org.apache.solr.schema.TestCloudManagedSchemaConcurrent.test(TestCloudManagedSchemaConcurrent.java:252)
	at sun.reflect.NativeMethodAccessorImpl.invoke0(Native Method)
	at sun.reflect.NativeMethodAccessorImpl.invoke(NativeMethodAccessorImpl.java:57)
	at sun.reflect.DelegatingMethodAccessorImpl.invoke(DelegatingMethodAccessorImpl.java:43)
	at java.lang.reflect.Method.invoke(Method.java:606)
	at com.carrotsearch.randomizedtesting.RandomizedRunner.invoke(RandomizedRunner.java:1627)
	at com.carrotsearch.randomizedtesting.RandomizedRunner$6.evaluate(RandomizedRunner.java:836)
	at com.carrotsearch.randomizedtesting.RandomizedRunner$7.evaluate(RandomizedRunner.java:872)
	at com.carrotsearch.randomizedtesting.RandomizedRunner$8.evaluate(RandomizedRunner.java:886)
	at org.apache.solr.BaseDistributedSearchTestCase$ShardsRepeatRule$ShardsFixedStatement.callStatement(BaseDistributedSearchTestCase.java:960)
	at org.apache.solr.BaseDistributedSearchTestCase$ShardsRepeatRule$ShardsStatement.evaluate(BaseDistributedSearchTestCase.java:935)
	at com.carrotsearch.randomizedtesting.rules.SystemPropertiesRestoreRule$1.evaluate(SystemPropertiesRestoreRule.java:57)
	at org.apache.lucene.util.TestRuleSetupTeardownChained$1.evaluate(TestRuleSetupTeardownChained.java:50)
	at org.apache.lucene.util.AbstractBeforeAfterRule$1.evaluate(AbstractBeforeAfterRule.java:46)
	at org.apache.lucene.util.TestRuleThreadAndTestName$1.evaluate(TestRuleThreadAndTestName.java:49)
	at org.apache.lucene.util.TestRuleIgnoreAfterMaxFailures$1.evaluate(TestRuleIgnoreAfterMaxFailures.java:65)
	at org.apache.lucene.util.TestRuleMarkFailure$1.evaluate(TestRuleMarkFailure.java:48)
	at com.carrotsearch.randomizedtesting.rules.StatementAdapter.evaluate(StatementAdapter.java:36)
	at com.carrotsearch.randomizedtesting.ThreadLeakControl$StatementRunner.run(ThreadLeakControl.java:365)
	at com.carrotsearch.randomizedtesting.ThreadLeakControl.forkTimeoutingTask(ThreadLeakControl.java:798)
	at com.carrotsearch.randomizedtesting.ThreadLeakControl$3.evaluate(ThreadLeakControl.java:458)
	at com.carrotsearch.randomizedtesting.RandomizedRunner.runSingleTest(RandomizedRunner.java:845)
	at com.carrotsearch.randomizedtesting.RandomizedRunner$3.evaluate(RandomizedRunner.java:747)
	at com.carrotsearch.randomizedtesting.RandomizedRunner$4.evaluate(RandomizedRunner.java:781)
	at com.carrotsearch.randomizedtesting.RandomizedRunner$5.evaluate(RandomizedRunner.java:792)
	at com.carrotsearch.randomizedtesting.rules.StatementAdapter.evaluate(StatementAdapter.java:36)
	at com.carrotsearch.randomizedtesting.rules.SystemPropertiesRestoreRule$1.evaluate(SystemPropertiesRestoreRule.java:57)
	at org.apache.lucene.util.AbstractBeforeAfterRule$1.evaluate(AbstractBeforeAfterRule.java:46)
	at com.carrotsearch.randomizedtesting.rules.StatementAdapter.evaluate(StatementAdapter.java:36)
	at org.apache.lucene.util.TestRuleStoreClassName$1.evaluate(TestRuleStoreClassName.java:42)
	at com.carrotsearch.randomizedtesting.rules.NoShadowingOrOverridesOnMethodsRule$1.evaluate(NoShadowingOrOverridesOnMethodsRule.java:39)
	at com.carrotsearch.randomizedtesting.rules.NoShadowingOrOverridesOnMethodsRule$1.evaluate(NoShadowingOrOverridesOnMethodsRule.java:39)
	at com.carrotsearch.randomizedtesting.rules.StatementAdapter.evaluate(StatementAdapter.java:36)
	at com.carrotsearch.randomizedtesting.rules.StatementAdapter.evaluate(StatementAdapter.java:36)
	at com.carrotsearch.randomizedtesting.rules.StatementAdapter.evaluate(StatementAdapter.java:36)
	at org.apache.lucene.util.TestRuleAssertionsRequired$1.evaluate(TestRuleAssertionsRequired.java:54)
	at org.apache.lucene.util.TestRuleMarkFailure$1.evaluate(TestRuleMarkFailure.java:48)
	at org.apache.lucene.util.TestRuleIgnoreAfterMaxFailures$1.evaluate(TestRuleIgnoreAfterMaxFailures.java:65)
	at org.apache.lucene.util.TestRuleIgnoreTestSuites$1.evaluate(TestRuleIgnoreTestSuites.java:55)
	at com.carrotsearch.randomizedtesting.rules.StatementAdapter.evaluate(StatementAdapter.java:36)
	at com.carrotsearch.randomizedtesting.ThreadLeakControl$StatementRunner.run(ThreadLeakControl.java:365)
	at java.lang.Thread.run(Thread.java:745)




Build Log:
[...truncated 10681 lines...]
   [junit4] Suite: org.apache.solr.schema.TestCloudManagedSchemaConcurrent
   [junit4]   2> Creating dataDir: /Users/jenkins/workspace/Lucene-Solr-5.x-MacOSX/solr/build/solr-core/test/J0/temp/solr.schema.TestCloudManagedSchemaConcurrent 2F52CE5B675B573E-001/init-core-data-001
   [junit4]   2> 2963437 T16948 oas.SolrTestCaseJ4.buildSSLConfig Randomized ssl (true) and clientAuth (false)
   [junit4]   2> 2963437 T16948 oas.BaseDistributedSearchTestCase.initHostContext Setting hostContext system property: /wb_/
   [junit4]   2> 2963451 T16948 oasc.ZkTestServer.run STARTING ZK TEST SERVER
   [junit4]   2> 2963452 T16949 oasc.ZkTestServer$2$1.setClientPort client port:0.0.0.0/0.0.0.0:0
   [junit4]   2> 2963453 T16949 oasc.ZkTestServer$ZKServerMain.runFromConfig Starting server
   [junit4]   2> 2963553 T16948 oasc.ZkTestServer.run start zk server on port:50882
   [junit4]   2> 2963554 T16948 oascc.SolrZkClient.createZkCredentialsToAddAutomatically Using default ZkCredentialsProvider
   [junit4]   2> 2963556 T16948 oascc.ConnectionManager.waitForConnected Waiting for client to connect to ZooKeeper
   [junit4]   2> 2963568 T16956 oascc.ConnectionManager.process Watcher org.apache.solr.common.cloud.ConnectionManager@31b846dd name:ZooKeeperConnection Watcher:127.0.0.1:50882 got event WatchedEvent state:SyncConnected type:None path:null path:null type:None
   [junit4]   2> 2963569 T16948 oascc.ConnectionManager.waitForConnected Client is connected to ZooKeeper
   [junit4]   2> 2963570 T16948 oascc.SolrZkClient.createZkACLProvider Using default ZkACLProvider
   [junit4]   2> 2963571 T16948 oascc.SolrZkClient.makePath makePath: /solr
   [junit4]   2> 2963581 T16948 oascc.SolrZkClient.createZkCredentialsToAddAutomatically Using default ZkCredentialsProvider
   [junit4]   2> 2963584 T16948 oascc.ConnectionManager.waitForConnected Waiting for client to connect to ZooKeeper
   [junit4]   2> 2963588 T16959 oascc.ConnectionManager.process Watcher org.apache.solr.common.cloud.ConnectionManager@11a44dfd name:ZooKeeperConnection Watcher:127.0.0.1:50882/solr got event WatchedEvent state:SyncConnected type:None path:null path:null type:None
   [junit4]   2> 2963589 T16948 oascc.ConnectionManager.waitForConnected Client is connected to ZooKeeper
   [junit4]   2> 2963589 T16948 oascc.SolrZkClient.createZkACLProvider Using default ZkACLProvider
   [junit4]   2> 2963590 T16948 oascc.SolrZkClient.makePath makePath: /collections/collection1
   [junit4]   2> 2963599 T16948 oascc.SolrZkClient.makePath makePath: /collections/collection1/shards
   [junit4]   2> 2963605 T16948 oascc.SolrZkClient.makePath makePath: /collections/control_collection
   [junit4]   2> 2963611 T16948 oascc.SolrZkClient.makePath makePath: /collections/control_collection/shards
   [junit4]   2> 2963620 T16948 oasc.AbstractZkTestCase.putConfig put /Users/jenkins/workspace/Lucene-Solr-5.x-MacOSX/solr/core/src/test-files/solr/collection1/conf/solrconfig-managed-schema.xml to /configs/conf1/solrconfig.xml
   [junit4]   2> 2963621 T16948 oascc.SolrZkClient.makePath makePath: /configs/conf1/solrconfig.xml
   [junit4]   2> 2963630 T16948 oasc.AbstractZkTestCase.putConfig put /Users/jenkins/workspace/Lucene-Solr-5.x-MacOSX/solr/core/src/test-files/solr/collection1/conf/schema.xml to /configs/conf1/schema.xml
   [junit4]   2> 2963632 T16948 oascc.SolrZkClient.makePath makePath: /configs/conf1/schema.xml
   [junit4]   2> 2963638 T16948 oasc.AbstractZkTestCase.putConfig put /Users/jenkins/workspace/Lucene-Solr-5.x-MacOSX/solr/core/src/test-files/solr/collection1/conf/solrconfig.snippet.randomindexconfig.xml to /configs/conf1/solrconfig.snippet.randomindexconfig.xml
   [junit4]   2> 2963640 T16948 oascc.SolrZkClient.makePath makePath: /configs/conf1/solrconfig.snippet.randomindexconfig.xml
   [junit4]   2> 2963647 T16948 oasc.AbstractZkTestCase.putConfig put /Users/jenkins/workspace/Lucene-Solr-5.x-MacOSX/solr/core/src/test-files/solr/collection1/conf/stopwords.txt to /configs/conf1/stopwords.txt
   [junit4]   2> 2963648 T16948 oascc.SolrZkClient.makePath makePath: /configs/conf1/stopwords.txt
   [junit4]   2> 2963669 T16948 oasc.AbstractZkTestCase.putConfig put /Users/jenkins/workspace/Lucene-Solr-5.x-MacOSX/solr/core/src/test-files/solr/collection1/conf/protwords.txt to /configs/conf1/protwords.txt
   [junit4]   2> 2963670 T16948 oascc.SolrZkClient.makePath makePath: /configs/conf1/protwords.txt
   [junit4]   2> 2963679 T16948 oasc.AbstractZkTestCase.putConfig put /Users/jenkins/workspace/Lucene-Solr-5.x-MacOSX/solr/core/src/test-files/solr/collection1/conf/currency.xml to /configs/conf1/currency.xml
   [junit4]   2> 2963681 T16948 oascc.SolrZkClient.makePath makePath: /configs/conf1/currency.xml
   [junit4]   2> 2963692 T16948 oasc.AbstractZkTestCase.putConfig put /Users/jenkins/workspace/Lucene-Solr-5.x-MacOSX/solr/core/src/test-files/solr/collection1/conf/enumsConfig.xml to /configs/conf1/enumsConfig.xml
   [junit4]   2> 2963693 T16948 oascc.SolrZkClient.makePath makePath: /configs/conf1/enumsConfig.xml
   [junit4]   2> 2963705 T16948 oasc.AbstractZkTestCase.putConfig put /Users/jenkins/workspace/Lucene-Solr-5.x-MacOSX/solr/core/src/test-files/solr/collection1/conf/open-exchange-rates.json to /configs/conf1/open-exchange-rates.json
   [junit4]   2> 2963706 T16948 oascc.SolrZkClient.makePath makePath: /configs/conf1/open-exchange-rates.json
   [junit4]   2> 2963715 T16948 oasc.AbstractZkTestCase.putConfig put /Users/jenkins/workspace/Lucene-Solr-5.x-MacOSX/solr/core/src/test-files/solr/collection1/conf/mapping-ISOLatin1Accent.txt to /configs/conf1/mapping-ISOLatin1Accent.txt
   [junit4]   2> 2963715 T16948 oascc.SolrZkClient.makePath makePath: /configs/conf1/mapping-ISOLatin1Accent.txt
   [junit4]   2> 2963721 T16948 oasc.AbstractZkTestCase.putConfig put /Users/jenkins/workspace/Lucene-Solr-5.x-MacOSX/solr/core/src/test-files/solr/collection1/conf/old_synonyms.txt to /configs/conf1/old_synonyms.txt
   [junit4]   2> 2963722 T16948 oascc.SolrZkClient.makePath makePath: /configs/conf1/old_synonyms.txt
   [junit4]   2> 2963730 T16948 oasc.AbstractZkTestCase.putConfig put /Users/jenkins/workspace/Lucene-Solr-5.x-MacOSX/solr/core/src/test-files/solr/collection1/conf/synonyms.txt to /configs/conf1/synonyms.txt
   [junit4]   2> 2963731 T16948 oascc.SolrZkClient.makePath makePath: /configs/conf1/synonyms.txt
   [junit4]   2> 2963740 T16948 oascc.SolrZkClient.createZkCredentialsToAddAutomatically Using default ZkCredentialsProvider
   [junit4]   2> 2963742 T16948 oascc.ConnectionManager.waitForConnected Waiting for client to connect to ZooKeeper
   [junit4]   2> 2963746 T16962 oascc.ConnectionManager.process Watcher org.apache.solr.common.cloud.ConnectionManager@54e47eda name:ZooKeeperConnection Watcher:127.0.0.1:50882/solr got event WatchedEvent state:SyncConnected type:None path:null path:null type:None
   [junit4]   2> 2963746 T16948 oascc.ConnectionManager.waitForConnected Client is connected to ZooKeeper
   [junit4]   2> 2963746 T16948 oascc.SolrZkClient.createZkACLProvider Using default ZkACLProvider
   [junit4]   2> 2964408 T16948 oas.SolrTestCaseJ4.writeCoreProperties Writing core.properties file to /Users/jenkins/workspace/Lucene-Solr-5.x-MacOSX/solr/build/solr-core/test/J0/temp/solr.schema.TestCloudManagedSchemaConcurrent 2F52CE5B675B573E-001/control-001/cores/collection1
   [junit4]   2> 2964414 T16948 oejs.Server.doStart jetty-8.1.10.v20130312
   [junit4]   2> 2964425 T16948 oejus.SslContextFactory.doStart Enabled Protocols [SSLv2Hello, TLSv1, TLSv1.1, TLSv1.2] of [SSLv2Hello, SSLv3, TLSv1, TLSv1.1, TLSv1.2]
   [junit4]   2> 2964430 T16948 oejs.AbstractConnector.doStart Started SslSelectChannelConnector@127.0.0.1:50886
   [junit4]   2> 2964430 T16948 oascse.JettySolrRunner$1.lifeCycleStarted Jetty properties: {hostPort=50886, hostContext=/wb_, coreRootDirectory=/Users/jenkins/workspace/Lucene-Solr-5.x-MacOSX/solr/build/solr-core/test/J0/temp/solr.schema.TestCloudManagedSchemaConcurrent 2F52CE5B675B573E-001/control-001/cores, solr.data.dir=/Users/jenkins/workspace/Lucene-Solr-5.x-MacOSX/solr/build/solr-core/test/J0/temp/solr.schema.TestCloudManagedSchemaConcurrent 2F52CE5B675B573E-001/tempDir-001/control/data}
   [junit4]   2> 2964433 T16948 oass.SolrDispatchFilter.init SolrDispatchFilter.init()sun.misc.Launcher$AppClassLoader@8f8acd0
   [junit4]   2> 2964433 T16948 oasc.SolrResourceLoader.<init> new SolrResourceLoader for directory: '/Users/jenkins/workspace/Lucene-Solr-5.x-MacOSX/solr/build/solr-core/test/J0/temp/solr.schema.TestCloudManagedSchemaConcurrent 2F52CE5B675B573E-001/control-001/'
   [junit4]   2> 2964506 T16948 oasc.SolrXmlConfig.fromFile Loading container configuration from /Users/jenkins/workspace/Lucene-Solr-5.x-MacOSX/solr/build/solr-core/test/J0/temp/solr.schema.TestCloudManagedSchemaConcurrent 2F52CE5B675B573E-001/control-001/solr.xml
   [junit4]   2> 2964642 T16948 oasc.CorePropertiesLocator.<init> Config-defined core root directory: /Users/jenkins/workspace/Lucene-Solr-5.x-MacOSX/solr/build/solr-core/test/J0/temp/solr.schema.TestCloudManagedSchemaConcurrent 2F52CE5B675B573E-001/control-001/cores
   [junit4]   2> 2964643 T16948 oasc.CoreContainer.<init> New CoreContainer 1076077357
   [junit4]   2> 2964643 T16948 oasc.CoreContainer.load Loading cores into CoreContainer [instanceDir=/Users/jenkins/workspace/Lucene-Solr-5.x-MacOSX/solr/build/solr-core/test/J0/temp/solr.schema.TestCloudManagedSchemaConcurrent 2F52CE5B675B573E-001/control-001/]
   [junit4]   2> 2964643 T16948 oasc.CoreContainer.load loading shared library: /Users/jenkins/workspace/Lucene-Solr-5.x-MacOSX/solr/build/solr-core/test/J0/temp/solr.schema.TestCloudManagedSchemaConcurrent 2F52CE5B675B573E-001/control-001/lib
   [junit4]   2> 2964645 T16948 oasc.SolrResourceLoader.addToClassLoader WARN Can't find (or read) directory to add to classloader: lib (resolved as: /Users/jenkins/workspace/Lucene-Solr-5.x-MacOSX/solr/build/solr-core/test/J0/temp/solr.schema.TestCloudManagedSchemaConcurrent 2F52CE5B675B573E-001/control-001/lib).
   [junit4]   2> 2964667 T16948 oashc.HttpShardHandlerFactory.init created with socketTimeout : 90000,urlScheme : ,connTimeout : 15000,maxConnectionsPerHost : 20,maxConnections : 10000,corePoolSize : 0,maximumPoolSize : 2147483647,maxThreadIdleTime : 5,sizeOfQueue : -1,fairnessPolicy : false,useRetries : false,
   [junit4]   2> 2964677 T16948 oasu.UpdateShardHandler.<init> Creating UpdateShardHandler HTTP client with params: socketTimeout=340000&connTimeout=45000&retry=true
   [junit4]   2> 2964681 T16948 oasl.LogWatcher.createWatcher SLF4J impl is org.slf4j.impl.Log4jLoggerFactory
   [junit4]   2> 2964682 T16948 oasl.LogWatcher.newRegisteredLogWatcher Registering Log Listener [Log4j (org.slf4j.impl.Log4jLoggerFactory)]
   [junit4]   2> 2964682 T16948 oasc.CoreContainer.load Node Name: 127.0.0.1
   [junit4]   2> 2964682 T16948 oasc.ZkContainer.initZooKeeper Zookeeper client=127.0.0.1:50882/solr
   [junit4]   2> 2964683 T16948 oasc.ZkController.checkChrootPath zkHost includes chroot
   [junit4]   2> 2964684 T16948 oascc.SolrZkClient.createZkCredentialsToAddAutomatically Using default ZkCredentialsProvider
   [junit4]   2> 2964686 T16948 oascc.ConnectionManager.waitForConnected Waiting for client to connect to ZooKeeper
   [junit4]   2> 2964692 T16974 oascc.ConnectionManager.process Watcher org.apache.solr.common.cloud.ConnectionManager@1280fe5e name:ZooKeeperConnection Watcher:127.0.0.1:50882 got event WatchedEvent state:SyncConnected type:None path:null path:null type:None
   [junit4]   2> 2964693 T16948 oascc.ConnectionManager.waitForConnected Client is connected to ZooKeeper
   [junit4]   2> 2964694 T16948 oascc.SolrZkClient.createZkACLProvider Using default ZkACLProvider
   [junit4]   2> 2964701 T16948 N:127.0.0.1:50886_wb_ oascc.ConnectionManager.waitForConnected Waiting for client to connect to ZooKeeper
   [junit4]   2> 2964706 T16977 N:127.0.0.1:50886_wb_ oascc.ConnectionManager.process Watcher org.apache.solr.common.cloud.ConnectionManager@77c6bd8e name:ZooKeeperConnection Watcher:127.0.0.1:50882/solr got event WatchedEvent state:SyncConnected type:None path:null path:null type:None
   [junit4]   2> 2964706 T16948 N:127.0.0.1:50886_wb_ oascc.ConnectionManager.waitForConnected Client is connected to ZooKeeper
   [junit4]   2> 2964710 T16948 N:127.0.0.1:50886_wb_ oascc.SolrZkClient.makePath makePath: /overseer/queue
   [junit4]   2> 2964732 T16948 N:127.0.0.1:50886_wb_ oascc.SolrZkClient.makePath makePath: /overseer/collection-queue-work
   [junit4]   2> 2964741 T16948 N:127.0.0.1:50886_wb_ oascc.SolrZkClient.makePath makePath: /overseer/collection-map-running
   [junit4]   2> 2964749 T16948 N:127.0.0.1:50886_wb_ oascc.SolrZkClient.makePath makePath: /overseer/collection-map-completed
   [junit4]   2> 2964759 T16948 N:127.0.0.1:50886_wb_ oascc.SolrZkClient.makePath makePath: /overseer/collection-map-failure
   [junit4]   2> 2964780 T16948 N:127.0.0.1:50886_wb_ oascc.SolrZkClient.makePath makePath: /live_nodes
   [junit4]   2> 2964787 T16948 N:127.0.0.1:50886_wb_ oascc.SolrZkClient.makePath makePath: /aliases.json
   [junit4]   2> 2964796 T16948 N:127.0.0.1:50886_wb_ oascc.SolrZkClient.makePath makePath: /clusterstate.json
   [junit4]   2> 2964802 T16948 N:127.0.0.1:50886_wb_ oasc.ZkController.createEphemeralLiveNode Register node as live in ZooKeeper:/live_nodes/127.0.0.1:50886_wb_
   [junit4]   2> 2964805 T16948 N:127.0.0.1:50886_wb_ oascc.SolrZkClient.makePath makePath: /live_nodes/127.0.0.1:50886_wb_
   [junit4]   2> 2964820 T16948 N:127.0.0.1:50886_wb_ oascc.SolrZkClient.makePath makePath: /overseer_elect
   [junit4]   2> 2964830 T16948 N:127.0.0.1:50886_wb_ oascc.SolrZkClient.makePath makePath: /overseer_elect/election
   [junit4]   2> 2964842 T16948 N:127.0.0.1:50886_wb_ oasc.Overseer.close Overseer (id=null) closing
   [junit4]   2> 2964847 T16948 N:127.0.0.1:50886_wb_ oasc.OverseerElectionContext.runLeaderProcess I am going to be the leader 127.0.0.1:50886_wb_
   [junit4]   2> 2964848 T16948 N:127.0.0.1:50886_wb_ oascc.SolrZkClient.makePath makePath: /overseer_elect/leader
   [junit4]   2> 2964855 T16948 N:127.0.0.1:50886_wb_ oasc.Overseer.start Overseer (id=93684670385422340-127.0.0.1:50886_wb_-n_0000000000) starting
   [junit4]   2> 2964862 T16948 N:127.0.0.1:50886_wb_ oascc.SolrZkClient.makePath makePath: /overseer/queue-work
   [junit4]   2> 2964893 T16948 N:127.0.0.1:50886_wb_ oasc.OverseerAutoReplicaFailoverThread.<init> Starting OverseerAutoReplicaFailoverThread autoReplicaFailoverWorkLoopDelay=10000 autoReplicaFailoverWaitAfterExpiration=30000 autoReplicaFailoverBadNodeExpiration=60000
   [junit4]   2> 2964896 T16979 N:127.0.0.1:50886_wb_ oasc.OverseerCollectionProcessor.run Process current queue of collection creations
   [junit4]   2> 2964896 T16948 N:127.0.0.1:50886_wb_ oascc.ZkStateReader.createClusterStateWatchersAndUpdate Updating cluster state from ZooKeeper... 
   [junit4]   2> 2964898 T16978 N:127.0.0.1:50886_wb_ oasc.Overseer$ClusterStateUpdater.run Starting to work on the main queue
   [junit4]   2> 2964915 T16948 N:127.0.0.1:50886_wb_ oasc.CorePropertiesLocator.discover Looking for core definitions underneath /Users/jenkins/workspace/Lucene-Solr-5.x-MacOSX/solr/build/solr-core/test/J0/temp/solr.schema.TestCloudManagedSchemaConcurrent 2F52CE5B675B573E-001/control-001/cores
   [junit4]   2> 2964917 T16948 N:127.0.0.1:50886_wb_ oasc.CoreDescriptor.<init> CORE DESCRIPTOR: {config=solrconfig.xml, transient=false, absoluteInstDir=/Users/jenkins/workspace/Lucene-Solr-5.x-MacOSX/solr/build/solr-core/test/J0/temp/solr.schema.TestCloudManagedSchemaConcurrent 2F52CE5B675B573E-001/control-001/cores/collection1/, coreNodeName=, schema=schema.xml, instanceDir=/Users/jenkins/workspace/Lucene-Solr-5.x-MacOSX/solr/build/solr-core/test/J0/temp/solr.schema.TestCloudManagedSchemaConcurrent 2F52CE5B675B573E-001/control-001/cores/collection1, loadOnStartup=true, shard=, dataDir=data/, collection=control_collection, name=collection1}
   [junit4]   2> 2964918 T16948 N:127.0.0.1:50886_wb_ oasc.CorePropertiesLocator.discoverUnder Found core collection1 in /Users/jenkins/workspace/Lucene-Solr-5.x-MacOSX/solr/build/solr-core/test/J0/temp/solr.schema.TestCloudManagedSchemaConcurrent 2F52CE5B675B573E-001/control-001/cores/collection1/
   [junit4]   2> 2964918 T16948 N:127.0.0.1:50886_wb_ oasc.CorePropertiesLocator.discover Found 1 core definitions
   [junit4]   2> 2964925 T16981 N:127.0.0.1:50886_wb_ C:control_collection c:collection1 oasc.ZkController.publish publishing core=collection1 state=down collection=control_collection
   [junit4]   2> 2964926 T16981 N:127.0.0.1:50886_wb_ C:control_collection c:collection1 oasc.ZkController.publish numShards not found on descriptor - reading it from system property
   [junit4]   2> 2964928 T16981 N:127.0.0.1:50886_wb_ oasc.ZkController.waitForCoreNodeName look for our core node name
   [junit4]   2> 2964928 T16977 N:127.0.0.1:50886_wb_ oasc.DistributedQueue$LatchWatcher.process NodeChildrenChanged fired on path /overseer/queue state SyncConnected
   [junit4]   2> 2964931 T16978 N:127.0.0.1:50886_wb_ oasc.Overseer$ClusterStateUpdater.run processMessage: queueSize: 1, message = {
   [junit4]   2> 	  "shard":null,
   [junit4]   2> 	  "node_name":"127.0.0.1:50886_wb_",
   [junit4]   2> 	  "roles":null,
   [junit4]   2> 	  "numShards":"1",
   [junit4]   2> 	  "operation":"state",
   [junit4]   2> 	  "collection":"control_collection",
   [junit4]   2> 	  "core":"collection1",
   [junit4]   2> 	  "base_url":"https://127.0.0.1:50886/wb_",
   [junit4]   2> 	  "state":"down"} current state version: 0
   [junit4]   2> 2964934 T16978 N:127.0.0.1:50886_wb_ oasco.ReplicaMutator.updateState Update state numShards=1 message={
   [junit4]   2> 	  "shard":null,
   [junit4]   2> 	  "node_name":"127.0.0.1:50886_wb_",
   [junit4]   2> 	  "roles":null,
   [junit4]   2> 	  "numShards":"1",
   [junit4]   2> 	  "operation":"state",
   [junit4]   2> 	  "collection":"control_collection",
   [junit4]   2> 	  "core":"collection1",
   [junit4]   2> 	  "base_url":"https://127.0.0.1:50886/wb_",
   [junit4]   2> 	  "state":"down"}
   [junit4]   2> 2964934 T16978 N:127.0.0.1:50886_wb_ oasco.ClusterStateMutator.createCollection building a new cName: control_collection
   [junit4]   2> 2964935 T16978 N:127.0.0.1:50886_wb_ oasco.ReplicaMutator.updateState Assigning new node to shard shard=shard1
   [junit4]   2> 2964939 T16977 N:127.0.0.1:50886_wb_ oascc.ZkStateReader$2.process A cluster state change: WatchedEvent state:SyncConnected type:NodeDataChanged path:/clusterstate.json, has occurred - updating... (live nodes size: 1)
   [junit4]   2> 2965931 T16981 N:127.0.0.1:50886_wb_ oasc.ZkController.waitForShardId waiting to find shard id in clusterstate for collection1
   [junit4]   2> 2965932 T16981 N:127.0.0.1:50886_wb_ oasc.ZkController.createCollectionZkNode Check for collection zkNode:control_collection
   [junit4]   2> 2965947 T16981 N:127.0.0.1:50886_wb_ oasc.ZkController.createCollectionZkNode Collection zkNode exists
   [junit4]   2> 2965947 T16981 N:127.0.0.1:50886_wb_ oascc.ZkStateReader.readConfigName Load collection config from:/collections/control_collection
   [junit4]   2> 2965949 T16981 N:127.0.0.1:50886_wb_ oascc.ZkStateReader.readConfigName path=/collections/control_collection configName=conf1 specified config exists in ZooKeeper
   [junit4]   2> 2965950 T16981 N:127.0.0.1:50886_wb_ oasc.SolrResourceLoader.<init> new SolrResourceLoader for directory: '/Users/jenkins/workspace/Lucene-Solr-5.x-MacOSX/solr/build/solr-core/test/J0/temp/solr.schema.TestCloudManagedSchemaConcurrent 2F52CE5B675B573E-001/control-001/cores/collection1/'
   [junit4]   2> 2966033 T16981 N:127.0.0.1:50886_wb_ oasc.ZkController.watchZKConfDir watch zkdir /configs/conf1
   [junit4]   2> 2966042 T16981 N:127.0.0.1:50886_wb_ oasc.Config.<init> loaded config solrconfig.xml with version 0 
   [junit4]   2> 2966082 T16981 N:127.0.0.1:50886_wb_ oasc.SolrConfig.refreshRequestParams current version of requestparams : -1
   [junit4]   2> 2966110 T16981 N:127.0.0.1:50886_wb_ oasc.SolrConfig.<init> Using Lucene MatchVersion: 5.2.0
   [junit4]   2> 2966273 T16981 N:127.0.0.1:50886_wb_ oasc.SolrConfig.<init> Loaded SolrConfig: solrconfig.xml
   [junit4]   2> 2966276 T16981 N:127.0.0.1:50886_wb_ oass.ManagedIndexSchemaFactory.create The schema is configured as managed, but managed schema resource managed-schema not found - loading non-managed schema schema.xml instead
   [junit4]   2> 2966279 T16981 N:127.0.0.1:50886_wb_ oass.IndexSchema.readSchema Reading Solr Schema from /configs/conf1/schema.xml
   [junit4]   2> 2966294 T16981 N:127.0.0.1:50886_wb_ oass.IndexSchema.readSchema [collection1] Schema name=test
   [junit4]   2> 2967709 T16981 N:127.0.0.1:50886_wb_ oass.OpenExchangeRatesOrgProvider.init Initialized with rates=open-exchange-rates.json, refreshInterval=1440.
   [junit4]   2> 2967747 T16981 N:127.0.0.1:50886_wb_ oass.IndexSchema.readSchema default search field in schema is text
   [junit4]   2> 2967753 T16981 N:127.0.0.1:50886_wb_ oass.IndexSchema.readSchema unique key field: id
   [junit4]   2> 2967888 T16981 N:127.0.0.1:50886_wb_ oass.FileExchangeRateProvider.reload Reloading exchange rates from file currency.xml
   [junit4]   2> 2967908 T16981 N:127.0.0.1:50886_wb_ oass.FileExchangeRateProvider.reload Reloading exchange rates from file currency.xml
   [junit4]   2> 2967919 T16981 N:127.0.0.1:50886_wb_ oass.OpenExchangeRatesOrgProvider.reload Reloading exchange rates from open-exchange-rates.json
   [junit4]   2> 2967931 T16981 N:127.0.0.1:50886_wb_ oass.OpenExchangeRatesOrgProvider$OpenExchangeRates.<init> WARN Unknown key IMPORTANT NOTE
   [junit4]   2> 2967932 T16981 N:127.0.0.1:50886_wb_ oass.OpenExchangeRatesOrgProvider$OpenExchangeRates.<init> WARN Expected key, got STRING
   [junit4]   2> 2967932 T16981 N:127.0.0.1:50886_wb_ oass.OpenExchangeRatesOrgProvider.reload Reloading exchange rates from open-exchange-rates.json
   [junit4]   2> 2967969 T16981 N:127.0.0.1:50886_wb_ oass.OpenExchangeRatesOrgProvider$OpenExchangeRates.<init> WARN Unknown key IMPORTANT NOTE
   [junit4]   2> 2967970 T16981 N:127.0.0.1:50886_wb_ oass.OpenExchangeRatesOrgProvider$OpenExchangeRates.<init> WARN Expected key, got STRING
   [junit4]   2> 2967979 T16981 N:127.0.0.1:50886_wb_ oass.ManagedIndexSchema.persistManagedSchemaToZooKeeper Created and persisted managed schema znode at /configs/conf1/managed-schema
   [junit4]   2> 2967992 T16981 N:127.0.0.1:50886_wb_ oascc.SolrZkClient.makePath makePath: /configs/conf1/schema.xml.bak
   [junit4]   2> 2968024 T16981 N:127.0.0.1:50886_wb_ oass.ManagedIndexSchemaFactory.zkUgradeToManagedSchema After upgrading to managed schema in ZooKeeper, renamed the non-managed schema /configs/conf1/schema.xml to /configs/conf1/schema.xml.bak
   [junit4]   2> 2968024 T16981 N:127.0.0.1:50886_wb_ oasc.CoreContainer.create Creating SolrCore 'collection1' using configuration from collection control_collection
   [junit4]   2> 2968025 T16981 N:127.0.0.1:50886_wb_ c:collection1 oasc.SolrCore.initDirectoryFactory solr.NRTCachingDirectoryFactory
   [junit4]   2> 2968025 T16981 N:127.0.0.1:50886_wb_ c:collection1 oasc.SolrCore.<init> [collection1] Opening new SolrCore at /Users/jenkins/workspace/Lucene-Solr-5.x-MacOSX/solr/build/solr-core/test/J0/temp/solr.schema.TestCloudManagedSchemaConcurrent 2F52CE5B675B573E-001/control-001/cores/collection1/, dataDir=/Users/jenkins/workspace/Lucene-Solr-5.x-MacOSX/solr/build/solr-core/test/J0/temp/solr.schema.TestCloudManagedSchemaConcurrent 2F52CE5B675B573E-001/control-001/cores/collection1/data/
   [junit4]   2> 2968025 T16981 N:127.0.0.1:50886_wb_ c:collection1 oasc.SolrCore.<init> JMX monitoring not detected for core: collection1
   [junit4]   2> 2968027 T16981 N:127.0.0.1:50886_wb_ c:collection1 oasc.CachingDirectoryFactory.get return new directory for /Users/jenkins/workspace/Lucene-Solr-5.x-MacOSX/solr/build/solr-core/test/J0/temp/solr.schema.TestCloudManagedSchemaConcurrent 2F52CE5B675B573E-001/control-001/cores/collection1/data
   [junit4]   2> 2968028 T16981 N:127.0.0.1:50886_wb_ c:collection1 oasc.SolrCore.getNewIndexDir New index directory detected: old=null new=/Users/jenkins/workspace/Lucene-Solr-5.x-MacOSX/solr/build/solr-core/test/J0/temp/solr.schema.TestCloudManagedSchemaConcurrent 2F52CE5B675B573E-001/control-001/cores/collection1/data/index/
   [junit4]   2> 2968030 T16981 N:127.0.0.1:50886_wb_ c:collection1 oasc.SolrCore.initIndex WARN [collection1] Solr index directory '/Users/jenkins/workspace/Lucene-Solr-5.x-MacOSX/solr/build/solr-core/test/J0/temp/solr.schema.TestCloudManagedSchemaConcurrent 2F52CE5B675B573E-001/control-001/cores/collection1/data/index' doesn't exist. Creating new index...
   [junit4]   2> 2968031 T16981 N:127.0.0.1:50886_wb_ c:collection1 oasc.CachingDirectoryFactory.get return new directory for /Users/jenkins/workspace/Lucene-Solr-5.x-MacOSX/solr/build/solr-core/test/J0/temp/solr.schema.TestCloudManagedSchemaConcurrent 2F52CE5B675B573E-001/control-001/cores/collection1/data/index
   [junit4]   2> 2968031 T16981 N:127.0.0.1:50886_wb_ c:collection1 oasu.RandomMergePolicy.<init> RandomMergePolicy wrapping class org.apache.lucene.index.LogByteSizeMergePolicy: [LogByteSizeMergePolicy: minMergeSize=1677721, mergeFactor=21, maxMergeSize=2147483648, maxMergeSizeForForcedMerge=9223372036854775807, calibrateSizeByDeletes=true, maxMergeDocs=2147483647, maxCFSSegmentSizeMB=8.796093022207999E12, noCFSRatio=0.7738269487131495]
   [junit4]   2> 2968054 T16981 N:127.0.0.1:50886_wb_ c:collection1 oasc.SolrDeletionPolicy.onCommit SolrDeletionPolicy.onCommit: commits: num=1
   [junit4]   2> 		commit{dir=NRTCachingDirectory(MMapDirectory@/Users/jenkins/workspace/Lucene-Solr-5.x-MacOSX/solr/build/solr-core/test/J0/temp/solr.schema.TestCloudManagedSchemaConcurrent 2F52CE5B675B573E-001/control-001/cores/collection1/data/index lockFactory=org.apache.lucene.store.SingleInstanceLockFactory@27749d47; maxCacheMB=48.0 maxMergeSizeMB=4.0),segFN=segments_1,generation=1}
   [junit4]   2> 2968055 T16981 N:127.0.0.1:50886_wb_ c:collection1 oasc.SolrDeletionPolicy.updateCommits newest commit generation = 1
   [junit4]   2> 2968090 T16981 N:127.0.0.1:50886_wb_ c:collection1 oasc.SolrCore.loadUpdateProcessorChains no updateRequestProcessorChain defined as default, creating implicit default
   [junit4]   2> 2968090 T16981 N:127.0.0.1:50886_wb_ c:collection1 oasc.RequestHandlers.applyInitParams WARN INVALID paramSet a in requestHandler {type = requestHandler,name = /dump,class = DumpRequestHandler,args = {defaults={a=A,b=B}}}
   [junit4]   2> 2968127 T16981 N:127.0.0.1:50886_wb_ c:collection1 oashl.XMLLoader.init xsltCacheLifetimeSeconds=60
   [junit4]   2> 2968130 T16981 N:127.0.0.1:50886_wb_ c:collection1 oashl.XMLLoader.init xsltCacheLifetimeSeconds=60
   [junit4]   2> 2968134 T16981 N:127.0.0.1:50886_wb_ c:collection1 oashl.XMLLoader.init xsltCacheLifetimeSeconds=60
   [junit4]   2> 2968149 T16981 N:127.0.0.1:50886_wb_ c:collection1 oashl.XMLLoader.init xsltCacheLifetimeSeconds=60
   [junit4]   2> 2968183 T16981 N:127.0.0.1:50886_wb_ c:collection1 oasc.RequestHandlers.initHandlersFromConfig Registered paths: /admin/threads,standard,/schema,/update/json,/admin/plugins,/update/json/docs,/admin/segments,/admin/luke,/config,/replication,/admin/mbeans,/admin/system,/admin/properties,/update,/admin/file,/admin/logging,/dump,/admin/ping,/update/csv,/get
   [junit4]   2> 2968192 T16981 N:127.0.0.1:50886_wb_ c:collection1 oasc.SolrCore.initStatsCache Using default statsCache cache: org.apache.solr.search.stats.LocalStatsCache
   [junit4]   2> 2968194 T16981 N:127.0.0.1:50886_wb_ c:collection1 oasu.UpdateHandler.<init> Using UpdateLog implementation: org.apache.solr.update.UpdateLog
   [junit4]   2> 2968194 T16981 N:127.0.0.1:50886_wb_ c:collection1 oasu.UpdateLog.init Initializing UpdateLog: dataDir= defaultSyncLevel=FLUSH numRecordsToKeep=100 maxNumLogsToKeep=10
   [junit4]   2> 2968195 T16981 N:127.0.0.1:50886_wb_ c:collection1 oasu.CommitTracker.<init> Hard AutoCommit: disabled
   [junit4]   2> 2968196 T16981 N:127.0.0.1:50886_wb_ c:collection1 oasu.CommitTracker.<init> Soft AutoCommit: disabled
   [junit4]   2> 2968210 T16981 N:127.0.0.1:50886_wb_ c:collection1 oasu.RandomMergePolicy.<init> RandomMergePolicy wrapping class org.apache.lucene.index.TieredMergePolicy: [TieredMergePolicy: maxMergeAtOnce=29, maxMergeAtOnceExplicit=46, maxMergedSegmentMB=45.359375, floorSegmentMB=1.892578125, forceMergeDeletesPctAllowed=0.14044700518084818, segmentsPerTier=4.0, maxCFSSegmentSizeMB=8.796093022207999E12, noCFSRatio=0.518010615665878
   [junit4]   2> 2968212 T16981 N:127.0.0.1:50886_wb_ c:collection1 oasc.SolrDeletionPolicy.onInit SolrDeletionPolicy.onInit: commits: num=1
   [junit4]   2> 		commit{dir=NRTCachingDirectory(MMapDirectory@/Users/jenkins/workspace/Lucene-Solr-5.x-MacOSX/solr/build/solr-core/test/J0/temp/solr.schema.TestCloudManagedSchemaConcurrent 2F52CE5B675B573E-001/control-001/cores/collection1/data/index lockFactory=org.apache.lucene.store.SingleInstanceLockFactory@27749d47; maxCacheMB=48.0 maxMergeSizeMB=4.0),segFN=segments_1,generation=1}
   [junit4]   2> 2968212 T16981 N:127.0.0.1:50886_wb_ c:collection1 oasc.SolrDeletionPolicy.updateCommits newest commit generation = 1
   [junit4]   2> 2968213 T16981 N:127.0.0.1:50886_wb_ c:collection1 oass.SolrIndexSearcher.<init> Opening Searcher@cdf3a5b[collection1] main
   [junit4]   2> 2968213 T16981 N:127.0.0.1:50886_wb_ c:collection1 oascc.ZkStateReader.readConfigName Load collection config from:/collections/control_collection
   [junit4]   2> 2968215 T16981 N:127.0.0.1:50886_wb_ c:collection1 oascc.ZkStateReader.readConfigName path=/collections/control_collection configName=conf1 specified config exists in ZooKeeper
   [junit4]   2> 2968215 T16981 N:127.0.0.1:50886_wb_ c:collection1 oasr.ManagedResourceStorage.newStorageIO Setting up ZooKeeper-based storage for the RestManager with znodeBase: /configs/conf1
   [junit4]   2> 2968216 T16981 N:127.0.0.1:50886_wb_ c:collection1 oasr.ManagedResourceStorage$ZooKeeperStorageIO.configure Configured ZooKeeperStorageIO with znodeBase: /configs/conf1
   [junit4]   2> 2968217 T16981 N:127.0.0.1:50886_wb_ c:collection1 oasr.RestManager.init Initializing RestManager with initArgs: {}
   [junit4]   2> 2968217 T16981 N:127.0.0.1:50886_wb_ c:collection1 oasr.ManagedResourceStorage.load Reading _rest_managed.json using ZooKeeperStorageIO:path=/configs/conf1
   [junit4]   2> 2968218 T16981 N:127.0.0.1:50886_wb_ c:collection1 oasr.ManagedResourceStorage$ZooKeeperStorageIO.openInputStream No data found for znode /configs/conf1/_rest_managed.json
   [junit4]   2> 2968219 T16981 N:127.0.0.1:50886_wb_ c:collection1 oasr.ManagedResourceStorage.load Loaded null at path _rest_managed.json using ZooKeeperStorageIO:path=/configs/conf1
   [junit4]   2> 2968219 T16981 N:127.0.0.1:50886_wb_ c:collection1 oasr.RestManager.init Initializing 0 registered ManagedResources
   [junit4]   2> 2968232 T16981 N:127.0.0.1:50886_wb_ c:collection1 oass.ZkIndexSchemaReader.createSchemaWatcher Creating ZooKeeper watch for the managed schema at /configs/conf1/managed-schema
   [junit4]   2> 2968268 T16981 N:127.0.0.1:50886_wb_ c:collection1 oash.ReplicationHandler.inform Commits will be reserved for  10000
   [junit4]   2> 2968269 T16983 N:127.0.0.1:50886_wb_ c:collection1 oasc.SolrCore.registerSearcher [collection1] Registered new searcher Searcher@cdf3a5b[collection1] main{ExitableDirectoryReader(UninvertingDirectoryReader())}
   [junit4]   2> 2968269 T16981 N:127.0.0.1:50886_wb_ c:collection1 oasc.CoreContainer.registerCore registering core: collection1
   [junit4]   2> 2968273 T16986 N:127.0.0.1:50886_wb_ C:control_collection S:shard1 c:collection1 oasc.ZkController.register Register replica - core:collection1 address:https://127.0.0.1:50886/wb_ collection:control_collection shard:shard1
   [junit4]   2> 2968281 T16948 N:127.0.0.1:50886_wb_ oass.SolrDispatchFilter.init user.dir=/Users/jenkins/workspace/Lucene-Solr-5.x-MacOSX/solr/build/solr-core/test/J0
   [junit4]   2> 2968282 T16948 N:127.0.0.1:50886_wb_ oass.SolrDispatchFilter.init SolrDispatchFilter.init() done
   [junit4]   2> 2968292 T16948 oascc.SolrZkClient.createZkCredentialsToAddAutomatically Using default ZkCredentialsProvider
   [junit4]   2> 2968302 T16986 N:127.0.0.1:50886_wb_ C:control_collection S:shard1 c:collection1 oascc.SolrZkClient.makePath makePath: /collections/control_collection/leader_elect/shard1/election
   [junit4]   2> 2968303 T16948 oascc.ConnectionManager.waitForConnected Waiting for client to connect to ZooKeeper
   [junit4]   2> 2968308 T16989 oascc.ConnectionManager.process Watcher org.apache.solr.common.cloud.ConnectionManager@12ea83c5 name:ZooKeeperConnection Watcher:127.0.0.1:50882/solr got event WatchedEvent state:SyncConnected type:None path:null path:null type:None
   [junit4]   2> 2968312 T16948 oascc.ConnectionManager.waitForConnected Client is connected to ZooKeeper
   [junit4]   2> 2968314 T16948 oascc.SolrZkClient.createZkACLProvider Using default ZkACLProvider
   [junit4]   2> 2968314 T16948 oascc.ZkStateReader.createClusterStateWatchersAndUpdate Updating cluster state from ZooKeeper... 
   [junit4]   2> 2968345 T16986 N:127.0.0.1:50886_wb_ C:control_collection S:shard1 c:collection1 oasc.ShardLeaderElectionContext.runLeaderProcess Running the leader process for shard shard1
   [junit4]   2> 2968345 T16948 oasc.ChaosMonkey.monkeyLog monkey: init - expire sessions:false cause connection loss:false
   [junit4]   2> 2968377 T16977 N:127.0.0.1:50886_wb_ oasc.DistributedQueue$LatchWatcher.process NodeChildrenChanged fired on path /overseer/queue state SyncConnected
   [junit4]   2> 2968387 T16986 N:127.0.0.1:50886_wb_ C:control_collection S:shard1 c:collection1 oasc.ShardLeaderElectionContext.waitForReplicasToComeUp Enough replicas found to continue.
   [junit4]   2> 2968387 T16986 N:127.0.0.1:50886_wb_ C:control_collection S:shard1 c:collection1 oasc.ShardLeaderElectionContext.runLeaderProcess I may be the new leader - try and sync
   [junit4]   2> ASYNC  NEW_CORE C8262 name=collection1 org.apache.solr.core.SolrCore@222f040e url=https://127.0.0.1:50886/wb_/collection1 node=127.0.0.1:50886_wb_ C8262_STATE=coll:control_collection core:collection1 props:{node_name=127.0.0.1:50886_wb_, core=collection1, base_url=https://127.0.0.1:50886/wb_, state=down}
   [junit4]   2> 2968388 T16986 N:127.0.0.1:50886_wb_ C:control_collection S:shard1 c:collection1 C8262 oasc.SyncStrategy.sync Sync replicas to https://127.0.0.1:50886/wb_/collection1/
   [junit4]   2> 2968388 T16986 N:127.0.0.1:50886_wb_ C:control_collection S:shard1 c:collection1 C8262 oasc.SyncStrategy.syncReplicas Sync Success - now sync replicas to me
   [junit4]   2> 2968388 T16986 N:127.0.0.1:50886_wb_ C:control_collection S:shard1 c:collection1 C8262 oasc.SyncStrategy.syncToMe https://127.0.0.1:50886/wb_/collection1/ has no replicas
   [junit4]   2> 2968388 T16986 N:127.0.0.1:50886_wb_ C:control_collection S:shard1 c:collection1 oasc.ShardLeaderElectionContext.runLeaderProcess I am the new leader: https://127.0.0.1:50886/wb_/collection1/ shard1
   [junit4]   2> 2968389 T16986 N:127.0.0.1:50886_wb_ C:control_collection S:shard1 c:collection1 oascc.SolrZkClient.makePath makePath: /collections/control_collection/leaders/shard1
   [junit4]   2> 2968390 T16978 N:127.0.0.1:50886_wb_ oasc.Overseer$ClusterStateUpdater.run processMessage: queueSize: 1, message = {
   [junit4]   2> 	  "operation":"leader",
   [junit4]   2> 	  "shard":"shard1",
   [junit4]   2> 	  "collection":"control_collection"} current state version: 1
   [junit4]   2> 2968395 T16989 oascc.ZkStateReader$2.process A cluster state change: WatchedEvent state:SyncConnected type:NodeDataChanged path:/clusterstate.json, has occurred - updating... (live nodes size: 1)
   [junit4]   2> 2968409 T16977 N:127.0.0.1:50886_wb_ oascc.ZkStateReader$2.process A cluster state change: WatchedEvent state:SyncConnected type:NodeDataChanged path:/clusterstate.json, has occurred - updating... (live nodes size: 1)
   [junit4]   2> 2968452 T16977 N:127.0.0.1:50886_wb_ oasc.DistributedQueue$LatchWatcher.process NodeChildrenChanged fired on path /overseer/queue state SyncConnected
   [junit4]   2> 2968454 T16978 N:127.0.0.1:50886_wb_ oasc.Overseer$ClusterStateUpdater.run processMessage: queueSize: 1, message = {
   [junit4]   2> 	  "operation":"leader",
   [junit4]   2> 	  "shard":"shard1",
   [junit4]   2> 	  "collection":"control_collection",
   [junit4]   2> 	  "base_url":"https://127.0.0.1:50886/wb_",
   [junit4]   2> 	  "core":"collection1",
   [junit4]   2> 	  "state":"active"} current state version: 2
   [junit4]   2> 2968567 T16989 oascc.ZkStateReader$2.process A cluster state change: WatchedEvent state:SyncConnected type:NodeDataChanged path:/clusterstate.json, has occurred - updating... (live nodes size: 1)
   [junit4]   2> 2968570 T16977 N:127.0.0.1:50886_wb_ oascc.ZkStateReader$2.process A cluster state change: WatchedEvent state:SyncConnected type:NodeDataChanged path:/clusterstate.json, has occurred - updating... (live nodes size: 1)
   [junit4]   2> 2968615 T16986 N:127.0.0.1:50886_wb_ C:control_collection S:shard1 c:collection1 oasc.ZkController.register We are https://127.0.0.1:50886/wb_/collection1/ and leader is https://127.0.0.1:50886/wb_/collection1/
   [junit4]   2> 2968616 T16986 N:127.0.0.1:50886_wb_ C:control_collection S:shard1 c:collection1 oasc.ZkController.register No LogReplay needed for core=collection1 baseURL=https://127.0.0.1:50886/wb_
   [junit4]   2> 2968616 T16986 N:127.0.0.1:50886_wb_ C:control_collection S:shard1 c:collection1 oasc.ZkController.checkRecovery I am the leader, no recovery necessary
   [junit4]   2> 2968616 T16986 N:127.0.0.1:50886_wb_ C:control_collection S:shard1 c:collection1 oasc.ZkController.publish publishing core=collection1 state=active collection=control_collection
   [junit4]   2> 2968617 T16986 N:127.0.0.1:50886_wb_ C:control_collection S:shard1 c:collection1 oasc.ZkController.publish numShards not found on descriptor - reading it from system property
   [junit4]   2> 2968620 T16977 N:127.0.0.1:50886_wb_ oasc.DistributedQueue$LatchWatcher.process NodeChildrenChanged fired on path /overseer/queue state SyncConnected
   [junit4]   2> 2968625 T16978 N:127.0.0.1:50886_wb_ oasc.Overseer$ClusterStateUpdater.run processMessage: queueSize: 1, message = {
   [junit4]   2> 	  "shard":"shard1",
   [junit4]   2> 	  "node_name":"127.0.0.1:50886_wb_",
   [junit4]   2> 	  "roles":null,
   [junit4]   2> 	  "numShards":"4",
   [junit4]   2> 	  "operation":"state",
   [junit4]   2> 	  "collection":"control_collection",
   [junit4]   2> 	  "core":"collection1",
   [junit4]   2> 	  "core_node_name":"core_node1",
   [junit4]   2> 	  "base_url":"https://127.0.0.1:50886/wb_",
   [junit4]   2> 	  "state":"active"} current state version: 3
   [junit4]   2> 2968631 T16978 N:127.0.0.1:50886_wb_ oasco.ReplicaMutator.updateState Update state numShards=4 message={
   [junit4]   2> 	  "shard":"shard1",
   [junit4]   2> 	  "node_name":"127.0.0.1:50886_wb_",
   [junit4]   2> 	  "roles":null,
   [junit4]   2> 	  "numShards":"4",
   [junit4]   2> 	  "operation":"state",
   [junit4]   2> 	  "collection":"control_collection",
   [junit4]   2> 	  "core":"collection1",
   [junit4]   2> 	  "core_node_name":"core_node1",
   [junit4]   2> 	  "base_url":"https://127.0.0.1:50886/wb_",
   [junit4]   2> 	  "state":"active"}
   [junit4]   2> 2968754 T16989 oascc.ZkStateReader$2.process A cluster state change: WatchedEvent state:SyncConnected type:NodeDataChanged path:/clusterstate.json, has occurred - updating... (live nodes size: 1)
   [junit4]   2> 2968761 T16977 N:127.0.0.1:50886_wb_ oascc.ZkStateReader$2.process A cluster state change: WatchedEvent state:SyncConnected type:NodeDataChanged path:/clusterstate.json, has occurred - updating... (live nodes size: 1)
   [junit4]   2> 2969466 T16948 oas.SolrTestCaseJ4.writeCoreProperties Writing core.properties file to /Users/jenkins/workspace/Lucene-Solr-5.x-MacOSX/solr/build/solr-core/test/J0/temp/solr.schema.TestCloudManagedSchemaConcurrent 2F52CE5B675B573E-001/shard-1-001/cores/collection1
   [junit4]   2> 2969472 T16948 oasc.AbstractFullDistribZkTestBase.createJettys create jetty 1 in directory /Users/jenkins/workspace/Lucene-Solr-5.x-MacOSX/solr/build/solr-core/test/J0/temp/solr.schema.TestCloudManagedSchemaConcurrent 2F52CE5B675B573E-001/shard-1-001
   [junit4]   2> 2969473 T16948 oejs.Server.doStart jetty-8.1.10.v20130312
   [junit4]   2> 2969480 T16948 oejus.SslContextFactory.doStart Enabled Protocols [SSLv2Hello, TLSv1, TLSv1.1, TLSv1.2] of [SSLv2Hello, SSLv3, TLSv1, TLSv1.1, TLSv1.2]
   [junit4]   2> 2969483 T16948 oejs.AbstractConnector.doStart Started SslSelectChannelConnector@127.0.0.1:50891
   [junit4]   2> 2969485 T16948 oascse.JettySolrRunner$1.lifeCycleStarted Jetty properties: {hostContext=/wb_, hostPort=50891, solrconfig=solrconfig.xml, coreRootDirectory=/Users/jenkins/workspace/Lucene-Solr-5.x-MacOSX/solr/build/solr-core/test/J0/../../../../../../../../../Users/jenkins/workspace/Lucene-Solr-5.x-MacOSX/solr/build/solr-core/test/J0/temp/solr.schema.TestCloudManagedSchemaConcurrent 2F52CE5B675B573E-001/shard-1-001/cores, solr.data.dir=/Users/jenkins/workspace/Lucene-Solr-5.x-MacOSX/solr/build/solr-core/test/J0/temp/solr.schema.TestCloudManagedSchemaConcurrent 2F52CE5B675B573E-001/tempDir-001/jetty1}
   [junit4]   2> 2969488 T16948 oass.SolrDispatchFilter.init SolrDispatchFilter.init()sun.misc.Launcher$AppClassLoader@8f8acd0
   [junit4]   2> 2969489 T16948 oasc.SolrResourceLoader.<init> new SolrResourceLoader for directory: '/Users/jenkins/workspace/Lucene-Solr-5.x-MacOSX/solr/build/solr-core/test/J0/../../../../../../../../../Users/jenkins/workspace/Lucene-Solr-5.x-MacOSX/solr/build/solr-core/test/J0/temp/solr.schema.TestCloudManagedSchemaConcurrent 2F52CE5B675B573E-001/shard-1-001/'
   [junit4]   2> 2969559 T16948 oasc.SolrXmlConfig.fromFile Loading container configuration from /Users/jenkins/workspace/Lucene-Solr-5.x-MacOSX/solr/build/solr-core/test/J0/../../../../../../../../../Users/jenkins/workspace/Lucene-Solr-5.x-MacOSX/solr/build/solr-core/test/J0/temp/solr.schema.TestCloudManagedSchemaConcurrent 2F52CE5B675B573E-001/shard-1-001/solr.xml
   [junit4]   2> 2969621 T16948 oasc.CorePropertiesLocator.<init> Config-defined core root directory: /Users/jenkins/workspace/Lucene-Solr-5.x-MacOSX/solr/build/solr-core/test/J0/../../../../../../../../../Users/jenkins/workspace/Lucene-Solr-5.x-MacOSX/solr/build/solr-core/test/J0/temp/solr.schema.TestCloudManagedSchemaConcurrent 2F52CE5B675B573E-001/shard-1-001/cores
   [junit4]   2> 2969622 T16948 oasc.CoreContainer.<init> New CoreContainer 886086892
   [junit4]   2> 2969623 T16948 oasc.CoreContainer.load Loading cores into CoreContainer [instanceDir=/Users/jenkins/workspace/Lucene-Solr-5.x-MacOSX/solr/build/solr-core/test/J0/../../../../../../../../../Users/jenkins/workspace/Lucene-Solr-5.x-MacOSX/solr/build/solr-core/test/J0/temp/solr.schema.TestCloudManagedSchemaConcurrent 2F52CE5B675B573E-001/shard-1-001/]
   [junit4]   2> 2969623 T16948 oasc.CoreContainer.load loading shared library: /Users/jenkins/workspace/Lucene-Solr-5.x-MacOSX/solr/build/solr-core/test/J0/../../../../../../../../../Users/jenkins/workspace/Lucene-Solr-5.x-MacOSX/solr/build/solr-core/test/J0/temp/solr.schema.TestCloudManagedSchemaConcurrent 2F52CE5B675B573E-001/shard-1-001/lib
   [junit4]   2> 2969626 T16948 oasc.SolrResourceLoader.addToClassLoader WARN Can't find (or read) directory to add to classloader: lib (resolved as: /Users/jenkins/workspace/Lucene-Solr-5.x-MacOSX/solr/build/solr-core/test/J0/../../../../../../../../../Users/jenkins/workspace/Lucene-Solr-5.x-MacOSX/solr/build/solr-core/test/J0/temp/solr.schema.TestCloudManagedSchemaConcurrent 2F52CE5B675B573E-001/shard-1-001/lib).
   [junit4]   2> 2969655 T16948 oashc.HttpShardHandlerFactory.init created with socketTimeout : 90000,urlScheme : ,connTimeout : 15000,maxConnectionsPerHost : 20,maxConnections : 10000,corePoolSize : 0,maximumPoolSize : 2147483647,maxThreadIdleTime : 5,sizeOfQueue : -1,fairnessPolicy : false,useRetries : false,
   [junit4]   2> 2969667 T16948 oasu.UpdateShardHandler.<init> Creating UpdateShardHandler HTTP client with params: socketTimeout=340000&connTimeout=45000&retry=true
   [junit4]   2> 2969672 T16948 oasl.LogWatcher.createWatcher SLF4J impl is org.slf4j.impl.Log4jLoggerFactory
   [junit4]   2> 2969673 T16948 oasl.LogWatcher.newRegisteredLogWatcher Registering Log Listener [Log4j (org.slf4j.impl.Log4jLoggerFactory)]
   [junit4]   2> 2969674 T16948 oasc.CoreContainer.load Node Name: 127.0.0.1
   [junit4]   2> 2969674 T16948 oasc.ZkContainer.initZooKeeper Zookeeper client=127.0.0.1:50882/solr
   [junit4]   2> 2969674 T16948 oasc.ZkController.checkChrootPath zkHost includes chroot
   [junit4]   2> 2969675 T16948 oascc.SolrZkClient.createZkCredentialsToAddAutomatically Using default ZkCredentialsProvider
   [junit4]   2> 2969678 T16948 oascc.ConnectionManager.waitForConnected Waiting for client to connect to ZooKeeper
   [junit4]   2> 2969694 T17001 oascc.ConnectionManager.process Watcher org.apache.solr.common.cloud.ConnectionManager@5b1b78df name:ZooKeeperConnection Watcher:127.0.0.1:50882 got event WatchedEvent state:SyncConnected type:None path:null path:null type:None
   [junit4]   2> 2969694 T16948 oascc.ConnectionManager.waitForConnected Client is connected to ZooKeeper
   [junit4]   2> 2969695 T16948 oascc.SolrZkClient.createZkACLProvider Using default ZkACLProvider
   [junit4]   2> 2969725 T16948 N:127.0.0.1:50891_wb_ oascc.ConnectionManager.waitForConnected Waiting for client to connect to ZooKeeper
   [junit4]   2> 2969730 T17004 N:127.0.0.1:50891_wb_ oascc.ConnectionManager.process Watcher org.apache.solr.common.cloud.ConnectionManager@6be1d154 name:ZooKeeperConnection Watcher:127.0.0.1:50882/solr got event WatchedEvent state:SyncConnected type:None path:null path:null type:None
   [junit4]   2> 2969731 T16948 N:127.0.0.1:50891_wb_ oascc.ConnectionManager.waitForConnected Client is connected to ZooKeeper
   [junit4]   2> 2969750 T16948 N:127.0.0.1:50891_wb_ oascc.ZkStateReader.createClusterStateWatchersAndUpdate Updating cluster state from ZooKeeper... 
   [junit4]   2> 2970775 T16948 N:127.0.0.1:50891_wb_ oasc.ZkController.createEphemeralLiveNode Register node as live in ZooKeeper:/live_nodes/127.0.0.1:50891_wb_
   [junit4]   2> 2970788 T16948 N:127.0.0.1:50891_wb_ oascc.SolrZkClient.makePath makePath: /live_nodes/127.0.0.1:50891_wb_
   [junit4]   2> 2970808 T16948 N:127.0.0.1:50891_wb_ oasc.Overseer.close Overseer (id=null) closing
   [junit4]   2> 2970815 T16948 N:127.0.0.1:50891_wb_ oasc.CorePropertiesLocator.discover Looking for core definitions underneath /Users/jenkins/workspace/Lucene-Solr-5.x-MacOSX/solr/build/solr-core/test/J0/../../../../../../../../../Users/jenkins/workspace/Lucene-Solr-5.x-MacOSX/solr/build/solr-core/test/J0/temp/solr.schema.TestCloudManagedSchemaConcurrent 2F52CE5B675B573E-001/shard-1-001/cores
   [junit4]   2> 2970819 T16948 N:127.0.0.1:50891_wb_ oasc.CoreDescriptor.<init> CORE DESCRIPTOR: {loadOnStartup=true, config=solrconfig.xml, transient=false, dataDir=data/, schema=schema.xml, collection=collection1, shard=, name=collection1, coreNodeName=, instanceDir=/Users/jenkins/workspace/Lucene-Solr-5.x-MacOSX/solr/build/solr-core/test/J0/../../../../../../../../../Users/jenkins/workspace/Lucene-Solr-5.x-MacOSX/solr/build/solr-core/test/J0/temp/solr.schema.TestCloudManagedSchemaConcurrent 2F52CE5B675B573E-001/shard-1-001/cores/collection1, absoluteInstDir=/Users/jenkins/workspace/Lucene-Solr-5.x-MacOSX/solr/build/solr-core/test/J0/../../../../../../../../../Users/jenkins/workspace/Lucene-Solr-5.x-MacOSX/solr/build/solr-core/test/J0/temp/solr.schema.TestCloudManagedSchemaConcurrent 2F52CE5B675B573E-001/shard-1-001/cores/collection1/}
   [junit4]   2> 2970820 T16948 N:127.0.0.1:50891_wb_ oasc.CorePropertiesLocator.discoverUnder Found core collection1 in /Users/jenkins/workspace/Lucene-Solr-5.x-MacOSX/solr/build/solr-core/test/J0/../../../../../../../../../Users/jenkins/workspace/Lucene-Solr-5.x-MacOSX/solr/build/solr-core/test/J0/temp/solr.schema.TestCloudManagedSchemaConcurrent 2F52CE5B675B573E-001/shard-1-001/cores/collection1/
   [junit4]   2> 2970821 T16948 N:127.0.0.1:50891_wb_ oasc.CorePropertiesLocator.discover Found 1 core definitions
   [junit4]   2> 2970823 T17005 N:127.0.0.1:50891_wb_ C:collection1 c:collection1 oasc.ZkController.publish publishing core=collection1 state=down collection=collection1
   [junit4]   2> 2970824 T17005 N:127.0.0.1:50891_wb_ C:collection1 c:collection1 oasc.ZkController.publish numShards not found on descriptor - reading it from system property
   [junit4]   2> 2970827 T16977 N:127.0.0.1:50886_wb_ oasc.DistributedQueue$LatchWatcher.process NodeChildrenChanged fired on path /overseer/queue state SyncConnected
   [junit4]   2> 2970827 T17005 N:127.0.0.1:50891_wb_ oasc.ZkController.waitForCoreNodeName look for our core node name
   [junit4]   2> 2970829 T16978 N:127.0.0.1:50886_wb_ oasc.Overseer$ClusterStateUpdater.run processMessage: queueSize: 1, message = {
   [junit4]   2> 	  "shard":null,
   [junit4]   2> 	  "node_name":"127.0.0.1:50891_wb_",
   [junit4]   2> 	  "roles":null,
   [junit4]   2> 	  "numShards":"4",
   [junit4]   2> 	  "operation":"state",
   [junit4]   2> 	  "collection":"collection1",
   [junit4]   2> 	  "core":"collection1",
   [junit4]   2> 	  "base_url":"https://127.0.0.1:50891/wb_",
   [junit4]   2> 	  "state":"down"} current state version: 4
   [junit4]   2> 2970832 T16978 N:127.0.0.1:50886_wb_ oasco.ReplicaMutator.updateState Update state numShards=4 message={
   [junit4]   2> 	  "shard":null,
   [junit4]   2> 	  "node_name":"127.0.0.1:50891_wb_",
   [junit4]   2> 	  "roles":null,
   [junit4]   2> 	  "numShards":"4",
   [junit4]   2> 	  "operation":"state",
   [junit4]   2> 	  "collection":"collection1",
   [junit4]   2> 	  "core":"collection1",
   [junit4]   2> 	  "base_url":"https://127.0.0.1:50891/wb_",
   [junit4]   2> 	  "state":"down"}
   [junit4]   2> 2970833 T16978 N:127.0.0.1:50886_wb_ oasco.ClusterStateMutator.createCollection building a new cName: collection1
   [junit4]   2> 2970833 T16978 N:127.0.0.1:50886_wb_ oasco.ReplicaMutator.updateState Assigning new node to shard shard=shard4
   [junit4]   2> 2970837 T16989 oascc.ZkStateReader$2.process A cluster state change: WatchedEvent state:SyncConnected type:NodeDataChanged path:/clusterstate.json, has occurred - updating... (live nodes size: 2)
   [junit4]   2> 2970837 T16977 N:127.0.0.1:50886_wb_ oascc.ZkStateReader$2.process A cluster state change: WatchedEvent state:SyncConnected type:NodeDataChanged path:/clusterstate.json, has occurred - updating... (live nodes size: 2)
   [junit4]   2> 2970838 T17004 N:127.0.0.1:50891_wb_ oascc.ZkStateReader$2.process A cluster state change: WatchedEvent state:SyncConnected type:NodeDataChanged path:/clusterstate.json, has occurred - updating... (live nodes size: 2)
   [junit4]   2> 2971831 T17005 N:127.0.0.1:50891_wb_ oasc.ZkController.waitForShardId waiting to find shard id in clusterstate for collection1
   [junit4]   2> 2971832 T17005 N:127.0.0.1:50891_wb_ oasc.ZkController.createCollectionZkNode Check for collection zkNode:collection1
   [junit4]   2> 2971833 T17005 N:127.0.0.1:50891_wb_ oasc.ZkController.createCollectionZkNode Collection zkNode exists
   [junit4]   2> 2971833 T17005 N:127.0.0.1:50891_wb_ oascc.ZkStateReader.readConfigName Load collection config from:/collections/collection1
   [junit4]   2> 2971836 T17005 N:127.0.0.1:50891_wb_ oascc.ZkStateReader.readConfigName path=/collections/collection1 configName=conf1 specified config exists in ZooKeeper
   [junit4]   2> 2971836 T17005 N:127.0.0.1:50891_wb_ oasc.SolrResourceLoader.<init> new SolrResourceLoader for directory: '/Users/jenkins/workspace/Lucene-Solr-5.x-MacOSX/solr/build/solr-core/test/J0/../../../../../../../../../Users/jenkins/workspace/Lucene-Solr-5.x-MacOSX/solr/build/solr-core/test/J0/temp/solr.schema.TestCloudManagedSchemaConcurrent 2F52CE5B675B573E-001/shard-1-001/cores/collection1/'
   [junit4]   2> 2971886 T17005 N:127.0.0.1:50891_wb_ oasc.ZkController.watchZKConfDir watch zkdir /configs/conf1
   [junit4]   2> 2971892 T17005 N:127.0.0.1:50891_wb_ oasc.Config.<init> loaded config solrconfig.xml with version 0 
   [junit4]   2> 2971912 T17005 N:127.0.0.1:50891_wb_ oasc.SolrConfig.refreshRequestParams current version of requestparams : -1
   [junit4]   2> 2972039 T17005 N:127.0.0.1:50891_wb_ oasc.SolrConfig.<init> Using Lucene MatchVersion: 5.2.0
   [junit4]   2> 2972197 T17005 N:127.0.0.1:50891_wb_ oasc.SolrConfig.<init> Loaded SolrConfig: solrconfig.xml
   [junit4]   2> 2972200 T17005 N:127.0.0.1:50891_wb_ oass.IndexSchema.readSchema Reading Solr Schema from /configs/conf1/managed-schema
   [junit4]   2> 2972215 T17005 N:127.0.0.1:50891_wb_ oass.IndexSchema.readSchema [collection1] Schema name=test
   [junit4]   2> 2973414 T17005 N:127.0.0.1:50891_wb_ oass.OpenExchangeRatesOrgProvider.init Initialized with rates=open-exchange-rates.json, refreshInterval=1440.
   [junit4]   2> 2973436 T17005 N:127.0.0.1:50891_wb_ oass.IndexSchema.readSchema default search field in schema is text
   [junit4]   2> 2973441 T17005 N:127.0.0.1:50891_wb_ oass.IndexSchema.readSchema unique key field: id
   [junit4]   2> 2973472 T17005 N:127.0.0.1:50891_wb_ oass.FileExchangeRateProvider.reload Reloading exchange rates from file currency.xml
   [junit4]   2> 2973477 T17005 N:127.0.0.1:50891_wb_ oass.FileExchangeRateProvider.reload Reloading exchange rates from file currency.xml
   [junit4]   2> 2973495 T17005 N:127.0.0.1:50891_wb_ oass.OpenExchangeRatesOrgProvider.reload Reloading exchange rates from open-exchange-rates.json
   [junit4]   2> 2973497 T17005 N:127.0.0.1:50891_wb_ oass.OpenExchangeRatesOrgProvider$OpenExchangeRates.<init> WARN Unknown key IMPORTANT NOTE
   [junit4]   2> 2973498 T17005 N:127.0.0.1:50891_wb_ oass.OpenExchangeRatesOrgProvider$OpenExchangeRates.<init> WARN Expected key, got STRING
   [junit4]   2> 2973498 T17005 N:127.0.0.1:50891_wb_ oass.OpenExchangeRatesOrgProvider.reload Reloading exchange rates from open-exchange-rates.json
   [junit4]   2> 2973501 T17005 N:127.0.0.1:50891_wb_ oass.OpenExchangeRatesOrgProvider$OpenExchangeRates.<init> WARN Unknown key IMPORTANT NOTE
   [junit4]   2> 2973502 T17005 N:127.0.0.1:50891_wb_ oass.OpenExchangeRatesOrgProvider$OpenExchangeRates.<init> WARN Expected key, got STRING
   [junit4]   2> 2973583 T17005 N:127.0.0.1:50891_wb_ oasc.CoreContainer.create Creating SolrCore 'collection1' using configuration from collection collection1
   [junit4]   2> 2973584 T17005 N:127.0.0.1:50891_wb_ c:collection1 oasc.SolrCore.initDirectoryFactory solr.NRTCachingDirectoryFactory
   [junit4]   2> 2973586 T17005 N:127.0.0.1:50891_wb_ c:collection1 oasc.SolrCore.<init> [collection1] Opening new SolrCore at /Users/jenkins/workspace/Lucene-Solr-5.x-MacOSX/solr/build/solr-core/test/J0/../../../../../../../../../Users/jenkins/workspace/Lucene-Solr-5.x-MacOSX/solr/build/solr-core/test/J0/temp/solr.schema.TestCloudManagedSchemaConcurrent 2F52CE5B675B573E-001/shard-1-001/cores/collection1/, dataDir=/Users/jenkins/workspace/Lucene-Solr-5.x-MacOSX/solr/build/solr-core/test/J0/temp/solr.schema.TestCloudManagedSchemaConcurrent 2F52CE5B675B573E-001/shard-1-001/cores/collection1/data/
   [junit4]   2> 2973586 T17005 N:127.0.0.1:50891_wb_ c:collection1 oasc.SolrCore.<init> JMX monitoring not detected for core: collection1
   [junit4]   2> 2973587 T17005 N:127.0.0.1:50891_wb_ c:collection1 oasc.CachingDirectoryFactory.get return new directory for /Users/jenkins/workspace/Lucene-Solr-5.x-MacOSX/solr/build/solr-core/test/J0/temp/solr.schema.TestCloudManagedSchemaConcurrent 2F52CE5B675B573E-001/shard-1-001/cores/collection1/data
   [junit4]   2> 2973588 T17005 N:127.0.0.1:50891_wb_ c:collection1 oasc.SolrCore.getNewIndexDir New index directory detected: old=null new=/Users/jenkins/workspace/Lucene-Solr-5.x-MacOSX/solr/build/solr-core/test/J0/temp/solr.schema.TestCloudManagedSchemaConcurrent 2F52CE5B675B573E-001/shard-1-001/cores/collection1/data/index/
   [junit4]   2> 2973589 T17005 N:127.0.0.1:50891_wb_ c:collection1 oasc.SolrCore.initIndex WARN [collection1] Solr index directory '/Users/jenkins/workspace/Lucene-Solr-5.x-MacOSX/solr/build/solr-core/test/J0/temp/solr.schema.TestCloudManagedSchemaConcurrent 2F52CE5B675B573E-001/shard-1-001/cores/collection1/data/index' doesn't exist. Creating new index...
   [junit4]   2> 2973590 T17005 N:127.0.0.1:50891_wb_ c:collection1 oasc.CachingDirectoryFactory.get return new directory for /Users/jenkins/workspace/Lucene-Solr-5.x-MacOSX/solr/build/solr-core/test/J0/temp/solr.schema.TestCloudManagedSchemaConcurrent 2F52CE5B675B573E-001/shard-1-001/cores/collection1/data/index
   [junit4]   2> 2973591 T17005 N:127.0.0.1:50891_wb_ c:collection1 oasu.RandomMergePolicy.<init> RandomMergePolicy wrapping class org.apache.lucene.index.LogByteSizeMergePolicy: [LogByteSizeMergePolicy: minMergeSize=1677721, mergeFactor=21, maxMergeSize=2147483648, maxMergeSizeForForcedMerge=9223372036854775807, calibrateSizeByDeletes=true, maxMergeDocs=2147483647, maxCFSSegmentSizeMB=8.796093022207999E12, noCFSRatio=0.7738269487131495]
   [junit4]   2> 2973604 T17005 N:127.0.0.1:50891_wb_ c:collection1 oasc.SolrDeletionPolicy.onCommit SolrDeletionPolicy.onCommit: commits: num=1
   [junit4]   2> 		commit{dir=NRTCachingDirectory(MMapDirectory@/Users/jenkins/workspace/Lucene-Solr-5.x-MacOSX/solr/build/solr-core/test/J0/temp/solr.schema.TestCloudManagedSchemaConcurrent 2F52CE5B675B573E-001/shard-1-001/cores/collection1/data/index lockFactory=org.apache.lucene.store.SingleInstanceLockFactory@1c681ccf; maxCacheMB=48.0 maxMergeSizeMB=4.0),segFN=segments_1,generation=1}
   [junit4]   2> 2973604 T17005 N:127.0.0.1:50891_wb_ c:collection1 oasc.SolrDeletionPolicy.updateCommits newest commit generation = 1
   [junit4]   2> 2973616 T17005 N:127.0.0.1:50891_wb_ c:collection1 oasc.SolrCore.loadUpdateProcessorChains no updateRequestProcessorChain defined as default, creating implicit default
   [junit4]   2> 2973616 T17005 N:127.0.0.1:50891_wb_ c:collection1 oasc.RequestHandlers.applyInitParams WARN INVALID paramSet a in requestHandler {type = requestHandler,name = /dump,class = DumpRequestHandler,args = {defaults={a=A,b=B}}}
   [junit4]   2> 2973638 T17005 N:127.0.0.1:50891_wb_ c:collection1 oashl.XMLLoader.init xsltCacheLifetimeSeconds=60
   [junit4]   2> 2973640 T17005 N:127.0.0.1:50891_wb_ c:collection1 oashl.XMLLoader.init xsltCacheLifetimeSeconds=60
   [junit4]   2> 2973643 T17005 N:127.0.0.1:50891_wb_ c:collection1 oashl.XMLLoader.init xsltCacheLifetimeSeconds=60
   [junit4]   2> 2973649 T17005 N:127.0.0.1:50891_wb_ c:collection1 oashl.XMLLoader.init xsltCacheLifetimeSeconds=60
   [junit4]   2> 2973663 T17005 N:127.0.0.1:50891_wb_ c:collection1 oasc.RequestHandlers.initHandlersFromConfig Registered paths: /admin/threads,standard,/schema,/update/json,/admin/plugins,/update/json/docs,/admin/segments,/admin/luke,/config,/replication,/admin/mbeans,/admin/system,/admin/properties,/update,/admin/file,/admin/logging,/dump,/admin/ping,/update/csv,/get
   [junit4]   2> 2973667 T17005 N:127.0.0.1:50891_wb_ c:collection1 oasc.SolrCore.initStatsCache Using default statsCache cache: org.apache.solr.search.stats.LocalStatsCache
   [junit4]   2> 2973668 T17005 N:127.0.0.1:50891_wb_ c:collection1 oasu.UpdateHandler.<init> Using UpdateLog implementation: org.apache.solr.update.UpdateLog
   [junit4]   2> 2973668 T17005 N:127.0.0.1:50891_wb_ c:collection1 oasu.UpdateLog.init Initializing UpdateLog: dataDir= defaultSyncLevel=FLUSH numRecordsToKeep=100 maxNumLogsToKeep=10
   [junit4]   2> 2973670 T17005 N:127.0.0.1:50891_wb_ c:collection1 oasu.CommitTracker.<init> Hard AutoCommit: disabled
   [junit4]   2> 2973670 T17005 N:127.0.0.1:50891_wb_ c:collection1 oasu.CommitTracker.<init> Soft AutoCommit: disabled
   [junit4]   2> 2973671 T17005 N:127.0.0.1:50891_wb_ c:collection1 oasu.RandomMergePolicy.<init> RandomMergePolicy wrapping class org.apache.lucene.index.TieredMergePolicy: [TieredMergePolicy: maxMergeAtOnce=29, maxMergeAtOnceExplicit=46, maxMergedSegmentMB=45.359375, floorSegmentMB=1.892578125, forceMergeDeletesPctAllowed=0.14044700518084818, segmentsPerTier=4.0, maxCFSSegmentSizeMB=8.796093022207999E12, noCFSRatio=0.518010615665878
   [junit4]   2> 2973672 T17005 N:127.0.0.1:50891_wb_ c:collection1 oasc.SolrDeletionPolicy.onInit SolrDeletionPolicy.onInit: commits: num=1
   [junit4]   2> 		commit{dir=NRTCachingDirectory(MMapDirectory@/Users/jenkins/workspace/Lucene-Solr-5.x-MacOSX/solr/build/solr-core/test/J0/temp/solr.schema.TestCloudManagedSchemaConcurrent 2F52CE5B675B573E-001/shard-1-001/cores/collection1/data/index lockFactory=org.apache.lucene.store.SingleInstanceLockFactory@1c681ccf; maxCacheMB=48.0 maxMergeSizeMB=4.0),segFN=segments_1,generation=1}
   [junit4]   2> 2973673 T17005 N:127.0.0.1:50891_wb_ c:collection1 oasc.SolrDeletionPolicy.updateCommits newest commit generation = 1
   [junit4]   2> 2973673 T17005 N:127.0.0.1:50891_wb_ c:collection1 oass.SolrIndexSearcher.<init> Opening Searcher@2e367428[collection1] main
   [junit4]   2> 2973674 T17005 N:127.0.0.1:50891_wb_ c:collection1 oascc.ZkStateReader.readConfigName Load collection config from:/collections/collection1
   [junit4]   2> 2973676 T17005 N:127.0.0.1:50891_wb_ c:collection1 oascc.ZkStateReader.readConfigName path=/collections/collection1 configName=conf1 specified config exists in ZooKeeper
   [junit4]   2> 2973676 T17005 N:127.0.0.1:50891_wb_ c:collection1 oasr.ManagedResourceStorage.newStorageIO Setting up ZooKeeper-based storage for the RestManager with znodeBase: /configs/conf1
   [junit4]   2> 2973678 T17005 N:127.0.0.1:50891_wb_ c:collection1 oasr.ManagedResourceStorage$ZooKeeperStorageIO.configure Configured ZooKeeperStorageIO with znodeBase: /configs/conf1
   [junit4]   2> 2973678 T17005 N:127.0.0.1:50891_wb_ c:collection1 oasr.RestManager.init Initializing RestManager with initArgs: {}
   [junit4]   2> 2973678 T17005 N:127.0.0.1:50891_wb_ c:collection1 oasr.ManagedResourceStorage.load Reading _rest_managed.json using ZooKeeperStorageIO:path=/configs/conf1
   [junit4]   2> 2973680 T17005 N:127.0.0.1:50891_wb_ c:collection1 oasr.ManagedResourceStorage$ZooKeeperStorageIO.openInputStream No data found for znode /configs/conf1/_rest_managed.json
   [junit4]   2> 2973680 T17005 N:127.0.0.1:50891_wb_ c:collection1 oasr.ManagedResourceStorage.load Loaded null at path _rest_managed.json using ZooKeeperStorageIO:path=/configs/conf1
   [junit4]   2> 2973680 T17005 N:127.0.0.1:50891_wb_ c:collection1 oasr.RestManager.init Initializing 0 registered ManagedResources
   [junit4]   2> 2973680 T17005 N:127.0.0.1:50891_wb_ c:collection1 oass.ZkIndexSchemaReader.createSchemaWatcher Creating ZooKeeper watch for the managed schema at /configs/conf1/managed-schema
   [junit4]   2> 2973683 T17005 N:127.0.0.1:50891_wb_ c:collection1 oash.ReplicationHandler.inform Commits will be reserved for  10000
   [junit4]   2> 2973684 T17005 N:127.0.0.1:50891_wb_ c:collection1 oasc.CoreContainer.registerCore registering core: collection1
   [junit4]   2> 2973684 T17006 N:127.0.0.1:50891_wb_ c:collection1 oasc.SolrCore.registerSearcher [collection1] Registered new searcher Searcher@2e367428[collection1] main{ExitableDirectoryReader(UninvertingDirectoryReader())}
   [junit4]   2> 2973689 T17009 N:127.0.0.1:50891_wb_ C:collection1 S:shard4 c:collection1 oasc.ZkController.register Register replica - core:collection1 address:https://127.0.0.1:50891/wb_ collection:collection1 shard:shard4
   [junit4]   2> 2973690 T16948 N:127.0.0.1:50891_wb_ oass.SolrDispatchFilter.init user.dir=/Users/jenkins/workspace/Lucene-Solr-5.x-MacOSX/solr/build/solr-core/test/J0
   [junit4]   2> 2973691 T16948 N:127.0.0.1:50891_wb_ oass.SolrDispatchFilter.init SolrDispatchFilter.init() done
   [junit4]   2> 2973699 T17009 N:127.0.0.1:50891_wb_ C:collection1 S:shard4 c:collection1 oascc.SolrZkClient.makePath makePath: /collections/collection1/leader_elect/shard4/election
   [junit4]   2> 2973736 T17009 N:127.0.0.1:50891_wb_ C:collection1 S:shard4 c:collection1 oasc.ShardLeaderElectionContext.runLeaderProcess Running the leader process for shard shard4
   [junit4]   2> 2973742 T16977 N:127.0.0.1:50886_wb_ oasc.DistributedQueue$LatchWatcher.process NodeChildrenChanged fired on path /overseer/queue state SyncConnected
   [junit4]   2> 2973744 T17009 N:127.0.0.1:50891_wb_ C:collection1 S:shard4 c:collection1 oasc.ShardLeaderElectionContext.waitForReplicasToComeUp Enough replicas found to continue.
   [junit4]   2> 2973745 T17009 N:127.0.0.1:50891_wb_ C:collection1 S:shard4 c:collection1 oasc.ShardLeaderElectionContext.runLeaderProcess I may be the new leader - try and sync
   [junit4]   2> ASYNC  NEW_CORE C8263 name=collection1 org.apache.solr.core.SolrCore@3e9c446 url=https://127.0.0.1:50891/wb_/collection1 node=127.0.0.1:50891_wb_ C8263_STATE=coll:collection1 core:collection1 props:{node_name=127.0.0.1:50891_wb_, core=collection1, base_url=https://127.0.0.1:50891/wb_, state=down}
   [junit4]   2> 2973745 T17009 N:127.0.0.1:50891_wb_ C:collection1 S:shard4 c:collection1 C8263 oasc.SyncStrategy.sync Sync replicas to https://127.0.0.1:50891/wb_/collection1/
   [junit4]   2> 2973745 T17009 N:127.0.0.1:50891_wb_ C:collection1 S:shard4 c:collection1 C8263 oasc.SyncStrategy.syncReplicas Sync Success - now sync replicas to me
   [junit4]   2> 2973746 T17009 N:127.0.0.1:50891_wb_ C:collection1 S:shard4 c:collection1 C8263 oasc.SyncStrategy.syncToMe https://127.0.0.1:50891/wb_/collection1/ has no replicas
   [junit4]   2> 2973746 T17009 N:127.0.0.1:50891_wb_ C:collection1 S:shard4 c:collection1 oasc.ShardLeaderElectionContext.runLeaderProcess I am the new leader: https://127.0.0.1:50891/wb_/collection1/ shard4
   [junit4]   2> 2973747 T17009 N:127.0.0.1:50891_wb_ C:collection1 S:shard4 c:collection1 oascc.SolrZkClient.makePath makePath: /collections/collection1/leaders/shard4
   [junit4]   2> 2973749 T16978 N:127.0.0.1:50886_wb_ oasc.Overseer$ClusterStateUpdater.run processMessage: queueSize: 1, message = {
   [junit4]   2> 	  "operation":"leader",
   [junit4]   2> 	  "shard":"shard4",
   [junit4]   2> 	  "collection":"collection1"} current state version: 5
   [junit4]   2> 2973756 T17004 N:127.0.0.1:50891_wb_ oascc.ZkStateReader$2.process A cluster state change: WatchedEvent state:SyncConnected type:NodeDataChanged path:/clusterstate.json, has occurred - updating... (live nodes size: 2)
   [junit4]   2> 2973757 T16977 N:127.0.0.1:50886_wb_ oascc.ZkStateReader$2.process A cluster state change: WatchedEvent state:SyncConnected type:NodeDataChanged path:/clusterstate.json, has occurred - updating... (live nodes size: 2)
   [junit4]   2> 2973758 T16989 oascc.ZkStateReader$2.process A cluster state change: WatchedEvent state:SyncConnected type:NodeDataChanged path:/clusterstate.json, has occurred - updating... (live nodes size: 2)
   [junit4]   2> 2973784 T16978 N:127.0.0.1:50886_wb_ oasc.Overseer$ClusterStateUpdater.run processMessage: queueSize: 1, message = {
   [junit4]   2> 	  "operation":"leader",
   [junit4]   2> 	  "shard":"shard4",
   [junit4]   2> 	  "collection":"collection1",
   [junit4]   2> 	  "base_url":"https://127.0.0.1:50891/wb_",
   [junit4]   2> 	  "core":"collection1",
   [junit4]   2> 	  "state":"active"} current state version: 6
   [junit4]   2> 2973792 T16977 N:127.0.0.1:50886_wb_ oasc.DistributedQueue$LatchWatcher.process NodeChildrenChanged fired on path /overseer/queue state SyncConnected
   [junit4]   2> 2973796 T17004 N:127.0.0.1:50891_wb_ oascc.ZkStateReader$2.process A cluster state change: WatchedEvent state:SyncConnected type:NodeDataChanged path:/clusterstate.json, has occurred - updating... (live nodes size: 2)
   [junit4]   2> 2973797 T16989 oascc.ZkStateReader$2.process A cluster state change: WatchedEvent state:SyncConnected type:NodeDataChanged path:/clusterstate.json, has occurred - updating... (live nodes size: 2)
   [junit4]   2> 2973796 T16977 N:127.0.0.1:50886_wb_ oascc.ZkStateReader$2.process A cluster state change: WatchedEvent state:SyncConnected type:NodeDataChanged path:/clusterstate.json, has occurred - updating... (live nodes size: 2)
   [junit4]   2> 2973835 T17009 N:127.0.0.1:50891_wb_ C:collection1 S:shard4 c:collection1 oasc.ZkController.register We are https://127.0.0.1:50891/wb_/collection1/ and leader is https://127.0.0.1:50891/wb_/collection1/
   [junit4]   2> 2973835 T17009 N:127.0.0.1:50891_wb_ C:collection1 S:shard4 c:collection1 oasc.ZkController.register No LogReplay needed for core=collection1 baseURL=https://127.0.0.1:50891/wb_
   [junit4]   2> 2973835 T17009 N:127.0.0.1:50891_wb_ C:collection1 S:shard4 c:collection1 oasc.ZkController.checkRecovery I am the leader, no recovery necessary
   [junit4]   2> 2973835 T17009 N:127.0.0.1:50891_wb_ C:collection1 S:shard4 c:collection1 oasc.ZkController.publish publishing core=collection1 state=active collection=collection1
   [junit4]   2> 2973836 T17009 N:127.0.0.1:50891_wb_ C:collection1 S:shard4 c:collection1 oasc.ZkController.publish numShards not found on descriptor - reading it from system property
   [junit4]   2> 2973840 T16977 N:127.0.0.1:50886_wb_ oasc.DistributedQueue$LatchWatcher.process NodeChildrenChanged fired on path /overseer/queue state SyncConnected
   [junit4]   2> 2973846 T16978 N:127.0.0.1:50886_wb_ oasc.Overseer$ClusterStateUpdater.run processMessage: queueSize: 1, message = {
   [junit4]   2> 	  "shard":"shard4",
   [junit4]   2> 	  "node_name":"127.0.0.1:50891_wb_",
   [junit4]   2> 	  "roles":null,
   [junit4]   2> 	  "numShards":"4",
   [junit4]   2> 	  "operation":"state",
   [junit4]   2> 	  "collection":"collection1",
   [junit4]   2> 	  "core":"collection1",
   [junit4]   2> 	  "core_node_name":"core_node1",
   [junit4]   2> 	  "base_url":"https://127.0.0.1:50891/wb_",
   [junit4]   2> 	  "state":"active"} current state version: 7
   [junit4]   2> 2973851 T16978 N:127.0.0.1:50886_wb_ oasco.ReplicaMutator.updateState Update state numShards=4 message={
   [junit4]   2> 	  "shard":"shard4",
   [junit4]   2> 	  "node_name":"127.0.0.1:50891_wb_",
   [junit4]   2> 	  "roles":null,
   [junit4]   2> 	  "numShards":"4",
   [junit4]   2> 	  "operation":"state",
   [jun

[...truncated too long message...]

Handler.doScope(ContextHandler.java:1009)
   [junit4]    > 	at org.eclipse.jetty.server.handler.ScopedHandler.handle(ScopedHandler.java:135)
   [junit4]    > 	at org.eclipse.jetty.server.handler.HandlerWrapper.handle(HandlerWrapper.java:116)
   [junit4]    > 	at org.eclipse.jetty.server.Server.handle(Server.java:368)
   [junit4]    > 	at org.eclipse.jetty.server.AbstractHttpConnection.handleRequest(AbstractHttpConnection.java:489)
   [junit4]    > 	at org.eclipse.jetty.server.AbstractHttpConnection.content(AbstractHttpConnection.java:953)
   [junit4]    > 	at org.eclipse.jetty.server.AbstractHttpConnection$RequestHandler.content(AbstractHttpConnection.java:1014)
   [junit4]    > 	at org.eclipse.jetty.http.HttpParser.parseNext(HttpParser.java:861)
   [junit4]    > 	at org.eclipse.jetty.http.HttpParser.parseAvailable(HttpParser.java:240)
   [junit4]    > 	at org.eclipse.jetty.server.AsyncHttpConnection.handle(AsyncHttpConnection.java:82)
   [junit4]    > 	at org.eclipse.jetty.io.nio.SslConnection.handle(SslConnection.java:196)
   [junit4]    > 	at org.eclipse.jetty.io.nio.SelectChannelEndPoint.handle(SelectChannelEndPoint.java:628)
   [junit4]    > 	at org.eclipse.jetty.io.nio.SelectChannelEndPoint$1.run(SelectChannelEndPoint.java:52)
   [junit4]    > 	at org.eclipse.jetty.util.thread.QueuedThreadPool.runJob(QueuedThreadPool.java:608)
   [junit4]    > 	at org.eclipse.jetty.util.thread.QueuedThreadPool$3.run(QueuedThreadPool.java:543)
   [junit4]    > 	at java.lang.Thread.run(Thread.java:745)
   [junit4]    > </str>
   [junit4]    >   <int name="code">500</int>
   [junit4]    > </lst>
   [junit4]    > </response>
   [junit4]    > 	at __randomizedtesting.SeedInfo.seed([2F52CE5B675B573E:A706F181C9A73AC6]:0)
   [junit4]    > 	at org.apache.solr.schema.TestCloudManagedSchemaConcurrent.verifySuccess(TestCloudManagedSchemaConcurrent.java:107)
   [junit4]    > 	at org.apache.solr.schema.TestCloudManagedSchemaConcurrent.addDynamicFieldPut(TestCloudManagedSchemaConcurrent.java:135)
   [junit4]    > 	at org.apache.solr.schema.TestCloudManagedSchemaConcurrent.access$300(TestCloudManagedSchemaConcurrent.java:45)
   [junit4]    > 	at org.apache.solr.schema.TestCloudManagedSchemaConcurrent$Operation$3.execute(TestCloudManagedSchemaConcurrent.java:286)
   [junit4]    > 	at org.apache.solr.schema.TestCloudManagedSchemaConcurrent.concurrentOperationsTest(TestCloudManagedSchemaConcurrent.java:450)
   [junit4]    > 	at org.apache.solr.schema.TestCloudManagedSchemaConcurrent.test(TestCloudManagedSchemaConcurrent.java:252)
   [junit4]    > 	at org.apache.solr.BaseDistributedSearchTestCase$ShardsRepeatRule$ShardsFixedStatement.callStatement(BaseDistributedSearchTestCase.java:960)
   [junit4]    > 	at org.apache.solr.BaseDistributedSearchTestCase$ShardsRepeatRule$ShardsStatement.evaluate(BaseDistributedSearchTestCase.java:935)
   [junit4]    > 	at java.lang.Thread.run(Thread.java:745)
   [junit4]   2> 3075690 T16948 oas.SolrTestCaseJ4.deleteCore ###deleteCore
   [junit4]   2> NOTE: leaving temporary files on disk at: /Users/jenkins/workspace/Lucene-Solr-5.x-MacOSX/solr/build/solr-core/test/J0/temp/solr.schema.TestCloudManagedSchemaConcurrent 2F52CE5B675B573E-001
   [junit4]   2> NOTE: test params are: codec=CheapBastard, sim=DefaultSimilarity, locale=sr_RS_#Latn, timezone=America/Merida
   [junit4]   2> NOTE: Mac OS X 10.8.5 x86_64/Oracle Corporation 1.7.0_76 (64-bit)/cpus=3,threads=1,free=66945856,total=396505088
   [junit4]   2> NOTE: All tests run in this JVM: [TestFieldCollectionResource, OutputWriterTest, AnalysisErrorHandlingTest, SolrPluginUtilsTest, HdfsRecoveryZkTest, AsyncMigrateRouteKeyTest, TestHighlightDedupGrouping, TestManagedResource, TestImplicitCoreProperties, DistributedIntervalFacetingTest, DocumentAnalysisRequestHandlerTest, TestPartialUpdateDeduplication, TestLazyCores, ConcurrentDeleteAndCreateCollectionTest, FieldAnalysisRequestHandlerTest, TestSolrIndexConfig, IndexSchemaRuntimeFieldTest, ConnectionManagerTest, TestHashQParserPlugin, DistributedQueueTest, DeleteReplicaTest, SynonymTokenizerTest, TestWriterPerf, TestLeaderElectionZkExpiry, TestIndexingPerformance, TestReplicaProperties, TestExpandComponent, TestCollapseQParserPlugin, CustomCollectionTest, RequiredFieldsTest, ParsingFieldUpdateProcessorsTest, RequestHandlersTest, TestLFUCache, DistributedSuggestComponentTest, DistributedDebugComponentTest, DistributedFacetPivotSmallAdvancedTest, TestExceedMaxTermLength, OverseerRolesTest, TestFieldResource, TestInfoStreamLogging, TestStressVersions, DocExpirationUpdateProcessorFactoryTest, TestComplexPhraseQParserPlugin, HdfsDirectoryFactoryTest, SystemInfoHandlerTest, XmlUpdateRequestHandlerTest, TestFreeTextSuggestions, TestCharFilters, TestRawResponseWriter, URLClassifyProcessorTest, TestManagedSynonymFilterFactory, ScriptEngineTest, TestUniqueKeyFieldResource, DirectSolrConnectionTest, TestPerFieldSimilarity, DistanceFunctionTest, TestCoreContainer, DocValuesTest, SharedFSAutoReplicaFailoverUtilsTest, TestSurroundQueryParser, TestSweetSpotSimilarityFactory, BadComponentTest, PreAnalyzedFieldTest, DistributedFacetPivotLongTailTest, NoCacheHeaderTest, TestInitQParser, TestStressReorder, SuggesterWFSTTest, TestShortCircuitedRequests, InfoHandlerTest, TestOverriddenPrefixQueryForCustomFieldType, TestFieldSortValues, TestNoOpRegenerator, DirectUpdateHandlerTest, TestArbitraryIndexDir, TestRestManager, PingRequestHandlerTest, ResponseLogComponentTest, DefaultValueUpdateProcessorTest, SyncSliceTest, TestBinaryField, TestSolrConfigHandler, TestRequestStatusCollectionAPI, SolrIndexSplitterTest, SolrCoreTest, FacetPivotSmallTest, TestPhraseSuggestions, TestStressLucene, TestJsonRequest, RecoveryZkTest, DOMUtilTest, SolrXmlInZkTest, TestMissingGroups, CoreAdminHandlerTest, TestSchemaResource, TestDynamicFieldCollectionResource, SoftAutoCommitTest, HdfsLockFactoryTest, TestSchemaVersionResource, RemoteQueryErrorTest, TestCryptoKeys, SolrTestCaseJ4Test, TestSearcherReuse, HardAutoCommitTest, TestNamedUpdateProcessors, TestBinaryResponseWriter, TestReqParamsAPI, LeaderInitiatedRecoveryOnCommitTest, TestUpdate, DistribDocExpirationUpdateProcessorTest, SliceStateTest, TestStressRecovery, ChangedSchemaMergeTest, CloudExitableDirectoryReaderTest, TestElisionMultitermQuery, TestChildDocTransformer, TestDistribDocBasedVersion, UnloadDistributedZkTest, ShardRoutingTest, TestReplicationHandler, TestDistributedSearch, TestReload, SimpleFacetsTest, TestGroupingSearch, PeerSyncTest, BadIndexSchemaTest, TestFiltering, BasicFunctionalityTest, OverseerCollectionProcessorTest, ShowFileRequestHandlerTest, CurrencyFieldOpenExchangeTest, TestCoreDiscovery, TestExtendedDismaxParser, SuggesterFSTTest, TestCSVLoader, SolrCoreCheckLockOnStartupTest, TestWordDelimiterFilterFactory, StatelessScriptUpdateProcessorFactoryTest, TestRemoteStreaming, SolrInfoMBeanTest, DebugComponentTest, IndexBasedSpellCheckerTest, TestQueryUtils, DirectSolrSpellCheckerTest, TermsComponentTest, PathHierarchyTokenizerFactoryTest, MoreLikeThisHandlerTest, TestJmxIntegration, JSONWriterTest, TestAnalyzedSuggestions, TestPHPSerializedResponseWriter, SearchHandlerTest, SOLR749Test, CopyFieldTest, MultiTermTest, SampleTest, NumericFieldsTest, TestPostingsSolrHighlighter, TestXIncludeConfig, TestIBSimilarityFactory, TestJmxMonitoredMap, DateMathParserTest, PrimUtilsTest, DateFieldTest, SpellingQueryConverterTest, ClusterStateTest, TestLRUCache, TestUtils, TestDocumentBuilder, UUIDFieldTest, FileUtilsTest, CircularListTest, TestRTGBase, CursorPagingTest, TestCursorMarkWithoutUniqueKey, TestSimpleTrackingShardHandler, DistribCursorPagingTest, ExternalCollectionsTest, LeaderFailoverAfterPartitionTest, MigrateRouteKeyTest, OverriddenZkACLAndCredentialsProvidersTest, OverseerStatusTest, ReplicationFactorTest, RollingRestartTest, ShardSplitTest, VMParamsZkACLAndCredentialsProvidersTest, HdfsBasicDistributedZk2Test, HdfsCollectionsAPIDistributedZkTest, HdfsThreadLeakTest, HdfsWriteToMultipleCollectionsTest, StressHdfsTest, TestClusterStateMutator, ZkStateWriterTest, CachingDirectoryFactoryTest, TestConfigOverlay, TestInitParams, TestNRTOpen, TestSolrDynamicMBean, RequestLoggingTest, TestReplicationHandlerBackup, TestSolrConfigHandlerCloud, TestMacros, TestManagedResourceStorage, TestDefaultSearchFieldResource, TestDynamicFieldResource, TestFieldTypeResource, TestManagedSchemaDynamicFieldResource, TestSchemaNameResource, TestSchemaSimilarityResource, TestSerializedLuceneMatchVersion, TestSolrQueryParserDefaultOperatorResource, BadCopyFieldTest, DocValuesMissingTest, EnumFieldTest, SpatialRPTFieldTypeTest, TestCloudManagedSchemaConcurrent]
   [junit4] Completed [442/483] on J0 in 112.39s, 1 test, 1 failure <<< FAILURES!

[...truncated 129 lines...]
BUILD FAILED
/Users/jenkins/workspace/Lucene-Solr-5.x-MacOSX/build.xml:536: The following error occurred while executing this line:
/Users/jenkins/workspace/Lucene-Solr-5.x-MacOSX/build.xml:484: The following error occurred while executing this line:
/Users/jenkins/workspace/Lucene-Solr-5.x-MacOSX/build.xml:61: The following error occurred while executing this line:
/Users/jenkins/workspace/Lucene-Solr-5.x-MacOSX/extra-targets.xml:39: The following error occurred while executing this line:
/Users/jenkins/workspace/Lucene-Solr-5.x-MacOSX/solr/build.xml:229: The following error occurred while executing this line:
/Users/jenkins/workspace/Lucene-Solr-5.x-MacOSX/solr/common-build.xml:511: The following error occurred while executing this line:
/Users/jenkins/workspace/Lucene-Solr-5.x-MacOSX/lucene/common-build.xml:1434: The following error occurred while executing this line:
/Users/jenkins/workspace/Lucene-Solr-5.x-MacOSX/lucene/common-build.xml:991: There were test failures: 483 suites, 1917 tests, 1 failure, 55 ignored (21 assumptions)

Total time: 82 minutes 52 seconds
Build step 'Invoke Ant' marked build as failure
Archiving artifacts
Recording test results
Email was triggered for: Failure - Any
Sending email for trigger: Failure - Any



Mime
View raw message