lucene-dev mailing list archives

Site index · List index
Message view « Date » · « Thread »
Top « Date » · « Thread »
From Apache Jenkins Server <jenk...@builds.apache.org>
Subject [JENKINS] Lucene-Solr-Tests-5.x-Java7 - Build # 2705 - Still Failing
Date Tue, 03 Mar 2015 01:15:53 GMT
Build: https://builds.apache.org/job/Lucene-Solr-Tests-5.x-Java7/2705/

5 tests failed.
FAILED:  org.apache.solr.cloud.HttpPartitionTest.test

Error Message:
org.apache.solr.client.solrj.SolrServerException: IOException occured when talking to server at: http://127.0.0.1:10511/l_out/c8n_1x2_shard1_replica1

Stack Trace:
org.apache.solr.client.solrj.SolrServerException: org.apache.solr.client.solrj.SolrServerException: IOException occured when talking to server at: http://127.0.0.1:10511/l_out/c8n_1x2_shard1_replica1
	at __randomizedtesting.SeedInfo.seed([6DEB3E57C8B66EF1:E5BF018D664A0309]:0)
	at org.apache.solr.client.solrj.impl.CloudSolrClient.directUpdate(CloudSolrClient.java:597)
	at org.apache.solr.client.solrj.impl.CloudSolrClient.sendRequest(CloudSolrClient.java:918)
	at org.apache.solr.client.solrj.impl.CloudSolrClient.requestWithRetryOnStaleState(CloudSolrClient.java:809)
	at org.apache.solr.client.solrj.impl.CloudSolrClient.request(CloudSolrClient.java:752)
	at org.apache.solr.cloud.HttpPartitionTest.doSendDoc(HttpPartitionTest.java:484)
	at org.apache.solr.cloud.HttpPartitionTest.sendDoc(HttpPartitionTest.java:501)
	at org.apache.solr.cloud.HttpPartitionTest.testRf2(HttpPartitionTest.java:193)
	at org.apache.solr.cloud.HttpPartitionTest.test(HttpPartitionTest.java:106)
	at sun.reflect.NativeMethodAccessorImpl.invoke0(Native Method)
	at sun.reflect.NativeMethodAccessorImpl.invoke(NativeMethodAccessorImpl.java:57)
	at sun.reflect.DelegatingMethodAccessorImpl.invoke(DelegatingMethodAccessorImpl.java:43)
	at java.lang.reflect.Method.invoke(Method.java:606)
	at com.carrotsearch.randomizedtesting.RandomizedRunner.invoke(RandomizedRunner.java:1627)
	at com.carrotsearch.randomizedtesting.RandomizedRunner$6.evaluate(RandomizedRunner.java:836)
	at com.carrotsearch.randomizedtesting.RandomizedRunner$7.evaluate(RandomizedRunner.java:872)
	at com.carrotsearch.randomizedtesting.RandomizedRunner$8.evaluate(RandomizedRunner.java:886)
	at org.apache.solr.BaseDistributedSearchTestCase$ShardsRepeatRule$ShardsFixedStatement.callStatement(BaseDistributedSearchTestCase.java:950)
	at org.apache.solr.BaseDistributedSearchTestCase$ShardsRepeatRule$ShardsStatement.evaluate(BaseDistributedSearchTestCase.java:925)
	at com.carrotsearch.randomizedtesting.rules.SystemPropertiesRestoreRule$1.evaluate(SystemPropertiesRestoreRule.java:53)
	at org.apache.lucene.util.TestRuleSetupTeardownChained$1.evaluate(TestRuleSetupTeardownChained.java:50)
	at org.apache.lucene.util.AbstractBeforeAfterRule$1.evaluate(AbstractBeforeAfterRule.java:46)
	at org.apache.lucene.util.TestRuleThreadAndTestName$1.evaluate(TestRuleThreadAndTestName.java:49)
	at org.apache.lucene.util.TestRuleIgnoreAfterMaxFailures$1.evaluate(TestRuleIgnoreAfterMaxFailures.java:65)
	at org.apache.lucene.util.TestRuleMarkFailure$1.evaluate(TestRuleMarkFailure.java:48)
	at com.carrotsearch.randomizedtesting.rules.StatementAdapter.evaluate(StatementAdapter.java:36)
	at com.carrotsearch.randomizedtesting.ThreadLeakControl$StatementRunner.run(ThreadLeakControl.java:365)
	at com.carrotsearch.randomizedtesting.ThreadLeakControl.forkTimeoutingTask(ThreadLeakControl.java:798)
	at com.carrotsearch.randomizedtesting.ThreadLeakControl$3.evaluate(ThreadLeakControl.java:458)
	at com.carrotsearch.randomizedtesting.RandomizedRunner.runSingleTest(RandomizedRunner.java:845)
	at com.carrotsearch.randomizedtesting.RandomizedRunner$3.evaluate(RandomizedRunner.java:747)
	at com.carrotsearch.randomizedtesting.RandomizedRunner$4.evaluate(RandomizedRunner.java:781)
	at com.carrotsearch.randomizedtesting.RandomizedRunner$5.evaluate(RandomizedRunner.java:792)
	at com.carrotsearch.randomizedtesting.rules.StatementAdapter.evaluate(StatementAdapter.java:36)
	at com.carrotsearch.randomizedtesting.rules.SystemPropertiesRestoreRule$1.evaluate(SystemPropertiesRestoreRule.java:53)
	at org.apache.lucene.util.AbstractBeforeAfterRule$1.evaluate(AbstractBeforeAfterRule.java:46)
	at com.carrotsearch.randomizedtesting.rules.StatementAdapter.evaluate(StatementAdapter.java:36)
	at org.apache.lucene.util.TestRuleStoreClassName$1.evaluate(TestRuleStoreClassName.java:42)
	at com.carrotsearch.randomizedtesting.rules.NoShadowingOrOverridesOnMethodsRule$1.evaluate(NoShadowingOrOverridesOnMethodsRule.java:39)
	at com.carrotsearch.randomizedtesting.rules.NoShadowingOrOverridesOnMethodsRule$1.evaluate(NoShadowingOrOverridesOnMethodsRule.java:39)
	at com.carrotsearch.randomizedtesting.rules.StatementAdapter.evaluate(StatementAdapter.java:36)
	at com.carrotsearch.randomizedtesting.rules.StatementAdapter.evaluate(StatementAdapter.java:36)
	at com.carrotsearch.randomizedtesting.rules.StatementAdapter.evaluate(StatementAdapter.java:36)
	at org.apache.lucene.util.TestRuleAssertionsRequired$1.evaluate(TestRuleAssertionsRequired.java:54)
	at org.apache.lucene.util.TestRuleMarkFailure$1.evaluate(TestRuleMarkFailure.java:48)
	at org.apache.lucene.util.TestRuleIgnoreAfterMaxFailures$1.evaluate(TestRuleIgnoreAfterMaxFailures.java:65)
	at org.apache.lucene.util.TestRuleIgnoreTestSuites$1.evaluate(TestRuleIgnoreTestSuites.java:55)
	at com.carrotsearch.randomizedtesting.rules.StatementAdapter.evaluate(StatementAdapter.java:36)
	at com.carrotsearch.randomizedtesting.ThreadLeakControl$StatementRunner.run(ThreadLeakControl.java:365)
	at java.lang.Thread.run(Thread.java:745)
Caused by: org.apache.solr.client.solrj.SolrServerException: IOException occured when talking to server at: http://127.0.0.1:10511/l_out/c8n_1x2_shard1_replica1
	at org.apache.solr.client.solrj.impl.HttpSolrClient.executeMethod(HttpSolrClient.java:572)
	at org.apache.solr.client.solrj.impl.HttpSolrClient.request(HttpSolrClient.java:214)
	at org.apache.solr.client.solrj.impl.HttpSolrClient.request(HttpSolrClient.java:210)
	at org.apache.solr.client.solrj.impl.LBHttpSolrClient.doRequest(LBHttpSolrClient.java:370)
	at org.apache.solr.client.solrj.impl.LBHttpSolrClient.request(LBHttpSolrClient.java:325)
	at org.apache.solr.client.solrj.impl.CloudSolrClient.directUpdate(CloudSolrClient.java:594)
	... 48 more
Caused by: org.apache.http.NoHttpResponseException: The target server failed to respond
	at org.apache.http.impl.conn.DefaultHttpResponseParser.parseHead(DefaultHttpResponseParser.java:143)
	at org.apache.http.impl.conn.DefaultHttpResponseParser.parseHead(DefaultHttpResponseParser.java:57)
	at org.apache.http.impl.io.AbstractMessageParser.parse(AbstractMessageParser.java:260)
	at org.apache.http.impl.AbstractHttpClientConnection.receiveResponseHeader(AbstractHttpClientConnection.java:283)
	at org.apache.http.impl.conn.DefaultClientConnection.receiveResponseHeader(DefaultClientConnection.java:251)
	at org.apache.http.impl.conn.ManagedClientConnectionImpl.receiveResponseHeader(ManagedClientConnectionImpl.java:197)
	at org.apache.http.protocol.HttpRequestExecutor.doReceiveResponse(HttpRequestExecutor.java:271)
	at org.apache.http.protocol.HttpRequestExecutor.execute(HttpRequestExecutor.java:123)
	at org.apache.http.impl.client.DefaultRequestDirector.tryExecute(DefaultRequestDirector.java:682)
	at org.apache.http.impl.client.DefaultRequestDirector.execute(DefaultRequestDirector.java:486)
	at org.apache.http.impl.client.AbstractHttpClient.doExecute(AbstractHttpClient.java:863)
	at org.apache.http.impl.client.CloseableHttpClient.execute(CloseableHttpClient.java:82)
	at org.apache.http.impl.client.CloseableHttpClient.execute(CloseableHttpClient.java:106)
	at org.apache.http.impl.client.CloseableHttpClient.execute(CloseableHttpClient.java:57)
	at org.apache.solr.client.solrj.impl.HttpSolrClient.executeMethod(HttpSolrClient.java:464)
	... 53 more


FAILED:  org.apache.solr.cloud.LeaderFailoverAfterPartitionTest.test

Error Message:
org.apache.solr.client.solrj.SolrServerException: IOException occured when talking to server at: http://127.0.0.1:44284/z_/o/c8n_1x3_lf_shard1_replica3

Stack Trace:
org.apache.solr.client.solrj.SolrServerException: org.apache.solr.client.solrj.SolrServerException: IOException occured when talking to server at: http://127.0.0.1:44284/z_/o/c8n_1x3_lf_shard1_replica3
	at __randomizedtesting.SeedInfo.seed([6DEB3E57C8B66EF1:E5BF018D664A0309]:0)
	at org.apache.solr.client.solrj.impl.CloudSolrClient.directUpdate(CloudSolrClient.java:597)
	at org.apache.solr.client.solrj.impl.CloudSolrClient.sendRequest(CloudSolrClient.java:918)
	at org.apache.solr.client.solrj.impl.CloudSolrClient.requestWithRetryOnStaleState(CloudSolrClient.java:809)
	at org.apache.solr.client.solrj.impl.CloudSolrClient.request(CloudSolrClient.java:752)
	at org.apache.solr.cloud.HttpPartitionTest.doSendDoc(HttpPartitionTest.java:484)
	at org.apache.solr.cloud.HttpPartitionTest.sendDoc(HttpPartitionTest.java:501)
	at org.apache.solr.cloud.LeaderFailoverAfterPartitionTest.testRf3WithLeaderFailover(LeaderFailoverAfterPartitionTest.java:78)
	at org.apache.solr.cloud.LeaderFailoverAfterPartitionTest.test(LeaderFailoverAfterPartitionTest.java:51)
	at sun.reflect.NativeMethodAccessorImpl.invoke0(Native Method)
	at sun.reflect.NativeMethodAccessorImpl.invoke(NativeMethodAccessorImpl.java:57)
	at sun.reflect.DelegatingMethodAccessorImpl.invoke(DelegatingMethodAccessorImpl.java:43)
	at java.lang.reflect.Method.invoke(Method.java:606)
	at com.carrotsearch.randomizedtesting.RandomizedRunner.invoke(RandomizedRunner.java:1627)
	at com.carrotsearch.randomizedtesting.RandomizedRunner$6.evaluate(RandomizedRunner.java:836)
	at com.carrotsearch.randomizedtesting.RandomizedRunner$7.evaluate(RandomizedRunner.java:872)
	at com.carrotsearch.randomizedtesting.RandomizedRunner$8.evaluate(RandomizedRunner.java:886)
	at org.apache.solr.BaseDistributedSearchTestCase$ShardsRepeatRule$ShardsFixedStatement.callStatement(BaseDistributedSearchTestCase.java:950)
	at org.apache.solr.BaseDistributedSearchTestCase$ShardsRepeatRule$ShardsStatement.evaluate(BaseDistributedSearchTestCase.java:925)
	at com.carrotsearch.randomizedtesting.rules.SystemPropertiesRestoreRule$1.evaluate(SystemPropertiesRestoreRule.java:53)
	at org.apache.lucene.util.TestRuleSetupTeardownChained$1.evaluate(TestRuleSetupTeardownChained.java:50)
	at org.apache.lucene.util.AbstractBeforeAfterRule$1.evaluate(AbstractBeforeAfterRule.java:46)
	at org.apache.lucene.util.TestRuleThreadAndTestName$1.evaluate(TestRuleThreadAndTestName.java:49)
	at org.apache.lucene.util.TestRuleIgnoreAfterMaxFailures$1.evaluate(TestRuleIgnoreAfterMaxFailures.java:65)
	at org.apache.lucene.util.TestRuleMarkFailure$1.evaluate(TestRuleMarkFailure.java:48)
	at com.carrotsearch.randomizedtesting.rules.StatementAdapter.evaluate(StatementAdapter.java:36)
	at com.carrotsearch.randomizedtesting.ThreadLeakControl$StatementRunner.run(ThreadLeakControl.java:365)
	at com.carrotsearch.randomizedtesting.ThreadLeakControl.forkTimeoutingTask(ThreadLeakControl.java:798)
	at com.carrotsearch.randomizedtesting.ThreadLeakControl$3.evaluate(ThreadLeakControl.java:458)
	at com.carrotsearch.randomizedtesting.RandomizedRunner.runSingleTest(RandomizedRunner.java:845)
	at com.carrotsearch.randomizedtesting.RandomizedRunner$3.evaluate(RandomizedRunner.java:747)
	at com.carrotsearch.randomizedtesting.RandomizedRunner$4.evaluate(RandomizedRunner.java:781)
	at com.carrotsearch.randomizedtesting.RandomizedRunner$5.evaluate(RandomizedRunner.java:792)
	at com.carrotsearch.randomizedtesting.rules.StatementAdapter.evaluate(StatementAdapter.java:36)
	at com.carrotsearch.randomizedtesting.rules.SystemPropertiesRestoreRule$1.evaluate(SystemPropertiesRestoreRule.java:53)
	at org.apache.lucene.util.AbstractBeforeAfterRule$1.evaluate(AbstractBeforeAfterRule.java:46)
	at com.carrotsearch.randomizedtesting.rules.StatementAdapter.evaluate(StatementAdapter.java:36)
	at org.apache.lucene.util.TestRuleStoreClassName$1.evaluate(TestRuleStoreClassName.java:42)
	at com.carrotsearch.randomizedtesting.rules.NoShadowingOrOverridesOnMethodsRule$1.evaluate(NoShadowingOrOverridesOnMethodsRule.java:39)
	at com.carrotsearch.randomizedtesting.rules.NoShadowingOrOverridesOnMethodsRule$1.evaluate(NoShadowingOrOverridesOnMethodsRule.java:39)
	at com.carrotsearch.randomizedtesting.rules.StatementAdapter.evaluate(StatementAdapter.java:36)
	at com.carrotsearch.randomizedtesting.rules.StatementAdapter.evaluate(StatementAdapter.java:36)
	at com.carrotsearch.randomizedtesting.rules.StatementAdapter.evaluate(StatementAdapter.java:36)
	at org.apache.lucene.util.TestRuleAssertionsRequired$1.evaluate(TestRuleAssertionsRequired.java:54)
	at org.apache.lucene.util.TestRuleMarkFailure$1.evaluate(TestRuleMarkFailure.java:48)
	at org.apache.lucene.util.TestRuleIgnoreAfterMaxFailures$1.evaluate(TestRuleIgnoreAfterMaxFailures.java:65)
	at org.apache.lucene.util.TestRuleIgnoreTestSuites$1.evaluate(TestRuleIgnoreTestSuites.java:55)
	at com.carrotsearch.randomizedtesting.rules.StatementAdapter.evaluate(StatementAdapter.java:36)
	at com.carrotsearch.randomizedtesting.ThreadLeakControl$StatementRunner.run(ThreadLeakControl.java:365)
	at java.lang.Thread.run(Thread.java:745)
Caused by: org.apache.solr.client.solrj.SolrServerException: IOException occured when talking to server at: http://127.0.0.1:44284/z_/o/c8n_1x3_lf_shard1_replica3
	at org.apache.solr.client.solrj.impl.HttpSolrClient.executeMethod(HttpSolrClient.java:572)
	at org.apache.solr.client.solrj.impl.HttpSolrClient.request(HttpSolrClient.java:214)
	at org.apache.solr.client.solrj.impl.HttpSolrClient.request(HttpSolrClient.java:210)
	at org.apache.solr.client.solrj.impl.LBHttpSolrClient.doRequest(LBHttpSolrClient.java:370)
	at org.apache.solr.client.solrj.impl.LBHttpSolrClient.request(LBHttpSolrClient.java:325)
	at org.apache.solr.client.solrj.impl.CloudSolrClient.directUpdate(CloudSolrClient.java:594)
	... 48 more
Caused by: org.apache.http.NoHttpResponseException: The target server failed to respond
	at org.apache.http.impl.conn.DefaultHttpResponseParser.parseHead(DefaultHttpResponseParser.java:143)
	at org.apache.http.impl.conn.DefaultHttpResponseParser.parseHead(DefaultHttpResponseParser.java:57)
	at org.apache.http.impl.io.AbstractMessageParser.parse(AbstractMessageParser.java:260)
	at org.apache.http.impl.AbstractHttpClientConnection.receiveResponseHeader(AbstractHttpClientConnection.java:283)
	at org.apache.http.impl.conn.DefaultClientConnection.receiveResponseHeader(DefaultClientConnection.java:251)
	at org.apache.http.impl.conn.ManagedClientConnectionImpl.receiveResponseHeader(ManagedClientConnectionImpl.java:197)
	at org.apache.http.protocol.HttpRequestExecutor.doReceiveResponse(HttpRequestExecutor.java:271)
	at org.apache.http.protocol.HttpRequestExecutor.execute(HttpRequestExecutor.java:123)
	at org.apache.http.impl.client.DefaultRequestDirector.tryExecute(DefaultRequestDirector.java:682)
	at org.apache.http.impl.client.DefaultRequestDirector.execute(DefaultRequestDirector.java:486)
	at org.apache.http.impl.client.AbstractHttpClient.doExecute(AbstractHttpClient.java:863)
	at org.apache.http.impl.client.CloseableHttpClient.execute(CloseableHttpClient.java:82)
	at org.apache.http.impl.client.CloseableHttpClient.execute(CloseableHttpClient.java:106)
	at org.apache.http.impl.client.CloseableHttpClient.execute(CloseableHttpClient.java:57)
	at org.apache.solr.client.solrj.impl.HttpSolrClient.executeMethod(HttpSolrClient.java:464)
	... 53 more


FAILED:  org.apache.solr.cloud.LeaderInitiatedRecoveryOnCommitTest.test

Error Message:
IOException occured when talking to server at: http://127.0.0.1:51923/_zs/c8n_1x3_commits_shard1_replica1

Stack Trace:
org.apache.solr.client.solrj.SolrServerException: IOException occured when talking to server at: http://127.0.0.1:51923/_zs/c8n_1x3_commits_shard1_replica1
	at __randomizedtesting.SeedInfo.seed([6DEB3E57C8B66EF1:E5BF018D664A0309]:0)
	at org.apache.solr.client.solrj.impl.HttpSolrClient.executeMethod(HttpSolrClient.java:572)
	at org.apache.solr.client.solrj.impl.HttpSolrClient.request(HttpSolrClient.java:214)
	at org.apache.solr.client.solrj.impl.HttpSolrClient.request(HttpSolrClient.java:210)
	at org.apache.solr.client.solrj.SolrRequest.process(SolrRequest.java:131)
	at org.apache.solr.client.solrj.SolrClient.commit(SolrClient.java:176)
	at org.apache.solr.client.solrj.SolrClient.commit(SolrClient.java:154)
	at org.apache.solr.cloud.LeaderInitiatedRecoveryOnCommitTest.oneShardTest(LeaderInitiatedRecoveryOnCommitTest.java:130)
	at org.apache.solr.cloud.LeaderInitiatedRecoveryOnCommitTest.test(LeaderInitiatedRecoveryOnCommitTest.java:62)
	at sun.reflect.NativeMethodAccessorImpl.invoke0(Native Method)
	at sun.reflect.NativeMethodAccessorImpl.invoke(NativeMethodAccessorImpl.java:57)
	at sun.reflect.DelegatingMethodAccessorImpl.invoke(DelegatingMethodAccessorImpl.java:43)
	at java.lang.reflect.Method.invoke(Method.java:606)
	at com.carrotsearch.randomizedtesting.RandomizedRunner.invoke(RandomizedRunner.java:1627)
	at com.carrotsearch.randomizedtesting.RandomizedRunner$6.evaluate(RandomizedRunner.java:836)
	at com.carrotsearch.randomizedtesting.RandomizedRunner$7.evaluate(RandomizedRunner.java:872)
	at com.carrotsearch.randomizedtesting.RandomizedRunner$8.evaluate(RandomizedRunner.java:886)
	at org.apache.solr.BaseDistributedSearchTestCase$ShardsRepeatRule$ShardsFixedStatement.callStatement(BaseDistributedSearchTestCase.java:950)
	at org.apache.solr.BaseDistributedSearchTestCase$ShardsRepeatRule$ShardsStatement.evaluate(BaseDistributedSearchTestCase.java:925)
	at com.carrotsearch.randomizedtesting.rules.SystemPropertiesRestoreRule$1.evaluate(SystemPropertiesRestoreRule.java:53)
	at org.apache.lucene.util.TestRuleSetupTeardownChained$1.evaluate(TestRuleSetupTeardownChained.java:50)
	at org.apache.lucene.util.AbstractBeforeAfterRule$1.evaluate(AbstractBeforeAfterRule.java:46)
	at org.apache.lucene.util.TestRuleThreadAndTestName$1.evaluate(TestRuleThreadAndTestName.java:49)
	at org.apache.lucene.util.TestRuleIgnoreAfterMaxFailures$1.evaluate(TestRuleIgnoreAfterMaxFailures.java:65)
	at org.apache.lucene.util.TestRuleMarkFailure$1.evaluate(TestRuleMarkFailure.java:48)
	at com.carrotsearch.randomizedtesting.rules.StatementAdapter.evaluate(StatementAdapter.java:36)
	at com.carrotsearch.randomizedtesting.ThreadLeakControl$StatementRunner.run(ThreadLeakControl.java:365)
	at com.carrotsearch.randomizedtesting.ThreadLeakControl.forkTimeoutingTask(ThreadLeakControl.java:798)
	at com.carrotsearch.randomizedtesting.ThreadLeakControl$3.evaluate(ThreadLeakControl.java:458)
	at com.carrotsearch.randomizedtesting.RandomizedRunner.runSingleTest(RandomizedRunner.java:845)
	at com.carrotsearch.randomizedtesting.RandomizedRunner$3.evaluate(RandomizedRunner.java:747)
	at com.carrotsearch.randomizedtesting.RandomizedRunner$4.evaluate(RandomizedRunner.java:781)
	at com.carrotsearch.randomizedtesting.RandomizedRunner$5.evaluate(RandomizedRunner.java:792)
	at com.carrotsearch.randomizedtesting.rules.StatementAdapter.evaluate(StatementAdapter.java:36)
	at com.carrotsearch.randomizedtesting.rules.SystemPropertiesRestoreRule$1.evaluate(SystemPropertiesRestoreRule.java:53)
	at org.apache.lucene.util.AbstractBeforeAfterRule$1.evaluate(AbstractBeforeAfterRule.java:46)
	at com.carrotsearch.randomizedtesting.rules.StatementAdapter.evaluate(StatementAdapter.java:36)
	at org.apache.lucene.util.TestRuleStoreClassName$1.evaluate(TestRuleStoreClassName.java:42)
	at com.carrotsearch.randomizedtesting.rules.NoShadowingOrOverridesOnMethodsRule$1.evaluate(NoShadowingOrOverridesOnMethodsRule.java:39)
	at com.carrotsearch.randomizedtesting.rules.NoShadowingOrOverridesOnMethodsRule$1.evaluate(NoShadowingOrOverridesOnMethodsRule.java:39)
	at com.carrotsearch.randomizedtesting.rules.StatementAdapter.evaluate(StatementAdapter.java:36)
	at com.carrotsearch.randomizedtesting.rules.StatementAdapter.evaluate(StatementAdapter.java:36)
	at com.carrotsearch.randomizedtesting.rules.StatementAdapter.evaluate(StatementAdapter.java:36)
	at org.apache.lucene.util.TestRuleAssertionsRequired$1.evaluate(TestRuleAssertionsRequired.java:54)
	at org.apache.lucene.util.TestRuleMarkFailure$1.evaluate(TestRuleMarkFailure.java:48)
	at org.apache.lucene.util.TestRuleIgnoreAfterMaxFailures$1.evaluate(TestRuleIgnoreAfterMaxFailures.java:65)
	at org.apache.lucene.util.TestRuleIgnoreTestSuites$1.evaluate(TestRuleIgnoreTestSuites.java:55)
	at com.carrotsearch.randomizedtesting.rules.StatementAdapter.evaluate(StatementAdapter.java:36)
	at com.carrotsearch.randomizedtesting.ThreadLeakControl$StatementRunner.run(ThreadLeakControl.java:365)
	at java.lang.Thread.run(Thread.java:745)
Caused by: org.apache.http.NoHttpResponseException: The target server failed to respond
	at org.apache.http.impl.conn.DefaultHttpResponseParser.parseHead(DefaultHttpResponseParser.java:143)
	at org.apache.http.impl.conn.DefaultHttpResponseParser.parseHead(DefaultHttpResponseParser.java:57)
	at org.apache.http.impl.io.AbstractMessageParser.parse(AbstractMessageParser.java:260)
	at org.apache.http.impl.AbstractHttpClientConnection.receiveResponseHeader(AbstractHttpClientConnection.java:283)
	at org.apache.http.impl.conn.DefaultClientConnection.receiveResponseHeader(DefaultClientConnection.java:251)
	at org.apache.http.impl.conn.ManagedClientConnectionImpl.receiveResponseHeader(ManagedClientConnectionImpl.java:197)
	at org.apache.http.protocol.HttpRequestExecutor.doReceiveResponse(HttpRequestExecutor.java:271)
	at org.apache.http.protocol.HttpRequestExecutor.execute(HttpRequestExecutor.java:123)
	at org.apache.http.impl.client.DefaultRequestDirector.tryExecute(DefaultRequestDirector.java:682)
	at org.apache.http.impl.client.DefaultRequestDirector.execute(DefaultRequestDirector.java:486)
	at org.apache.http.impl.client.AbstractHttpClient.doExecute(AbstractHttpClient.java:863)
	at org.apache.http.impl.client.CloseableHttpClient.execute(CloseableHttpClient.java:82)
	at org.apache.http.impl.client.CloseableHttpClient.execute(CloseableHttpClient.java:106)
	at org.apache.http.impl.client.CloseableHttpClient.execute(CloseableHttpClient.java:57)
	at org.apache.solr.client.solrj.impl.HttpSolrClient.executeMethod(HttpSolrClient.java:464)
	... 48 more


FAILED:  org.apache.solr.cloud.RecoveryAfterSoftCommitTest.test

Error Message:
org.apache.solr.client.solrj.SolrServerException: IOException occured when talking to server at: http://127.0.0.1:53918/collection1

Stack Trace:
org.apache.solr.client.solrj.SolrServerException: org.apache.solr.client.solrj.SolrServerException: IOException occured when talking to server at: http://127.0.0.1:53918/collection1
	at __randomizedtesting.SeedInfo.seed([6DEB3E57C8B66EF1:E5BF018D664A0309]:0)
	at org.apache.solr.client.solrj.impl.CloudSolrClient.directUpdate(CloudSolrClient.java:597)
	at org.apache.solr.client.solrj.impl.CloudSolrClient.sendRequest(CloudSolrClient.java:918)
	at org.apache.solr.client.solrj.impl.CloudSolrClient.requestWithRetryOnStaleState(CloudSolrClient.java:809)
	at org.apache.solr.client.solrj.impl.CloudSolrClient.request(CloudSolrClient.java:752)
	at org.apache.solr.client.solrj.SolrRequest.process(SolrRequest.java:131)
	at org.apache.solr.client.solrj.SolrClient.add(SolrClient.java:124)
	at org.apache.solr.client.solrj.SolrClient.add(SolrClient.java:110)
	at org.apache.solr.cloud.RecoveryAfterSoftCommitTest.test(RecoveryAfterSoftCommitTest.java:88)
	at sun.reflect.NativeMethodAccessorImpl.invoke0(Native Method)
	at sun.reflect.NativeMethodAccessorImpl.invoke(NativeMethodAccessorImpl.java:57)
	at sun.reflect.DelegatingMethodAccessorImpl.invoke(DelegatingMethodAccessorImpl.java:43)
	at java.lang.reflect.Method.invoke(Method.java:606)
	at com.carrotsearch.randomizedtesting.RandomizedRunner.invoke(RandomizedRunner.java:1627)
	at com.carrotsearch.randomizedtesting.RandomizedRunner$6.evaluate(RandomizedRunner.java:836)
	at com.carrotsearch.randomizedtesting.RandomizedRunner$7.evaluate(RandomizedRunner.java:872)
	at com.carrotsearch.randomizedtesting.RandomizedRunner$8.evaluate(RandomizedRunner.java:886)
	at org.apache.solr.BaseDistributedSearchTestCase$ShardsRepeatRule$ShardsFixedStatement.callStatement(BaseDistributedSearchTestCase.java:950)
	at org.apache.solr.BaseDistributedSearchTestCase$ShardsRepeatRule$ShardsStatement.evaluate(BaseDistributedSearchTestCase.java:925)
	at com.carrotsearch.randomizedtesting.rules.SystemPropertiesRestoreRule$1.evaluate(SystemPropertiesRestoreRule.java:53)
	at org.apache.lucene.util.TestRuleSetupTeardownChained$1.evaluate(TestRuleSetupTeardownChained.java:50)
	at org.apache.lucene.util.AbstractBeforeAfterRule$1.evaluate(AbstractBeforeAfterRule.java:46)
	at org.apache.lucene.util.TestRuleThreadAndTestName$1.evaluate(TestRuleThreadAndTestName.java:49)
	at org.apache.lucene.util.TestRuleIgnoreAfterMaxFailures$1.evaluate(TestRuleIgnoreAfterMaxFailures.java:65)
	at org.apache.lucene.util.TestRuleMarkFailure$1.evaluate(TestRuleMarkFailure.java:48)
	at com.carrotsearch.randomizedtesting.rules.StatementAdapter.evaluate(StatementAdapter.java:36)
	at com.carrotsearch.randomizedtesting.ThreadLeakControl$StatementRunner.run(ThreadLeakControl.java:365)
	at com.carrotsearch.randomizedtesting.ThreadLeakControl.forkTimeoutingTask(ThreadLeakControl.java:798)
	at com.carrotsearch.randomizedtesting.ThreadLeakControl$3.evaluate(ThreadLeakControl.java:458)
	at com.carrotsearch.randomizedtesting.RandomizedRunner.runSingleTest(RandomizedRunner.java:845)
	at com.carrotsearch.randomizedtesting.RandomizedRunner$3.evaluate(RandomizedRunner.java:747)
	at com.carrotsearch.randomizedtesting.RandomizedRunner$4.evaluate(RandomizedRunner.java:781)
	at com.carrotsearch.randomizedtesting.RandomizedRunner$5.evaluate(RandomizedRunner.java:792)
	at com.carrotsearch.randomizedtesting.rules.StatementAdapter.evaluate(StatementAdapter.java:36)
	at com.carrotsearch.randomizedtesting.rules.SystemPropertiesRestoreRule$1.evaluate(SystemPropertiesRestoreRule.java:53)
	at org.apache.lucene.util.AbstractBeforeAfterRule$1.evaluate(AbstractBeforeAfterRule.java:46)
	at com.carrotsearch.randomizedtesting.rules.StatementAdapter.evaluate(StatementAdapter.java:36)
	at org.apache.lucene.util.TestRuleStoreClassName$1.evaluate(TestRuleStoreClassName.java:42)
	at com.carrotsearch.randomizedtesting.rules.NoShadowingOrOverridesOnMethodsRule$1.evaluate(NoShadowingOrOverridesOnMethodsRule.java:39)
	at com.carrotsearch.randomizedtesting.rules.NoShadowingOrOverridesOnMethodsRule$1.evaluate(NoShadowingOrOverridesOnMethodsRule.java:39)
	at com.carrotsearch.randomizedtesting.rules.StatementAdapter.evaluate(StatementAdapter.java:36)
	at com.carrotsearch.randomizedtesting.rules.StatementAdapter.evaluate(StatementAdapter.java:36)
	at com.carrotsearch.randomizedtesting.rules.StatementAdapter.evaluate(StatementAdapter.java:36)
	at org.apache.lucene.util.TestRuleAssertionsRequired$1.evaluate(TestRuleAssertionsRequired.java:54)
	at org.apache.lucene.util.TestRuleMarkFailure$1.evaluate(TestRuleMarkFailure.java:48)
	at org.apache.lucene.util.TestRuleIgnoreAfterMaxFailures$1.evaluate(TestRuleIgnoreAfterMaxFailures.java:65)
	at org.apache.lucene.util.TestRuleIgnoreTestSuites$1.evaluate(TestRuleIgnoreTestSuites.java:55)
	at com.carrotsearch.randomizedtesting.rules.StatementAdapter.evaluate(StatementAdapter.java:36)
	at com.carrotsearch.randomizedtesting.ThreadLeakControl$StatementRunner.run(ThreadLeakControl.java:365)
	at java.lang.Thread.run(Thread.java:745)
Caused by: org.apache.solr.client.solrj.SolrServerException: IOException occured when talking to server at: http://127.0.0.1:53918/collection1
	at org.apache.solr.client.solrj.impl.HttpSolrClient.executeMethod(HttpSolrClient.java:572)
	at org.apache.solr.client.solrj.impl.HttpSolrClient.request(HttpSolrClient.java:214)
	at org.apache.solr.client.solrj.impl.HttpSolrClient.request(HttpSolrClient.java:210)
	at org.apache.solr.client.solrj.impl.LBHttpSolrClient.doRequest(LBHttpSolrClient.java:370)
	at org.apache.solr.client.solrj.impl.LBHttpSolrClient.request(LBHttpSolrClient.java:325)
	at org.apache.solr.client.solrj.impl.CloudSolrClient.directUpdate(CloudSolrClient.java:594)
	... 48 more
Caused by: org.apache.http.NoHttpResponseException: The target server failed to respond
	at org.apache.http.impl.conn.DefaultHttpResponseParser.parseHead(DefaultHttpResponseParser.java:143)
	at org.apache.http.impl.conn.DefaultHttpResponseParser.parseHead(DefaultHttpResponseParser.java:57)
	at org.apache.http.impl.io.AbstractMessageParser.parse(AbstractMessageParser.java:260)
	at org.apache.http.impl.AbstractHttpClientConnection.receiveResponseHeader(AbstractHttpClientConnection.java:283)
	at org.apache.http.impl.conn.DefaultClientConnection.receiveResponseHeader(DefaultClientConnection.java:251)
	at org.apache.http.impl.conn.ManagedClientConnectionImpl.receiveResponseHeader(ManagedClientConnectionImpl.java:197)
	at org.apache.http.protocol.HttpRequestExecutor.doReceiveResponse(HttpRequestExecutor.java:271)
	at org.apache.http.protocol.HttpRequestExecutor.execute(HttpRequestExecutor.java:123)
	at org.apache.http.impl.client.DefaultRequestDirector.tryExecute(DefaultRequestDirector.java:682)
	at org.apache.http.impl.client.DefaultRequestDirector.execute(DefaultRequestDirector.java:486)
	at org.apache.http.impl.client.AbstractHttpClient.doExecute(AbstractHttpClient.java:863)
	at org.apache.http.impl.client.CloseableHttpClient.execute(CloseableHttpClient.java:82)
	at org.apache.http.impl.client.CloseableHttpClient.execute(CloseableHttpClient.java:106)
	at org.apache.http.impl.client.CloseableHttpClient.execute(CloseableHttpClient.java:57)
	at org.apache.solr.client.solrj.impl.HttpSolrClient.executeMethod(HttpSolrClient.java:464)
	... 53 more


FAILED:  org.apache.solr.cloud.ReplicationFactorTest.test

Error Message:
org.apache.solr.client.solrj.SolrServerException: IOException occured when talking to server at: http://127.0.0.1:10363/repfacttest_c8n_1x3_shard1_replica1

Stack Trace:
org.apache.solr.client.solrj.SolrServerException: org.apache.solr.client.solrj.SolrServerException: IOException occured when talking to server at: http://127.0.0.1:10363/repfacttest_c8n_1x3_shard1_replica1
	at __randomizedtesting.SeedInfo.seed([6DEB3E57C8B66EF1:E5BF018D664A0309]:0)
	at org.apache.solr.client.solrj.impl.CloudSolrClient.directUpdate(CloudSolrClient.java:597)
	at org.apache.solr.client.solrj.impl.CloudSolrClient.sendRequest(CloudSolrClient.java:918)
	at org.apache.solr.client.solrj.impl.CloudSolrClient.requestWithRetryOnStaleState(CloudSolrClient.java:809)
	at org.apache.solr.client.solrj.impl.CloudSolrClient.request(CloudSolrClient.java:752)
	at org.apache.solr.cloud.ReplicationFactorTest.sendDoc(ReplicationFactorTest.java:319)
	at org.apache.solr.cloud.ReplicationFactorTest.testRf3(ReplicationFactorTest.java:233)
	at org.apache.solr.cloud.ReplicationFactorTest.test(ReplicationFactorTest.java:112)
	at sun.reflect.NativeMethodAccessorImpl.invoke0(Native Method)
	at sun.reflect.NativeMethodAccessorImpl.invoke(NativeMethodAccessorImpl.java:57)
	at sun.reflect.DelegatingMethodAccessorImpl.invoke(DelegatingMethodAccessorImpl.java:43)
	at java.lang.reflect.Method.invoke(Method.java:606)
	at com.carrotsearch.randomizedtesting.RandomizedRunner.invoke(RandomizedRunner.java:1627)
	at com.carrotsearch.randomizedtesting.RandomizedRunner$6.evaluate(RandomizedRunner.java:836)
	at com.carrotsearch.randomizedtesting.RandomizedRunner$7.evaluate(RandomizedRunner.java:872)
	at com.carrotsearch.randomizedtesting.RandomizedRunner$8.evaluate(RandomizedRunner.java:886)
	at org.apache.solr.BaseDistributedSearchTestCase$ShardsRepeatRule$ShardsFixedStatement.callStatement(BaseDistributedSearchTestCase.java:950)
	at org.apache.solr.BaseDistributedSearchTestCase$ShardsRepeatRule$ShardsStatement.evaluate(BaseDistributedSearchTestCase.java:925)
	at com.carrotsearch.randomizedtesting.rules.SystemPropertiesRestoreRule$1.evaluate(SystemPropertiesRestoreRule.java:53)
	at org.apache.lucene.util.TestRuleSetupTeardownChained$1.evaluate(TestRuleSetupTeardownChained.java:50)
	at org.apache.lucene.util.AbstractBeforeAfterRule$1.evaluate(AbstractBeforeAfterRule.java:46)
	at org.apache.lucene.util.TestRuleThreadAndTestName$1.evaluate(TestRuleThreadAndTestName.java:49)
	at org.apache.lucene.util.TestRuleIgnoreAfterMaxFailures$1.evaluate(TestRuleIgnoreAfterMaxFailures.java:65)
	at org.apache.lucene.util.TestRuleMarkFailure$1.evaluate(TestRuleMarkFailure.java:48)
	at com.carrotsearch.randomizedtesting.rules.StatementAdapter.evaluate(StatementAdapter.java:36)
	at com.carrotsearch.randomizedtesting.ThreadLeakControl$StatementRunner.run(ThreadLeakControl.java:365)
	at com.carrotsearch.randomizedtesting.ThreadLeakControl.forkTimeoutingTask(ThreadLeakControl.java:798)
	at com.carrotsearch.randomizedtesting.ThreadLeakControl$3.evaluate(ThreadLeakControl.java:458)
	at com.carrotsearch.randomizedtesting.RandomizedRunner.runSingleTest(RandomizedRunner.java:845)
	at com.carrotsearch.randomizedtesting.RandomizedRunner$3.evaluate(RandomizedRunner.java:747)
	at com.carrotsearch.randomizedtesting.RandomizedRunner$4.evaluate(RandomizedRunner.java:781)
	at com.carrotsearch.randomizedtesting.RandomizedRunner$5.evaluate(RandomizedRunner.java:792)
	at com.carrotsearch.randomizedtesting.rules.StatementAdapter.evaluate(StatementAdapter.java:36)
	at com.carrotsearch.randomizedtesting.rules.SystemPropertiesRestoreRule$1.evaluate(SystemPropertiesRestoreRule.java:53)
	at org.apache.lucene.util.AbstractBeforeAfterRule$1.evaluate(AbstractBeforeAfterRule.java:46)
	at com.carrotsearch.randomizedtesting.rules.StatementAdapter.evaluate(StatementAdapter.java:36)
	at org.apache.lucene.util.TestRuleStoreClassName$1.evaluate(TestRuleStoreClassName.java:42)
	at com.carrotsearch.randomizedtesting.rules.NoShadowingOrOverridesOnMethodsRule$1.evaluate(NoShadowingOrOverridesOnMethodsRule.java:39)
	at com.carrotsearch.randomizedtesting.rules.NoShadowingOrOverridesOnMethodsRule$1.evaluate(NoShadowingOrOverridesOnMethodsRule.java:39)
	at com.carrotsearch.randomizedtesting.rules.StatementAdapter.evaluate(StatementAdapter.java:36)
	at com.carrotsearch.randomizedtesting.rules.StatementAdapter.evaluate(StatementAdapter.java:36)
	at com.carrotsearch.randomizedtesting.rules.StatementAdapter.evaluate(StatementAdapter.java:36)
	at org.apache.lucene.util.TestRuleAssertionsRequired$1.evaluate(TestRuleAssertionsRequired.java:54)
	at org.apache.lucene.util.TestRuleMarkFailure$1.evaluate(TestRuleMarkFailure.java:48)
	at org.apache.lucene.util.TestRuleIgnoreAfterMaxFailures$1.evaluate(TestRuleIgnoreAfterMaxFailures.java:65)
	at org.apache.lucene.util.TestRuleIgnoreTestSuites$1.evaluate(TestRuleIgnoreTestSuites.java:55)
	at com.carrotsearch.randomizedtesting.rules.StatementAdapter.evaluate(StatementAdapter.java:36)
	at com.carrotsearch.randomizedtesting.ThreadLeakControl$StatementRunner.run(ThreadLeakControl.java:365)
	at java.lang.Thread.run(Thread.java:745)
Caused by: org.apache.solr.client.solrj.SolrServerException: IOException occured when talking to server at: http://127.0.0.1:10363/repfacttest_c8n_1x3_shard1_replica1
	at org.apache.solr.client.solrj.impl.HttpSolrClient.executeMethod(HttpSolrClient.java:572)
	at org.apache.solr.client.solrj.impl.HttpSolrClient.request(HttpSolrClient.java:214)
	at org.apache.solr.client.solrj.impl.HttpSolrClient.request(HttpSolrClient.java:210)
	at org.apache.solr.client.solrj.impl.LBHttpSolrClient.doRequest(LBHttpSolrClient.java:370)
	at org.apache.solr.client.solrj.impl.LBHttpSolrClient.request(LBHttpSolrClient.java:325)
	at org.apache.solr.client.solrj.impl.CloudSolrClient.directUpdate(CloudSolrClient.java:594)
	... 47 more
Caused by: org.apache.http.NoHttpResponseException: The target server failed to respond
	at org.apache.http.impl.conn.DefaultHttpResponseParser.parseHead(DefaultHttpResponseParser.java:143)
	at org.apache.http.impl.conn.DefaultHttpResponseParser.parseHead(DefaultHttpResponseParser.java:57)
	at org.apache.http.impl.io.AbstractMessageParser.parse(AbstractMessageParser.java:260)
	at org.apache.http.impl.AbstractHttpClientConnection.receiveResponseHeader(AbstractHttpClientConnection.java:283)
	at org.apache.http.impl.conn.DefaultClientConnection.receiveResponseHeader(DefaultClientConnection.java:251)
	at org.apache.http.impl.conn.ManagedClientConnectionImpl.receiveResponseHeader(ManagedClientConnectionImpl.java:197)
	at org.apache.http.protocol.HttpRequestExecutor.doReceiveResponse(HttpRequestExecutor.java:271)
	at org.apache.http.protocol.HttpRequestExecutor.execute(HttpRequestExecutor.java:123)
	at org.apache.http.impl.client.DefaultRequestDirector.tryExecute(DefaultRequestDirector.java:682)
	at org.apache.http.impl.client.DefaultRequestDirector.execute(DefaultRequestDirector.java:486)
	at org.apache.http.impl.client.AbstractHttpClient.doExecute(AbstractHttpClient.java:863)
	at org.apache.http.impl.client.CloseableHttpClient.execute(CloseableHttpClient.java:82)
	at org.apache.http.impl.client.CloseableHttpClient.execute(CloseableHttpClient.java:106)
	at org.apache.http.impl.client.CloseableHttpClient.execute(CloseableHttpClient.java:57)
	at org.apache.solr.client.solrj.impl.HttpSolrClient.executeMethod(HttpSolrClient.java:464)
	... 52 more




Build Log:
[...truncated 9447 lines...]
   [junit4] Suite: org.apache.solr.cloud.LeaderFailoverAfterPartitionTest
   [junit4]   2> Creating dataDir: /usr/home/jenkins/jenkins-slave/workspace/Lucene-Solr-Tests-5.x-Java7/solr/build/solr-core/test/J0/temp/solr.cloud.LeaderFailoverAfterPartitionTest 6DEB3E57C8B66EF1-001/init-core-data-001
   [junit4]   2> 20364 T18 oas.BaseDistributedSearchTestCase.initHostContext Setting hostContext system property: /z_/o
   [junit4]   2> 20421 T18 oasc.ZkTestServer.run STARTING ZK TEST SERVER
   [junit4]   1> client port:0.0.0.0/0.0.0.0:0
   [junit4]   2> 20433 T19 oasc.ZkTestServer$ZKServerMain.runFromConfig Starting server
   [junit4]   2> 20834 T18 oasc.ZkTestServer.run start zk server on port:28307
   [junit4]   2> 21034 T18 oascc.SolrZkClient.createZkCredentialsToAddAutomatically Using default ZkCredentialsProvider
   [junit4]   2> 21385 T18 oascc.ConnectionManager.waitForConnected Waiting for client to connect to ZooKeeper
   [junit4]   2> 21690 T26 oascc.ConnectionManager.process Watcher org.apache.solr.common.cloud.ConnectionManager@3cd46415 name:ZooKeeperConnection Watcher:127.0.0.1:28307 got event WatchedEvent state:SyncConnected type:None path:null path:null type:None
   [junit4]   2> 21691 T18 oascc.ConnectionManager.waitForConnected Client is connected to ZooKeeper
   [junit4]   2> 21701 T18 oascc.SolrZkClient.createZkACLProvider Using default ZkACLProvider
   [junit4]   2> 21717 T18 oascc.SolrZkClient.makePath makePath: /solr
   [junit4]   2> 21888 T18 oascc.SolrZkClient.createZkCredentialsToAddAutomatically Using default ZkCredentialsProvider
   [junit4]   2> 21889 T18 oascc.ConnectionManager.waitForConnected Waiting for client to connect to ZooKeeper
   [junit4]   2> 21892 T29 oascc.ConnectionManager.process Watcher org.apache.solr.common.cloud.ConnectionManager@40d2c946 name:ZooKeeperConnection Watcher:127.0.0.1:28307/solr got event WatchedEvent state:SyncConnected type:None path:null path:null type:None
   [junit4]   2> 21892 T18 oascc.ConnectionManager.waitForConnected Client is connected to ZooKeeper
   [junit4]   2> 21893 T18 oascc.SolrZkClient.createZkACLProvider Using default ZkACLProvider
   [junit4]   2> 21926 T18 oascc.SolrZkClient.makePath makePath: /collections/collection1
   [junit4]   2> 21931 T18 oascc.SolrZkClient.makePath makePath: /collections/collection1/shards
   [junit4]   2> 21936 T18 oascc.SolrZkClient.makePath makePath: /collections/control_collection
   [junit4]   2> 21940 T18 oascc.SolrZkClient.makePath makePath: /collections/control_collection/shards
   [junit4]   2> 21945 T18 oasc.AbstractZkTestCase.putConfig put /usr/home/jenkins/jenkins-slave/workspace/Lucene-Solr-Tests-5.x-Java7/solr/core/src/test-files/solr/collection1/conf/solrconfig-tlog.xml to /configs/conf1/solrconfig.xml
   [junit4]   2> 21990 T18 oascc.SolrZkClient.makePath makePath: /configs/conf1/solrconfig.xml
   [junit4]   2> 21997 T18 oasc.AbstractZkTestCase.putConfig put /usr/home/jenkins/jenkins-slave/workspace/Lucene-Solr-Tests-5.x-Java7/solr/core/src/test-files/solr/collection1/conf/schema.xml to /configs/conf1/schema.xml
   [junit4]   2> 21998 T18 oascc.SolrZkClient.makePath makePath: /configs/conf1/schema.xml
   [junit4]   2> 22004 T18 oasc.AbstractZkTestCase.putConfig put /usr/home/jenkins/jenkins-slave/workspace/Lucene-Solr-Tests-5.x-Java7/solr/core/src/test-files/solr/collection1/conf/solrconfig.snippet.randomindexconfig.xml to /configs/conf1/solrconfig.snippet.randomindexconfig.xml
   [junit4]   2> 22004 T18 oascc.SolrZkClient.makePath makePath: /configs/conf1/solrconfig.snippet.randomindexconfig.xml
   [junit4]   2> 22009 T18 oasc.AbstractZkTestCase.putConfig put /usr/home/jenkins/jenkins-slave/workspace/Lucene-Solr-Tests-5.x-Java7/solr/core/src/test-files/solr/collection1/conf/stopwords.txt to /configs/conf1/stopwords.txt
   [junit4]   2> 22010 T18 oascc.SolrZkClient.makePath makePath: /configs/conf1/stopwords.txt
   [junit4]   2> 22015 T18 oasc.AbstractZkTestCase.putConfig put /usr/home/jenkins/jenkins-slave/workspace/Lucene-Solr-Tests-5.x-Java7/solr/core/src/test-files/solr/collection1/conf/protwords.txt to /configs/conf1/protwords.txt
   [junit4]   2> 22016 T18 oascc.SolrZkClient.makePath makePath: /configs/conf1/protwords.txt
   [junit4]   2> 22020 T18 oasc.AbstractZkTestCase.putConfig put /usr/home/jenkins/jenkins-slave/workspace/Lucene-Solr-Tests-5.x-Java7/solr/core/src/test-files/solr/collection1/conf/currency.xml to /configs/conf1/currency.xml
   [junit4]   2> 22021 T18 oascc.SolrZkClient.makePath makePath: /configs/conf1/currency.xml
   [junit4]   2> 22026 T18 oasc.AbstractZkTestCase.putConfig put /usr/home/jenkins/jenkins-slave/workspace/Lucene-Solr-Tests-5.x-Java7/solr/core/src/test-files/solr/collection1/conf/enumsConfig.xml to /configs/conf1/enumsConfig.xml
   [junit4]   2> 22026 T18 oascc.SolrZkClient.makePath makePath: /configs/conf1/enumsConfig.xml
   [junit4]   2> 22031 T18 oasc.AbstractZkTestCase.putConfig put /usr/home/jenkins/jenkins-slave/workspace/Lucene-Solr-Tests-5.x-Java7/solr/core/src/test-files/solr/collection1/conf/open-exchange-rates.json to /configs/conf1/open-exchange-rates.json
   [junit4]   2> 22032 T18 oascc.SolrZkClient.makePath makePath: /configs/conf1/open-exchange-rates.json
   [junit4]   2> 22037 T18 oasc.AbstractZkTestCase.putConfig put /usr/home/jenkins/jenkins-slave/workspace/Lucene-Solr-Tests-5.x-Java7/solr/core/src/test-files/solr/collection1/conf/mapping-ISOLatin1Accent.txt to /configs/conf1/mapping-ISOLatin1Accent.txt
   [junit4]   2> 22037 T18 oascc.SolrZkClient.makePath makePath: /configs/conf1/mapping-ISOLatin1Accent.txt
   [junit4]   2> 22042 T18 oasc.AbstractZkTestCase.putConfig put /usr/home/jenkins/jenkins-slave/workspace/Lucene-Solr-Tests-5.x-Java7/solr/core/src/test-files/solr/collection1/conf/old_synonyms.txt to /configs/conf1/old_synonyms.txt
   [junit4]   2> 22043 T18 oascc.SolrZkClient.makePath makePath: /configs/conf1/old_synonyms.txt
   [junit4]   2> 22048 T18 oasc.AbstractZkTestCase.putConfig put /usr/home/jenkins/jenkins-slave/workspace/Lucene-Solr-Tests-5.x-Java7/solr/core/src/test-files/solr/collection1/conf/synonyms.txt to /configs/conf1/synonyms.txt
   [junit4]   2> 22049 T18 oascc.SolrZkClient.makePath makePath: /configs/conf1/synonyms.txt
   [junit4]   2> 24030 T18 oas.SolrTestCaseJ4.writeCoreProperties Writing core.properties file to /usr/home/jenkins/jenkins-slave/workspace/Lucene-Solr-Tests-5.x-Java7/solr/build/solr-core/test/J0/temp/solr.cloud.LeaderFailoverAfterPartitionTest 6DEB3E57C8B66EF1-001/control-001/cores/collection1
   [junit4]   2> 25064 T18 oejs.Server.doStart jetty-8.1.10.v20130312
   [junit4]   2> 25455 T18 oejs.AbstractConnector.doStart Started SocketConnector@127.0.0.1:49999
   [junit4]   2> 25614 T18 oass.SolrDispatchFilter.init SolrDispatchFilter.init()sun.misc.Launcher$AppClassLoader@57bd06bf
   [junit4]   2> 25616 T18 oasc.SolrResourceLoader.locateSolrHome JNDI not configured for solr (NoInitialContextEx)
   [junit4]   2> 25616 T18 oasc.SolrResourceLoader.locateSolrHome using system property solr.solr.home: /usr/home/jenkins/jenkins-slave/workspace/Lucene-Solr-Tests-5.x-Java7/solr/build/solr-core/test/J0/temp/solr.cloud.LeaderFailoverAfterPartitionTest 6DEB3E57C8B66EF1-001/control-001
   [junit4]   2> 25617 T18 oasc.SolrResourceLoader.<init> new SolrResourceLoader for directory: '/usr/home/jenkins/jenkins-slave/workspace/Lucene-Solr-Tests-5.x-Java7/solr/build/solr-core/test/J0/temp/solr.cloud.LeaderFailoverAfterPartitionTest 6DEB3E57C8B66EF1-001/control-001/'
   [junit4]   2> 25664 T18 oasc.SolrXmlConfig.fromFile Loading container configuration from /usr/home/jenkins/jenkins-slave/workspace/Lucene-Solr-Tests-5.x-Java7/solr/build/solr-core/test/J0/temp/solr.cloud.LeaderFailoverAfterPartitionTest 6DEB3E57C8B66EF1-001/control-001/solr.xml
   [junit4]   2> 25741 T18 oasc.CorePropertiesLocator.<init> Config-defined core root directory: /usr/home/jenkins/jenkins-slave/workspace/Lucene-Solr-Tests-5.x-Java7/solr/build/solr-core/test/J0/temp/solr.cloud.LeaderFailoverAfterPartitionTest 6DEB3E57C8B66EF1-001/control-001/cores
   [junit4]   2> 25742 T18 oasc.CoreContainer.<init> New CoreContainer 722953939
   [junit4]   2> 25742 T18 oasc.CoreContainer.load Loading cores into CoreContainer [instanceDir=/usr/home/jenkins/jenkins-slave/workspace/Lucene-Solr-Tests-5.x-Java7/solr/build/solr-core/test/J0/temp/solr.cloud.LeaderFailoverAfterPartitionTest 6DEB3E57C8B66EF1-001/control-001/]
   [junit4]   2> 25743 T18 oasc.CoreContainer.load loading shared library: /usr/home/jenkins/jenkins-slave/workspace/Lucene-Solr-Tests-5.x-Java7/solr/build/solr-core/test/J0/temp/solr.cloud.LeaderFailoverAfterPartitionTest 6DEB3E57C8B66EF1-001/control-001/lib
   [junit4]   2> 25744 T18 oasc.SolrResourceLoader.addToClassLoader WARN Can't find (or read) directory to add to classloader: lib (resolved as: /usr/home/jenkins/jenkins-slave/workspace/Lucene-Solr-Tests-5.x-Java7/solr/build/solr-core/test/J0/temp/solr.cloud.LeaderFailoverAfterPartitionTest 6DEB3E57C8B66EF1-001/control-001/lib).
   [junit4]   2> 25832 T18 oashc.HttpShardHandlerFactory.getParameter Setting socketTimeout to: 90000
   [junit4]   2> 25833 T18 oashc.HttpShardHandlerFactory.getParameter Setting urlScheme to: 
   [junit4]   2> 25834 T18 oashc.HttpShardHandlerFactory.getParameter Setting connTimeout to: 15000
   [junit4]   2> 25834 T18 oashc.HttpShardHandlerFactory.getParameter Setting maxConnectionsPerHost to: 20
   [junit4]   2> 25835 T18 oashc.HttpShardHandlerFactory.getParameter Setting maxConnections to: 10000
   [junit4]   2> 25835 T18 oashc.HttpShardHandlerFactory.getParameter Setting corePoolSize to: 0
   [junit4]   2> 25836 T18 oashc.HttpShardHandlerFactory.getParameter Setting maximumPoolSize to: 2147483647
   [junit4]   2> 25836 T18 oashc.HttpShardHandlerFactory.getParameter Setting maxThreadIdleTime to: 5
   [junit4]   2> 25837 T18 oashc.HttpShardHandlerFactory.getParameter Setting sizeOfQueue to: -1
   [junit4]   2> 25837 T18 oashc.HttpShardHandlerFactory.getParameter Setting fairnessPolicy to: false
   [junit4]   2> 25838 T18 oashc.HttpShardHandlerFactory.getParameter Setting useRetries to: false
   [junit4]   2> 25839 T18 oasu.UpdateShardHandler.<init> Creating UpdateShardHandler HTTP client with params: socketTimeout=340000&connTimeout=45000&retry=true
   [junit4]   2> 25840 T18 oasl.LogWatcher.createWatcher SLF4J impl is org.slf4j.impl.Log4jLoggerFactory
   [junit4]   2> 25840 T18 oasl.LogWatcher.newRegisteredLogWatcher Registering Log Listener [Log4j (org.slf4j.impl.Log4jLoggerFactory)]
   [junit4]   2> 25841 T18 oasc.CoreContainer.load Node Name: 127.0.0.1
   [junit4]   2> 25841 T18 oasc.ZkContainer.initZooKeeper Zookeeper client=127.0.0.1:28307/solr
   [junit4]   2> 25889 T18 oasc.ZkController.checkChrootPath zkHost includes chroot
   [junit4]   2> 25890 T18 oascc.SolrZkClient.createZkCredentialsToAddAutomatically Using default ZkCredentialsProvider
   [junit4]   2> 25891 T18 oascc.ConnectionManager.waitForConnected Waiting for client to connect to ZooKeeper
   [junit4]   2> 25894 T42 oascc.ConnectionManager.process Watcher org.apache.solr.common.cloud.ConnectionManager@457bd2f2 name:ZooKeeperConnection Watcher:127.0.0.1:28307 got event WatchedEvent state:SyncConnected type:None path:null path:null type:None
   [junit4]   2> 25894 T18 oascc.ConnectionManager.waitForConnected Client is connected to ZooKeeper
   [junit4]   2> 25895 T18 oascc.SolrZkClient.createZkACLProvider Using default ZkACLProvider
   [junit4]   2> 25933 T18 oascc.ConnectionManager.waitForConnected Waiting for client to connect to ZooKeeper
   [junit4]   2> 25935 T45 oascc.ConnectionManager.process Watcher org.apache.solr.common.cloud.ConnectionManager@194c47bd name:ZooKeeperConnection Watcher:127.0.0.1:28307/solr got event WatchedEvent state:SyncConnected type:None path:null path:null type:None
   [junit4]   2> 25936 T18 oascc.ConnectionManager.waitForConnected Client is connected to ZooKeeper
   [junit4]   2> 25967 T18 oascc.SolrZkClient.makePath makePath: /overseer/queue
   [junit4]   2> 25989 T18 oascc.SolrZkClient.makePath makePath: /overseer/collection-queue-work
   [junit4]   2> 26001 T18 oascc.SolrZkClient.makePath makePath: /overseer/collection-map-running
   [junit4]   2> 26006 T18 oascc.SolrZkClient.makePath makePath: /overseer/collection-map-completed
   [junit4]   2> 26010 T18 oascc.SolrZkClient.makePath makePath: /overseer/collection-map-failure
   [junit4]   2> 26051 T18 oascc.SolrZkClient.makePath makePath: /live_nodes
   [junit4]   2> 26053 T18 oasc.ZkController.createEphemeralLiveNode Register node as live in ZooKeeper:/live_nodes/127.0.0.1:15662_z_%2Fo
   [junit4]   2> 26064 T18 oascc.SolrZkClient.makePath makePath: /live_nodes/127.0.0.1:15662_z_%2Fo
   [junit4]   2> 26070 T18 oascc.SolrZkClient.makePath makePath: /overseer_elect
   [junit4]   2> 26073 T18 oascc.SolrZkClient.makePath makePath: /overseer_elect/election
   [junit4]   2> 26076 T18 oasc.Overseer.close Overseer (id=null) closing
   [junit4]   2> 26107 T18 oasc.OverseerElectionContext.runLeaderProcess I am going to be the leader 127.0.0.1:15662_z_%2Fo
   [junit4]   2> 26108 T18 oascc.SolrZkClient.makePath makePath: /overseer_elect/leader
   [junit4]   2> 26111 T18 oasc.Overseer.start Overseer (id=93411220467089411-127.0.0.1:15662_z_%2Fo-n_0000000000) starting
   [junit4]   2> 26140 T18 oascc.SolrZkClient.makePath makePath: /overseer/queue-work
   [junit4]   2> 26186 T18 oasc.OverseerAutoReplicaFailoverThread.<init> Starting OverseerAutoReplicaFailoverThread autoReplicaFailoverWorkLoopDelay=10000 autoReplicaFailoverWaitAfterExpiration=30000 autoReplicaFailoverBadNodeExpiration=60000
   [junit4]   2> 26220 T47 oasc.OverseerCollectionProcessor.run Process current queue of collection creations
   [junit4]   2> 26221 T18 oascc.SolrZkClient.makePath makePath: /clusterstate.json
   [junit4]   2> 26224 T18 oascc.SolrZkClient.makePath makePath: /aliases.json
   [junit4]   2> 26226 T18 oascc.ZkStateReader.createClusterStateWatchersAndUpdate Updating cluster state from ZooKeeper... 
   [junit4]   2> 26265 T46 oasc.Overseer$ClusterStateUpdater.run Starting to work on the main queue
   [junit4]   2> 26270 T18 oasc.CorePropertiesLocator.discover Looking for core definitions underneath /usr/home/jenkins/jenkins-slave/workspace/Lucene-Solr-Tests-5.x-Java7/solr/build/solr-core/test/J0/temp/solr.cloud.LeaderFailoverAfterPartitionTest 6DEB3E57C8B66EF1-001/control-001/cores
   [junit4]   2> 26290 T18 oasc.CorePropertiesLocator.discoverUnder Found core collection1 in /usr/home/jenkins/jenkins-slave/workspace/Lucene-Solr-Tests-5.x-Java7/solr/build/solr-core/test/J0/temp/solr.cloud.LeaderFailoverAfterPartitionTest 6DEB3E57C8B66EF1-001/control-001/cores/collection1/
   [junit4]   2> 26291 T18 oasc.CorePropertiesLocator.discover Found 1 core definitions
   [junit4]   2> 26292 T49 oasc.ZkController.publish publishing core=collection1 state=down collection=control_collection
   [junit4]   2> 26293 T49 oasc.ZkController.publish numShards not found on descriptor - reading it from system property
   [junit4]   2> 26314 T45 oasc.DistributedQueue$LatchWatcher.process NodeChildrenChanged fired on path /overseer/queue state SyncConnected
   [junit4]   2> 26314 T49 oasc.ZkController.waitForCoreNodeName look for our core node name
   [junit4]   2> 26325 T46 oasc.Overseer$ClusterStateUpdater.run processMessage: queueSize: 1, message = {
   [junit4]   2> 	  "base_url":"http://127.0.0.1:15662/z_/o",
   [junit4]   2> 	  "numShards":"1",
   [junit4]   2> 	  "shard":null,
   [junit4]   2> 	  "node_name":"127.0.0.1:15662_z_%2Fo",
   [junit4]   2> 	  "state":"down",
   [junit4]   2> 	  "operation":"state",
   [junit4]   2> 	  "collection":"control_collection",
   [junit4]   2> 	  "roles":null,
   [junit4]   2> 	  "core":"collection1"} current state version: 0
   [junit4]   2> 26406 T46 oasco.ReplicaMutator.updateState Update state numShards=1 message={
   [junit4]   2> 	  "base_url":"http://127.0.0.1:15662/z_/o",
   [junit4]   2> 	  "numShards":"1",
   [junit4]   2> 	  "shard":null,
   [junit4]   2> 	  "node_name":"127.0.0.1:15662_z_%2Fo",
   [junit4]   2> 	  "state":"down",
   [junit4]   2> 	  "operation":"state",
   [junit4]   2> 	  "collection":"control_collection",
   [junit4]   2> 	  "roles":null,
   [junit4]   2> 	  "core":"collection1"}
   [junit4]   2> 26416 T46 oasco.ClusterStateMutator.createCollection building a new cName: control_collection
   [junit4]   2> 26483 T46 oasco.ReplicaMutator.updateState Assigning new node to shard shard=shard1
   [junit4]   2> 26504 T45 oascc.ZkStateReader$2.process A cluster state change: WatchedEvent state:SyncConnected type:NodeDataChanged path:/clusterstate.json, has occurred - updating... (live nodes size: 1)
   [junit4]   2> 27316 T49 oasc.ZkController.waitForShardId waiting to find shard id in clusterstate for collection1
   [junit4]   2> 27316 T49 oasc.ZkController.createCollectionZkNode Check for collection zkNode:control_collection
   [junit4]   2> 27317 T49 oasc.ZkController.createCollectionZkNode Collection zkNode exists
   [junit4]   2> 27318 T49 oascc.ZkStateReader.readConfigName Load collection config from:/collections/control_collection
   [junit4]   2> 27320 T49 oascc.ZkStateReader.readConfigName path=/collections/control_collection configName=conf1 specified config exists in ZooKeeper
   [junit4]   2> 27320 T49 oasc.SolrResourceLoader.<init> new SolrResourceLoader for directory: '/usr/home/jenkins/jenkins-slave/workspace/Lucene-Solr-Tests-5.x-Java7/solr/build/solr-core/test/J0/temp/solr.cloud.LeaderFailoverAfterPartitionTest 6DEB3E57C8B66EF1-001/control-001/cores/collection1/'
   [junit4]   2> 27362 T49 oasc.ZkController.watchZKConfDir watch zkdir /configs/conf1
   [junit4]   2> 27383 T49 oasc.Config.<init> loaded config solrconfig.xml with version 0 
   [junit4]   2> 27420 T49 oasc.SolrConfig.refreshRequestParams current version of requestparams : -1
   [junit4]   2> 27478 T49 oasc.SolrConfig.<init> Using Lucene MatchVersion: 5.1.0
   [junit4]   2> 27548 T49 oasc.SolrConfig.<init> Loaded SolrConfig: solrconfig.xml
   [junit4]   2> 27550 T49 oass.IndexSchema.readSchema Reading Solr Schema from /configs/conf1/schema.xml
   [junit4]   2> 27633 T49 oass.IndexSchema.readSchema [collection1] Schema name=test
   [junit4]   2> 28084 T49 oass.OpenExchangeRatesOrgProvider.init Initialized with rates=open-exchange-rates.json, refreshInterval=1440.
   [junit4]   2> 28103 T49 oass.IndexSchema.readSchema default search field in schema is text
   [junit4]   2> 28106 T49 oass.IndexSchema.readSchema unique key field: id
   [junit4]   2> 28138 T49 oass.FileExchangeRateProvider.reload Reloading exchange rates from file currency.xml
   [junit4]   2> 28145 T49 oass.FileExchangeRateProvider.reload Reloading exchange rates from file currency.xml
   [junit4]   2> 28151 T49 oass.OpenExchangeRatesOrgProvider.reload Reloading exchange rates from open-exchange-rates.json
   [junit4]   2> 28153 T49 oass.OpenExchangeRatesOrgProvider$OpenExchangeRates.<init> WARN Unknown key IMPORTANT NOTE
   [junit4]   2> 28153 T49 oass.OpenExchangeRatesOrgProvider$OpenExchangeRates.<init> WARN Expected key, got STRING
   [junit4]   2> 28153 T49 oass.OpenExchangeRatesOrgProvider.reload Reloading exchange rates from open-exchange-rates.json
   [junit4]   2> 28155 T49 oass.OpenExchangeRatesOrgProvider$OpenExchangeRates.<init> WARN Unknown key IMPORTANT NOTE
   [junit4]   2> 28155 T49 oass.OpenExchangeRatesOrgProvider$OpenExchangeRates.<init> WARN Expected key, got STRING
   [junit4]   2> 28156 T49 oasc.CoreContainer.create Creating SolrCore 'collection1' using configuration from collection control_collection
   [junit4]   2> 28156 T49 oasc.SolrCore.initDirectoryFactory org.apache.solr.core.MockDirectoryFactory
   [junit4]   2> 28157 T49 oasc.SolrCore.<init> [collection1] Opening new SolrCore at /usr/home/jenkins/jenkins-slave/workspace/Lucene-Solr-Tests-5.x-Java7/solr/build/solr-core/test/J0/temp/solr.cloud.LeaderFailoverAfterPartitionTest 6DEB3E57C8B66EF1-001/control-001/cores/collection1/, dataDir=/usr/home/jenkins/jenkins-slave/workspace/Lucene-Solr-Tests-5.x-Java7/solr/build/solr-core/test/J0/temp/solr.cloud.LeaderFailoverAfterPartitionTest 6DEB3E57C8B66EF1-001/tempDir-001/control/data/
   [junit4]   2> 28172 T49 oasc.JmxMonitoredMap.<init> JMX monitoring is enabled. Adding Solr mbeans to JMX Server: com.sun.jmx.mbeanserver.JmxMBeanServer@3acfa8c4
   [junit4]   2> 28329 T49 oasc.CachingDirectoryFactory.get return new directory for /usr/home/jenkins/jenkins-slave/workspace/Lucene-Solr-Tests-5.x-Java7/solr/build/solr-core/test/J0/temp/solr.cloud.LeaderFailoverAfterPartitionTest 6DEB3E57C8B66EF1-001/tempDir-001/control/data
   [junit4]   2> 28329 T49 oasc.SolrCore.getNewIndexDir New index directory detected: old=null new=/usr/home/jenkins/jenkins-slave/workspace/Lucene-Solr-Tests-5.x-Java7/solr/build/solr-core/test/J0/temp/solr.cloud.LeaderFailoverAfterPartitionTest 6DEB3E57C8B66EF1-001/tempDir-001/control/data/index/
   [junit4]   2> 28330 T49 oasc.SolrCore.initIndex WARN [collection1] Solr index directory '/usr/home/jenkins/jenkins-slave/workspace/Lucene-Solr-Tests-5.x-Java7/solr/build/solr-core/test/J0/temp/solr.cloud.LeaderFailoverAfterPartitionTest 6DEB3E57C8B66EF1-001/tempDir-001/control/data/index' doesn't exist. Creating new index...
   [junit4]   2> 28330 T49 oasc.CachingDirectoryFactory.get return new directory for /usr/home/jenkins/jenkins-slave/workspace/Lucene-Solr-Tests-5.x-Java7/solr/build/solr-core/test/J0/temp/solr.cloud.LeaderFailoverAfterPartitionTest 6DEB3E57C8B66EF1-001/tempDir-001/control/data/index
   [junit4]   2> 28331 T49 oasu.RandomMergePolicy.<init> RandomMergePolicy wrapping class org.apache.lucene.index.LogDocMergePolicy: [LogDocMergePolicy: minMergeSize=1000, mergeFactor=28, maxMergeSize=9223372036854775807, maxMergeSizeForForcedMerge=9223372036854775807, calibrateSizeByDeletes=true, maxMergeDocs=2147483647, maxCFSSegmentSizeMB=8.796093022207999E12, noCFSRatio=0.5029485531929246]
   [junit4]   2> 28341 T49 oasc.SolrDeletionPolicy.onCommit SolrDeletionPolicy.onCommit: commits: num=1
   [junit4]   2> 		commit{dir=MockDirectoryWrapper(RAMDirectory@66fc92f lockFactory=org.apache.lucene.store.SingleInstanceLockFactory@15012ff6),segFN=segments_1,generation=1}
   [junit4]   2> 28341 T49 oasc.SolrDeletionPolicy.updateCommits newest commit generation = 1
   [junit4]   2> 28350 T49 oasup.UpdateRequestProcessorChain.init creating updateRequestProcessorChain "nodistrib"
   [junit4]   2> 28549 T49 oasup.UpdateRequestProcessorChain.init creating updateRequestProcessorChain "dedupe"
   [junit4]   2> 28568 T49 oasup.UpdateRequestProcessorChain.init inserting DistributedUpdateProcessorFactory into updateRequestProcessorChain "dedupe"
   [junit4]   2> 28568 T49 oasup.UpdateRequestProcessorChain.init creating updateRequestProcessorChain "stored_sig"
   [junit4]   2> 28569 T49 oasup.UpdateRequestProcessorChain.init inserting DistributedUpdateProcessorFactory into updateRequestProcessorChain "stored_sig"
   [junit4]   2> 28569 T49 oasup.UpdateRequestProcessorChain.init creating updateRequestProcessorChain "distrib-dup-test-chain-explicit"
   [junit4]   2> 28810 T49 oasup.UpdateRequestProcessorChain.init creating updateRequestProcessorChain "distrib-dup-test-chain-implicit"
   [junit4]   2> 28811 T49 oasup.UpdateRequestProcessorChain.init inserting DistributedUpdateProcessorFactory into updateRequestProcessorChain "distrib-dup-test-chain-implicit"
   [junit4]   2> 28811 T49 oasc.SolrCore.loadUpdateProcessorChains no updateRequestProcessorChain defined as default, creating implicit default
   [junit4]   2> 28823 T49 oasc.RequestHandlers.initHandlersFromConfig created /update: org.apache.solr.handler.UpdateRequestHandler
   [junit4]   2> 28824 T49 oasc.RequestHandlers.initHandlersFromConfig created /update/json: org.apache.solr.handler.UpdateRequestHandler
   [junit4]   2> 28825 T49 oasc.RequestHandlers.initHandlersFromConfig created /update/csv: org.apache.solr.handler.UpdateRequestHandler
   [junit4]   2> 28827 T49 oasc.RequestHandlers.initHandlersFromConfig created /update/json/docs: org.apache.solr.handler.UpdateRequestHandler
   [junit4]   2> 28828 T49 oasc.RequestHandlers.initHandlersFromConfig created /config: org.apache.solr.handler.SolrConfigHandler
   [junit4]   2> 28829 T49 oasc.RequestHandlers.initHandlersFromConfig created /schema: org.apache.solr.handler.SchemaHandler
   [junit4]   2> 28830 T49 oasc.RequestHandlers.initHandlersFromConfig created /replication: org.apache.solr.handler.ReplicationHandler
   [junit4]   2> 28832 T49 oasc.RequestHandlers.initHandlersFromConfig created /get: org.apache.solr.handler.RealTimeGetHandler
   [junit4]   2> 28833 T49 oasc.RequestHandlers.initHandlersFromConfig created /admin/luke: org.apache.solr.handler.admin.LukeRequestHandler
   [junit4]   2> 28834 T49 oasc.RequestHandlers.initHandlersFromConfig created /admin/system: org.apache.solr.handler.admin.SystemInfoHandler
   [junit4]   2> 28836 T49 oasc.RequestHandlers.initHandlersFromConfig created /admin/mbeans: org.apache.solr.handler.admin.SolrInfoMBeanHandler
   [junit4]   2> 28837 T49 oasc.RequestHandlers.initHandlersFromConfig created /admin/plugins: org.apache.solr.handler.admin.PluginInfoHandler
   [junit4]   2> 28838 T49 oasc.RequestHandlers.initHandlersFromConfig created /admin/threads: org.apache.solr.handler.admin.ThreadDumpHandler
   [junit4]   2> 28839 T49 oasc.RequestHandlers.initHandlersFromConfig created /admin/properties: org.apache.solr.handler.admin.PropertiesRequestHandler
   [junit4]   2> 28841 T49 oasc.RequestHandlers.initHandlersFromConfig created /admin/logging: org.apache.solr.handler.admin.LoggingHandler
   [junit4]   2> 28889 T49 oasc.RequestHandlers.initHandlersFromConfig created /admin/file: solr.admin.ShowFileRequestHandler
   [junit4]   2> 28890 T49 oasc.RequestHandlers.initHandlersFromConfig created /admin/ping: org.apache.solr.handler.PingRequestHandler
   [junit4]   2> 28891 T49 oasc.RequestHandlers.initHandlersFromConfig created standard: solr.StandardRequestHandler
   [junit4]   2> 28922 T49 oashl.XMLLoader.init xsltCacheLifetimeSeconds=60
   [junit4]   2> 28924 T49 oashl.XMLLoader.init xsltCacheLifetimeSeconds=60
   [junit4]   2> 28926 T49 oashl.XMLLoader.init xsltCacheLifetimeSeconds=60
   [junit4]   2> 28928 T49 oashl.XMLLoader.init xsltCacheLifetimeSeconds=60
   [junit4]   2> 28939 T49 oasc.SolrCore.initStatsCache Using default statsCache cache: org.apache.solr.search.stats.LocalStatsCache
   [junit4]   2> 29021 T49 oasu.UpdateHandler.<init> Using UpdateLog implementation: org.apache.solr.update.UpdateLog
   [junit4]   2> 29066 T49 oasu.CommitTracker.<init> Hard AutoCommit: disabled
   [junit4]   2> 29067 T49 oasu.CommitTracker.<init> Soft AutoCommit: disabled
   [junit4]   2> 29068 T49 oasu.RandomMergePolicy.<init> RandomMergePolicy wrapping class org.apache.lucene.index.TieredMergePolicy: [TieredMergePolicy: maxMergeAtOnce=27, maxMergeAtOnceExplicit=40, maxMergedSegmentMB=79.8056640625, floorSegmentMB=1.560546875, forceMergeDeletesPctAllowed=27.678982223179375, segmentsPerTier=23.0, maxCFSSegmentSizeMB=8.796093022207999E12, noCFSRatio=0.8466126336761765
   [junit4]   2> 29069 T49 oasc.SolrDeletionPolicy.onInit SolrDeletionPolicy.onInit: commits: num=1
   [junit4]   2> 		commit{dir=MockDirectoryWrapper(RAMDirectory@66fc92f lockFactory=org.apache.lucene.store.SingleInstanceLockFactory@15012ff6),segFN=segments_1,generation=1}
   [junit4]   2> 29070 T49 oasc.SolrDeletionPolicy.updateCommits newest commit generation = 1
   [junit4]   2> 29070 T49 oass.SolrIndexSearcher.<init> Opening Searcher@752585b0[collection1] main
   [junit4]   2> 29071 T49 oascc.ZkStateReader.readConfigName Load collection config from:/collections/control_collection
   [junit4]   2> 29073 T49 oascc.ZkStateReader.readConfigName path=/collections/control_collection configName=conf1 specified config exists in ZooKeeper
   [junit4]   2> 29073 T49 oasr.ManagedResourceStorage.newStorageIO Setting up ZooKeeper-based storage for the RestManager with znodeBase: /configs/conf1
   [junit4]   2> 29090 T49 oasr.ManagedResourceStorage$ZooKeeperStorageIO.configure Configured ZooKeeperStorageIO with znodeBase: /configs/conf1
   [junit4]   2> 29091 T49 oasr.RestManager.init Initializing RestManager with initArgs: {}
   [junit4]   2> 29091 T49 oasr.ManagedResourceStorage.load Reading _rest_managed.json using ZooKeeperStorageIO:path=/configs/conf1
   [junit4]   2> 29092 T49 oasr.ManagedResourceStorage$ZooKeeperStorageIO.openInputStream No data found for znode /configs/conf1/_rest_managed.json
   [junit4]   2> 29093 T49 oasr.ManagedResourceStorage.load Loaded null at path _rest_managed.json using ZooKeeperStorageIO:path=/configs/conf1
   [junit4]   2> 29093 T49 oasr.RestManager.init Initializing 0 registered ManagedResources
   [junit4]   2> 29137 T49 oash.ReplicationHandler.inform Commits will be reserved for  10000
   [junit4]   2> 29140 T50 oasc.SolrCore.registerSearcher [collection1] Registered new searcher Searcher@752585b0[collection1] main{ExitableDirectoryReader(UninvertingDirectoryReader())}
   [junit4]   2> 29150 T49 oasc.CoreContainer.registerCore registering core: collection1
   [junit4]   2> 29151 T53 oasc.ZkController.register Register replica - core:collection1 address:http://127.0.0.1:15662/z_/o collection:control_collection shard:shard1
   [junit4]   2> 29152 T18 oass.SolrDispatchFilter.init user.dir=/usr/home/jenkins/jenkins-slave/workspace/Lucene-Solr-Tests-5.x-Java7/solr/build/solr-core/test/J0
   [junit4]   2> 29153 T18 oass.SolrDispatchFilter.init SolrDispatchFilter.init() done
   [junit4]   2> 29200 T53 oascc.SolrZkClient.makePath makePath: /collections/control_collection/leader_elect/shard1/election
   [junit4]   2> 29211 T53 oasc.ShardLeaderElectionContext.runLeaderProcess Running the leader process for shard shard1
   [junit4]   2> 29215 T45 oasc.DistributedQueue$LatchWatcher.process NodeChildrenChanged fired on path /overseer/queue state SyncConnected
   [junit4]   2> 29216 T53 oasc.ShardLeaderElectionContext.waitForReplicasToComeUp Enough replicas found to continue.
   [junit4]   2> 29217 T53 oasc.ShardLeaderElectionContext.runLeaderProcess I may be the new leader - try and sync
   [junit4]   2> 29217 T46 oasc.Overseer$ClusterStateUpdater.run processMessage: queueSize: 1, message = {
   [junit4]   2> 	  "operation":"leader",
   [junit4]   2> 	  "shard":"shard1",
   [junit4]   2> 	  "collection":"control_collection"} current state version: 1
   [junit4]   2> ASYNC  NEW_CORE C0 name=collection1 org.apache.solr.core.SolrCore@68ea3e16 url=http://127.0.0.1:15662/z_/o/collection1 node=127.0.0.1:15662_z_%2Fo C0_STATE=coll:control_collection core:collection1 props:{base_url=http://127.0.0.1:15662/z_/o, node_name=127.0.0.1:15662_z_%2Fo, state=down, core=collection1}
   [junit4]   2> 29231 T53 C0 P15662 oasc.SyncStrategy.sync Sync replicas to http://127.0.0.1:15662/z_/o/collection1/
   [junit4]   2> 29238 T45 oascc.ZkStateReader$2.process A cluster state change: WatchedEvent state:SyncConnected type:NodeDataChanged path:/clusterstate.json, has occurred - updating... (live nodes size: 1)
   [junit4]   2> 29241 T53 C0 P15662 oasc.SyncStrategy.syncReplicas Sync Success - now sync replicas to me
   [junit4]   2> 29242 T53 C0 P15662 oasc.SyncStrategy.syncToMe http://127.0.0.1:15662/z_/o/collection1/ has no replicas
   [junit4]   2> 29243 T53 oasc.ShardLeaderElectionContext.runLeaderProcess I am the new leader: http://127.0.0.1:15662/z_/o/collection1/ shard1
   [junit4]   2> 29261 T53 oascc.SolrZkClient.makePath makePath: /collections/control_collection/leaders/shard1
   [junit4]   2> 29269 T45 oasc.DistributedQueue$LatchWatcher.process NodeChildrenChanged fired on path /overseer/queue state SyncConnected
   [junit4]   2> 29272 T46 oasc.Overseer$ClusterStateUpdater.run processMessage: queueSize: 1, message = {
   [junit4]   2> 	  "operation":"leader",
   [junit4]   2> 	  "shard":"shard1",
   [junit4]   2> 	  "collection":"control_collection",
   [junit4]   2> 	  "base_url":"http://127.0.0.1:15662/z_/o",
   [junit4]   2> 	  "core":"collection1",
   [junit4]   2> 	  "state":"active"} current state version: 2
   [junit4]   2> 29339 T18 oascc.SolrZkClient.createZkCredentialsToAddAutomatically Using default ZkCredentialsProvider
   [junit4]   2> 29341 T18 oascc.ConnectionManager.waitForConnected Waiting for client to connect to ZooKeeper
   [junit4]   2> 29343 T57 oascc.ConnectionManager.process Watcher org.apache.solr.common.cloud.ConnectionManager@21661db3 name:ZooKeeperConnection Watcher:127.0.0.1:28307/solr got event WatchedEvent state:SyncConnected type:None path:null path:null type:None
   [junit4]   2> 29344 T18 oascc.ConnectionManager.waitForConnected Client is connected to ZooKeeper
   [junit4]   2> 29345 T18 oascc.SolrZkClient.createZkACLProvider Using default ZkACLProvider
   [junit4]   2> 29347 T18 oascc.ZkStateReader.createClusterStateWatchersAndUpdate Updating cluster state from ZooKeeper... 
   [junit4]   2> 29356 T18 oasc.ChaosMonkey.monkeyLog monkey: init - expire sessions:false cause connection loss:false
   [junit4]   2> 29357 T18 oasc.AbstractFullDistribZkTestBase.createJettys Creating collection1 with stateFormat=2
   [junit4]   2> 29357 T18 oascc.SolrZkClient.createZkCredentialsToAddAutomatically Using default ZkCredentialsProvider
   [junit4]   2> 29358 T18 oascc.ConnectionManager.waitForConnected Waiting for client to connect to ZooKeeper
   [junit4]   2> 29360 T60 oascc.ConnectionManager.process Watcher org.apache.solr.common.cloud.ConnectionManager@4adf0baa name:ZooKeeperConnection Watcher:127.0.0.1:28307/solr got event WatchedEvent state:SyncConnected type:None path:null path:null type:None
   [junit4]   2> 29361 T18 oascc.ConnectionManager.waitForConnected Client is connected to ZooKeeper
   [junit4]   2> 29362 T18 oascc.SolrZkClient.createZkACLProvider Using default ZkACLProvider
   [junit4]   2> 29366 T45 oasc.DistributedQueue$LatchWatcher.process NodeChildrenChanged fired on path /overseer/queue state SyncConnected
   [junit4]   2> 29368 T46 oasc.Overseer$ClusterStateUpdater.run processMessage: queueSize: 1, message = {
   [junit4]   2> 	  "operation":"create",
   [junit4]   2> 	  "name":"collection1",
   [junit4]   2> 	  "numShards":"2",
   [junit4]   2> 	  "stateFormat":"2"} current state version: 2
   [junit4]   2> 29369 T46 oasco.ClusterStateMutator.createCollection building a new cName: collection1
   [junit4]   2> 29371 T57 oascc.ZkStateReader$2.process A cluster state change: WatchedEvent state:SyncConnected type:NodeDataChanged path:/clusterstate.json, has occurred - updating... (live nodes size: 1)
   [junit4]   2> 29371 T45 oascc.ZkStateReader$2.process A cluster state change: WatchedEvent state:SyncConnected type:NodeDataChanged path:/clusterstate.json, has occurred - updating... (live nodes size: 1)
   [junit4]   2> 29424 T53 oasc.ZkController.register We are http://127.0.0.1:15662/z_/o/collection1/ and leader is http://127.0.0.1:15662/z_/o/collection1/
   [junit4]   2> 29433 T53 oasc.ZkController.register No LogReplay needed for core=collection1 baseURL=http://127.0.0.1:15662/z_/o
   [junit4]   2> 29434 T53 oasc.ZkController.checkRecovery I am the leader, no recovery necessary
   [junit4]   2> 29434 T53 oasc.ZkController.publish publishing core=collection1 state=active collection=control_collection
   [junit4]   2> 29434 T53 oasc.ZkController.publish numShards not found on descriptor - reading it from system property
   [junit4]   2> 29436 T45 oasc.DistributedQueue$LatchWatcher.process NodeChildrenChanged fired on path /overseer/queue state SyncConnected
   [junit4]   2> 29439 T46 oasc.Overseer$ClusterStateUpdater.run processMessage: queueSize: 1, message = {
   [junit4]   2> 	  "base_url":"http://127.0.0.1:15662/z_/o",
   [junit4]   2> 	  "core_node_name":"core_node1",
   [junit4]   2> 	  "numShards":"2",
   [junit4]   2> 	  "shard":"shard1",
   [junit4]   2> 	  "node_name":"127.0.0.1:15662_z_%2Fo",
   [junit4]   2> 	  "state":"active",
   [junit4]   2> 	  "operation":"state",
   [junit4]   2> 	  "collection":"control_collection",
   [junit4]   2> 	  "roles":null,
   [junit4]   2> 	  "core":"collection1"} current state version: 3
   [junit4]   2> 29440 T46 oasco.ReplicaMutator.updateState Update state numShards=2 message={
   [junit4]   2> 	  "base_url":"http://127.0.0.1:15662/z_/o",
   [junit4]   2> 	  "core_node_name":"core_node1",
   [junit4]   2> 	  "numShards":"2",
   [junit4]   2> 	  "shard":"shard1",
   [junit4]   2> 	  "node_name":"127.0.0.1:15662_z_%2Fo",
   [junit4]   2> 	  "state":"active",
   [junit4]   2> 	  "operation":"state",
   [junit4]   2> 	  "collection":"control_collection",
   [junit4]   2> 	  "roles":null,
   [junit4]   2> 	  "core":"collection1"}
   [junit4]   2> 29441 T46 oasco.ZkStateWriter.writePendingUpdates going to create_collection /collections/collection1/state.json
   [junit4]   2> 29443 T45 oascc.ZkStateReader$2.process A cluster state change: WatchedEvent state:SyncConnected type:NodeDataChanged path:/clusterstate.json, has occurred - updating... (live nodes size: 1)
   [junit4]   2> 29443 T57 oascc.ZkStateReader$2.process A cluster state change: WatchedEvent state:SyncConnected type:NodeDataChanged path:/clusterstate.json, has occurred - updating... (live nodes size: 1)
   [junit4]   2> 29551 T57 oascc.ZkStateReader$2.process A cluster state change: WatchedEvent state:SyncConnected type:NodeDataChanged path:/clusterstate.json, has occurred - updating... (live nodes size: 1)
   [junit4]   2> 29551 T45 oascc.ZkStateReader$2.process A cluster state change: WatchedEvent state:SyncConnected type:NodeDataChanged path:/clusterstate.json, has occurred - updating... (live nodes size: 1)
   [junit4]   2> 31075 T18 oas.SolrTestCaseJ4.writeCoreProperties Writing core.properties file to /usr/home/jenkins/jenkins-slave/workspace/Lucene-Solr-Tests-5.x-Java7/solr/build/solr-core/test/J0/temp/solr.cloud.LeaderFailoverAfterPartitionTest 6DEB3E57C8B66EF1-001/shard-1-001/cores/collection1
   [junit4]   2> 31079 T18 oasc.AbstractFullDistribZkTestBase.createJettys create jetty 1
   [junit4]   2> 31080 T18 oejs.Server.doStart jetty-8.1.10.v20130312
   [junit4]   2> 31082 T18 oejs.AbstractConnector.doStart Started SocketConnector@127.0.0.1:52109
   [junit4]   2> 31083 T18 oass.SolrDispatchFilter.init SolrDispatchFilter.init()sun.misc.Launcher$AppClassLoader@57bd06bf
   [junit4]   2> 31084 T18 oasc.SolrResourceLoader.locateSolrHome JNDI not configured for solr (NoInitialContextEx)
   [junit4]   2> 31084 T18 oasc.SolrResourceLoader.locateSolrHome using system property solr.solr.home: /usr/home/jenkins/jenkins-slave/workspace/Lucene-Solr-Tests-5.x-Java7/solr/build/solr-core/test/J0/temp/solr.cloud.LeaderFailoverAfterPartitionTest 6DEB3E57C8B66EF1-001/shard-1-001
   [junit4]   2> 31085 T18 oasc.SolrResourceLoader.<init> new SolrResourceLoader for directory: '/usr/home/jenkins/jenkins-slave/workspace/Lucene-Solr-Tests-5.x-Java7/solr/build/solr-core/test/J0/temp/solr.cloud.LeaderFailoverAfterPartitionTest 6DEB3E57C8B66EF1-001/shard-1-001/'
   [junit4]   2> 31137 T18 oasc.SolrXmlConfig.fromFile Loading container configuration from /usr/home/jenkins/jenkins-slave/workspace/Lucene-Solr-Tests-5.x-Java7/solr/build/solr-core/test/J0/temp/solr.cloud.LeaderFailoverAfterPartitionTest 6DEB3E57C8B66EF1-001/shard-1-001/solr.xml
   [junit4]   2> 31208 T18 oasc.CorePropertiesLocator.<init> Config-defined core root directory: /usr/home/jenkins/jenkins-slave/workspace/Lucene-Solr-Tests-5.x-Java7/solr/build/solr-core/test/J0/temp/solr.cloud.LeaderFailoverAfterPartitionTest 6DEB3E57C8B66EF1-001/shard-1-001/cores
   [junit4]   2> 31209 T18 oasc.CoreContainer.<init> New CoreContainer 253325886
   [junit4]   2> 31210 T18 oasc.CoreContainer.load Loading cores into CoreContainer [instanceDir=/usr/home/jenkins/jenkins-slave/workspace/Lucene-Solr-Tests-5.x-Java7/solr/build/solr-core/test/J0/temp/solr.cloud.LeaderFailoverAfterPartitionTest 6DEB3E57C8B66EF1-001/shard-1-001/]
   [junit4]   2> 31210 T18 oasc.CoreContainer.load loading shared library: /usr/home/jenkins/jenkins-slave/workspace/Lucene-Solr-Tests-5.x-Java7/solr/build/solr-core/test/J0/temp/solr.cloud.LeaderFailoverAfterPartitionTest 6DEB3E57C8B66EF1-001/shard-1-001/lib
   [junit4]   2> 31211 T18 oasc.SolrResourceLoader.addToClassLoader WARN Can't find (or read) directory to add to classloader: lib (resolved as: /usr/home/jenkins/jenkins-slave/workspace/Lucene-Solr-Tests-5.x-Java7/solr/build/solr-core/test/J0/temp/solr.cloud.LeaderFailoverAfterPartitionTest 6DEB3E57C8B66EF1-001/shard-1-001/lib).
   [junit4]   2> 31224 T18 oashc.HttpShardHandlerFactory.getParameter Setting socketTimeout to: 90000
   [junit4]   2> 31224 T18 oashc.HttpShardHandlerFactory.getParameter Setting urlScheme to: 
   [junit4]   2> 31225 T18 oashc.HttpShardHandlerFactory.getParameter Setting connTimeout to: 15000
   [junit4]   2> 31225 T18 oashc.HttpShardHandlerFactory.getParameter Setting maxConnectionsPerHost to: 20
   [junit4]   2> 31226 T18 oashc.HttpShardHandlerFactory.getParameter Setting maxConnections to: 10000
   [junit4]   2> 31226 T18 oashc.HttpShardHandlerFactory.getParameter Setting corePoolSize to: 0
   [junit4]   2> 31227 T18 oashc.HttpShardHandlerFactory.getParameter Setting maximumPoolSize to: 2147483647
   [junit4]   2> 31227 T18 oashc.HttpShardHandlerFactory.getParameter Setting maxThreadIdleTime to: 5
   [junit4]   2> 31228 T18 oashc.HttpShardHandlerFactory.getParameter Setting sizeOfQueue to: -1
   [junit4]   2> 31228 T18 oashc.HttpShardHandlerFactory.getParameter Setting fairnessPolicy to: false
   [junit4]   2> 31228 T18 oashc.HttpShardHandlerFactory.getParameter Setting useRetries to: false
   [junit4]   2> 31229 T18 oasu.UpdateShardHandler.<init> Creating UpdateShardHandler HTTP client with params: socketTimeout=340000&connTimeout=45000&retry=true
   [junit4]   2> 31230 T18 oasl.LogWatcher.createWatcher SLF4J impl is org.slf4j.impl.Log4jLoggerFactory
   [junit4]   2> 31230 T18 oasl.LogWatcher.newRegisteredLogWatcher Registering Log Listener [Log4j (org.slf4j.impl.Log4jLoggerFactory)]
   [junit4]   2> 31231 T18 oasc.CoreContainer.load Node Name: 127.0.0.1
   [junit4]   2> 31231 T18 oasc.ZkContainer.initZooKeeper Zookeeper client=127.0.0.1:28307/solr
   [junit4]   2> 31232 T18 oasc.ZkController.checkChrootPath zkHost includes chroot
   [junit4]   2> 31232 T18 oascc.SolrZkClient.createZkCredentialsToAddAutomatically Using default ZkCredentialsProvider
   [junit4]   2> 31233 T18 oascc.ConnectionManager.waitForConnected Waiting for client to connect to ZooKeeper
   [junit4]   2> 31236 T72 oascc.ConnectionManager.process Watcher org.apache.solr.common.cloud.ConnectionManager@594cf61d name:ZooKeeperConnection Watcher:127.0.0.1:28307 got event WatchedEvent state:SyncConnected type:None path:null path:null type:None
   [junit4]   2> 31236 T18 oascc.ConnectionManager.waitForConnected Client is connected to ZooKeeper
   [junit4]   2> 31237 T18 oascc.SolrZkClient.createZkACLProvider Using default ZkACLProvider
   [junit4]   2> 31240 T18 oascc.ConnectionManager.waitForConnected Waiting for client to connect to ZooKeeper
   [junit4]   2> 31242 T75 oascc.ConnectionManager.process Watcher org.apache.solr.common.cloud.ConnectionManager@188e7851 name:ZooKeeperConnection Watcher:127.0.0.1:28307/solr got event WatchedEvent state:SyncConnected type:None path:null path:null type:None
   [junit4]   2> 31242 T18 oascc.ConnectionManager.waitForConnected Client is connected to ZooKeeper
   [junit4]   2> 31252 T18 oascc.ZkStateReader.createClusterStateWatchersAndUpdate Updating cluster state from ZooKeeper... 
   [junit4]   2> 32261 T18 oasc.ZkController.createEphemeralLiveNode Register node as live in ZooKeeper:/live_nodes/127.0.0.1:10363_z_%2Fo
   [junit4]   2> 32263 T18 oascc.SolrZkClient.makePath makePath: /live_nodes/127.0.0.1:10363_z_%2Fo
   [junit4]   2> 32268 T18 oasc.Overseer.close Overseer (id=null) closing
   [junit4]   2> 32277 T18 oasc.CorePropertiesLocator.discover Looking for core definitions underneath /usr/home/jenkins/jenkins-slave/workspace/Lucene-Solr-Tests-5.x-Java7/solr/build/solr-core/test/J0/temp/solr.cloud.LeaderFailoverAfterPartitionTest 6DEB3E57C8B66EF1-001/shard-1-001/cores
   [junit4]   2> 32280 T18 oasc.CorePropertiesLocator.discoverUnder Found core collection1 in /usr/home/jenkins/jenkins-slave/workspace/Lucene-Solr-Tests-5.x-Java7/solr/build/solr-core/test/J0/temp/solr.cloud.LeaderFailoverAfterPartitionTest 6DEB3E57C8B66EF1-001/shard-1-001/cores/collection1/
   [junit4]   2> 32280 T18 oasc.CorePropertiesLocator.discover Found 1 core definitions
   [junit4]   2> 32284 T76 oasc.ZkController.publish publishing core=collection1 state=down collection=collection1
   [junit4]   2> 32285 T76 oasc.ZkController.publish numShards not found on descriptor - reading it from system property
   [junit4]   2> 32288 T45 oasc.DistributedQueue$LatchWatcher.process NodeChildrenChanged fired on path /overseer/queue state SyncConnected
   [junit4]   2> 32289 T76 oasc.ZkController.preRegister Registering watch for external collection collection1
   [junit4]   2> 32290 T76 oascc.ZkStateReader.addZkWatch addZkWatch collection1
   [junit4]   2> 32290 T46 oasc.Overseer$ClusterStateUpdater.run processMessage: queueSize: 1, message = {
   [junit4]   2> 	  "base_url":"http://127.0.0.1:10363/z_/o",
   [junit4]   2> 	  "numShards":"2",
   [junit4]   2> 	  "shard":null,
   [junit4]   2> 	  "node_name":"127.0.0.1:10363_z_%2Fo",
   [junit4]   2> 	  "state":"down",
   [junit4]   2> 	  "operation":"state",
   [junit4]   2> 	  "collection":"collection1",
   [junit4]   2> 	  "roles":null,
   [junit4]   2> 	  "core":"collection1"} current state version: 5
   [junit4]   2> 32291 T76 oascc.ZkStateReader.addZkWatch Updating collection state at /collections/collection1/state.json from ZooKeeper... 
   [junit4]   2> 32292 T46 oasco.ReplicaMutator.updateState Update state numShards=2 message={
   [junit4]   2> 	  "base_url":"http://127.0.0.1:10363/z_/o",
   [junit4]   2> 	  "numShards":"2",
   [junit4]   2> 	  "shard":null,
   [junit4]   2> 	  "node_name":"127.0.0.1:10363_z_%2Fo",
   [junit4]   2> 	  "state":"down",
   [junit4]   2> 	  "operation":"state",
   [junit4]   2> 	  "collection":"collection1",
   [junit4]   2> 	  "roles":null,
   [junit4]   2> 	  "core":"collection1"}
   [junit4]   2> 32292 T46 oasco.ReplicaMutator.updateState Collection already exists with numShards=2
   [junit4]   2> 32293 T46 oasco.ReplicaMutator.updateState Assigning new node to shard shard=shard2
   [junit4]   2> 32296 T46 oasco.ZkStateWriter.writePendingUpdates going to update_collection /collections/collection1/state.json version: 0
   [junit4]   2> 32301 T76 oascc.ZkStateReader.updateWatchedCollection Updating data for collection1 to ver 1 
   [junit4]   2> 32302 T76 oasc.ZkController.waitForCoreNodeName look for our core node name
   [junit4]   2> 32302 T76 oasc.ZkController.waitForShardId waiting to find shard id in clusterstate for collection1
   [junit4]   2> 32302 T76 oasc.ZkController.createCollectionZkNode Check for collection zkNode:collection1
   [junit4]   2> 32303 T76 oasc.ZkController.createCollectionZkNode Collection zkNode exists
   [junit4]   2> 32303 T76 oascc.ZkStateReader.readConfigName Load collection config from:/collections/collection1
   [junit4]   2> 32305 T76 oascc.ZkStateReader.readConfigName path=/collections/collection1 configName=conf1 specified config exists in ZooKeeper
   [junit4]   2> 32305 T76 oasc.SolrResourceLoader.<init> new SolrResourceLoader for directory: '/usr/home/jenkins/jenkins-slave/workspace/Lucene-Solr-Tests-5.x-Java7/solr/build/solr-core/test/J0/temp/solr.cloud.LeaderFailoverAfterPartitionTest 6DEB3E57C8B66EF1-001/shard-1-001/cores/collection1/'
   [junit4]   2> 32322 T76 oasc.ZkController.watchZKConfDir watch zkdir /configs/conf1
   [junit4]   2> 32326 T76 oasc.Config.<init> loaded config solrconfig.xml with version 0 
   [junit4]   2> 32348 T76 oasc.SolrConfig.refreshRequestParams current version of requestparams : -1
   [junit4]   2> 32374 T76 oasc.SolrConfig.<init> Using Lucene MatchVersion: 5.1.0
   [junit4]   2> 32428 T76 oasc.SolrConfig.<init> Loaded SolrConfig: solrconfig.xml
   [junit4]   2> 32431 T76 oass.IndexSchema.readSchema Reading Solr Schema from /configs/conf1/schema.xml
   [junit4]   2> 32508 T76 oass.IndexSchema.readSchema [collection1] Schema name=test
   [junit4]   2> 32944 T76 oass.OpenExchangeRatesOrgProvider.init Initialized with rates=open-exchange-rates.json, refreshInterval=1440.
   [junit4]   2> 32960 T76 oass.IndexSchema.readSchema default search field in schema is text
   [junit4]   2> 32962 T76 oass.IndexSchema.readSchema unique key field: id
   [junit4]   2> 32997 T76 oass.FileExchangeRateProvider.reload Reloading exchange rates from file currency.xml
   [junit4]   2> 33003 T76 oass.FileExchangeRateProvider.reload Reloading exchange rates from file currency.xml
   [junit4]   2> 33009 T76 oass.OpenExchangeRatesOrgProvider.reload Reloading exchange rates from open-exchange-rates.json
   [junit4]   2> 33011 T76 oass.OpenExchangeRatesOrgProvider$OpenExchangeRates.<init> WARN Unknown key IMPORTANT NOTE
   [junit4]   2> 33011 T76 oass.OpenExchangeRatesOrgProvider$OpenExchangeRates.<init> WARN Expected key, got STRING
   [junit4]   2> 33012 T76 oass.OpenExchangeRatesOrgProvider.reload Reloading exchange rates from open-exchange-rates.json
   [junit4]   2> 33014 T76 oass.OpenExchangeRatesOrgProvider$OpenExchangeRates.<init> WARN Unknown key IMPORTANT NOTE
   [junit4]   2> 33014 T76 oass.OpenExchangeRatesOrgProvider$OpenExchangeRates.<init> WARN Expected key, got STRING
   [junit4]   2> 33014 T76 oasc.CoreContainer.create Creating SolrCore 'collection1' using configuration from collection collection1
   [junit4]   2> 33015 T76 oasc.SolrCore.initDirectoryFactory org.apache.solr.core.MockDirectoryFactory
   [junit4]   2> 33015 T76 oasc.SolrCore.<init> [collection1] Opening new SolrCore at /usr/home/jenkins/jenkins-slave/workspace/Lucene-Solr-Tests-5.x-Java7/solr/build/solr-core/test/J0/temp/solr.cloud.LeaderFailoverAfterPartitionTest 6DEB3E57C8B66EF1-001/shard-1-001/cores/collection1/, dataDir=/usr/home/jenkins/jenkins-slave/workspace/Lucene-Solr-Tests-5.x-Java7/solr/build/solr-core/test/J0/temp/solr.cloud.LeaderFailoverAfterPartitionTest 6DEB3E57C8B66EF1-001/tempDir-001/jetty1/
   [junit4]   2> 33016 T76 oasc.JmxMonitoredMap.<init> JMX monitoring is enabled. Adding Solr mbeans to JMX Server: com.sun.jmx.mbeanserver.JmxMBeanServer@3acfa8c4
   [junit4]   2> 33018 T76 oasc.CachingDirectoryFactory.get return new directory for /usr/home/jenkins/jenkins-slave/workspace/Lucene-Solr-Tests-5.x-Java7/solr/build/solr-core/test/J0/temp/solr.cloud.LeaderFailoverAfterPartitionTest 6DEB3E57C8B66EF1-001/tempDir-001/jetty1
   [junit4]   2> 33018 T76 oasc.SolrCore.getNewIndexDir New index directory detected: old=null new=/usr/home/jenkins/jenkins-slave/workspace/Lucene-Solr-Tests-5.x-Java7/solr/build/solr-core/test/J0/temp/solr.cloud.LeaderFailoverAfterPartitionTest 6DEB3E57C8B66EF1-001/tempDir-001/jetty1/index/
   [junit4]   2> 33018 T76 oasc.SolrCore.initIndex WARN [collection1] Solr index directory '/usr/home/jenkins/jenkins-slave/workspace/Lucene-Solr-Tests-5.x-Java7/solr/build/solr-core/test/J0/temp/solr.cloud.LeaderFailoverAfterPartitionTest 6DEB3E57C8B66EF1-001/tempDir-001/jetty1/index' doesn't exist. Creating new index...
   [junit4]   2> 33019 T76 oasc.CachingDirectoryFactory.get return new directory for /usr/home/jenkins/jenkins-slave/workspace/Lucene-Solr-Tests-5.x-Java7/solr/build/solr-core/test/J0/temp/solr.cloud.LeaderFailoverAfterPartitionTest 6DEB3E57C8B66EF1-001/tempDir-001/jetty1/index
   [junit4]   2> 33019 T76 oasu.RandomMergePolicy.<init> RandomMergePolicy wrapping class org.apache.lucene.index.LogDocMergePolicy: [LogDocMergePolicy: minMergeSize=1000, mergeFactor=28, maxMergeSize=9223372036854775807, maxMergeSizeForForcedMerge=9223372036854775807, calibrateSizeByDeletes=true, maxMergeDocs=2147483647, maxCFSSegmentSizeMB=8.796093022207999E12, noCFSRatio=0.5029485531929246]
   [junit4]   2> 33020 T76 oasc.SolrDeletionPolicy.onCommit SolrDeletionPolicy.onCommit: commits: num=1
   [junit4]   2> 		commit{dir=MockDirectoryWrapper(RAMDirectory@5198eb47 lockFactory=org.apache.lucene.store.SingleInstanceLockFactory@e7eac2b),segFN=segments_1,generation=1}
   [junit4]   2> 33021 T76 oasc.SolrDeletionPolicy.updateCommits newest commit generation = 1
   [junit4]   2> 33032 T76 oasup.UpdateRequestProcessorChain.init creating updateRequestProcessorChain "nodistrib"
   [junit4]   2> 33032 T76 oasup.UpdateRequestProcessorChain.init creating updateRequestProcessorChain "dedupe"
   [junit4]   2> 33033 T76 oasup.UpdateRequestProcessorChain.init inserting DistributedUpdateProcessorFactory into updateRequestProcessorChain "dedupe"
   [junit4]   2> 33033 T76 oasup.UpdateRequestProcessorChain.init creating up

[...truncated too long message...]

lr.cloud.HttpPartitionTest 6DEB3E57C8B66EF1-001/tempDir-001/jetty3
   [junit4]   2> 302157 T621 oasc.Overseer.close Overseer (id=93411232461619211-127.0.0.1:10520_l_out-n_0000000003) closing
   [junit4]   2> 302157 T818 oasc.Overseer$ClusterStateUpdater.run Overseer Loop exiting : 127.0.0.1:10520_l_out
   [junit4]   2> 302159 T813 oascc.ZkStateReader$3.process WARN ZooKeeper watch triggered, but Solr cannot talk to ZK
   [junit4]   2> 302160 T621 oejsh.ContextHandler.doStop stopped o.e.j.s.ServletContextHandler{/l_out,null}
   [junit4]   2> 302298 T621 oasc.ZkTestServer.send4LetterWord connecting to 127.0.0.1:10487 10487
   [junit4]   2> 302349 T622 oasc.ZkTestServer.send4LetterWord connecting to 127.0.0.1:10487 10487
   [junit4]   2> 302350 T622 oasc.ZkTestServer$ZKServerMain.runFromConfig WARN Watch limit violations: 
   [junit4]   2> 	Maximum concurrent create/delete watches above limit:
   [junit4]   2> 	
   [junit4]   2> 		5	/solr/aliases.json
   [junit4]   2> 		5	/solr/clusterstate.json
   [junit4]   2> 		4	/solr/configs/conf1
   [junit4]   2> 		3	/solr/collections/collection1/state.json
   [junit4]   2> 		2	/solr/collections/c8n_1x2/state.json
   [junit4]   2> 		2	/solr/collections/c8n_crud_1x2/state.json
   [junit4]   2> 	
   [junit4]   2> 	Maximum concurrent children watches above limit:
   [junit4]   2> 	
   [junit4]   2> 		5	/solr/live_nodes
   [junit4]   2> 		4	/solr/overseer/collection-queue-work
   [junit4]   2> 		4	/solr/overseer/queue
   [junit4]   2> 	
   [junit4]   2> 302351 T621 oasc.SocketProxy.close WARN Closing 13 connections to: http://127.0.0.1:10511/l_out
   [junit4]   2> 302351 T621 oasc.SocketProxy.close WARN Closing 2 connections to: http://127.0.0.1:10520/l_out
   [junit4]   2> 302352 T621 oasc.SocketProxy.close WARN Closing 0 connections to: http://127.0.0.1:10504/l_out
   [junit4]   2> 302352 T621 oasc.SocketProxy.close WARN Closing 3 connections to: http://127.0.0.1:10493/l_out
   [junit4]   2> NOTE: reproduce with: ant test  -Dtestcase=HttpPartitionTest -Dtests.method=test -Dtests.seed=6DEB3E57C8B66EF1 -Dtests.multiplier=2 -Dtests.slow=true -Dtests.locale=et -Dtests.timezone=Antarctica/Syowa -Dtests.asserts=true -Dtests.file.encoding=US-ASCII
   [junit4] ERROR   98.5s J2 | HttpPartitionTest.test <<<
   [junit4]    > Throwable #1: org.apache.solr.client.solrj.SolrServerException: org.apache.solr.client.solrj.SolrServerException: IOException occured when talking to server at: http://127.0.0.1:10511/l_out/c8n_1x2_shard1_replica1
   [junit4]    > 	at __randomizedtesting.SeedInfo.seed([6DEB3E57C8B66EF1:E5BF018D664A0309]:0)
   [junit4]    > 	at org.apache.solr.client.solrj.impl.CloudSolrClient.directUpdate(CloudSolrClient.java:597)
   [junit4]    > 	at org.apache.solr.client.solrj.impl.CloudSolrClient.sendRequest(CloudSolrClient.java:918)
   [junit4]    > 	at org.apache.solr.client.solrj.impl.CloudSolrClient.requestWithRetryOnStaleState(CloudSolrClient.java:809)
   [junit4]    > 	at org.apache.solr.client.solrj.impl.CloudSolrClient.request(CloudSolrClient.java:752)
   [junit4]    > 	at org.apache.solr.cloud.HttpPartitionTest.doSendDoc(HttpPartitionTest.java:484)
   [junit4]    > 	at org.apache.solr.cloud.HttpPartitionTest.sendDoc(HttpPartitionTest.java:501)
   [junit4]    > 	at org.apache.solr.cloud.HttpPartitionTest.testRf2(HttpPartitionTest.java:193)
   [junit4]    > 	at org.apache.solr.cloud.HttpPartitionTest.test(HttpPartitionTest.java:106)
   [junit4]    > 	at org.apache.solr.BaseDistributedSearchTestCase$ShardsRepeatRule$ShardsFixedStatement.callStatement(BaseDistributedSearchTestCase.java:950)
   [junit4]    > 	at org.apache.solr.BaseDistributedSearchTestCase$ShardsRepeatRule$ShardsStatement.evaluate(BaseDistributedSearchTestCase.java:925)
   [junit4]    > 	at java.lang.Thread.run(Thread.java:745)
   [junit4]    > Caused by: org.apache.solr.client.solrj.SolrServerException: IOException occured when talking to server at: http://127.0.0.1:10511/l_out/c8n_1x2_shard1_replica1
   [junit4]    > 	at org.apache.solr.client.solrj.impl.HttpSolrClient.executeMethod(HttpSolrClient.java:572)
   [junit4]    > 	at org.apache.solr.client.solrj.impl.HttpSolrClient.request(HttpSolrClient.java:214)
   [junit4]    > 	at org.apache.solr.client.solrj.impl.HttpSolrClient.request(HttpSolrClient.java:210)
   [junit4]    > 	at org.apache.solr.client.solrj.impl.LBHttpSolrClient.doRequest(LBHttpSolrClient.java:370)
   [junit4]    > 	at org.apache.solr.client.solrj.impl.LBHttpSolrClient.request(LBHttpSolrClient.java:325)
   [junit4]    > 	at org.apache.solr.client.solrj.impl.CloudSolrClient.directUpdate(CloudSolrClient.java:594)
   [junit4]    > 	... 48 more
   [junit4]    > Caused by: org.apache.http.NoHttpResponseException: The target server failed to respond
   [junit4]    > 	at org.apache.http.impl.conn.DefaultHttpResponseParser.parseHead(DefaultHttpResponseParser.java:143)
   [junit4]    > 	at org.apache.http.impl.conn.DefaultHttpResponseParser.parseHead(DefaultHttpResponseParser.java:57)
   [junit4]    > 	at org.apache.http.impl.io.AbstractMessageParser.parse(AbstractMessageParser.java:260)
   [junit4]    > 	at org.apache.http.impl.AbstractHttpClientConnection.receiveResponseHeader(AbstractHttpClientConnection.java:283)
   [junit4]    > 	at org.apache.http.impl.conn.DefaultClientConnection.receiveResponseHeader(DefaultClientConnection.java:251)
   [junit4]    > 	at org.apache.http.impl.conn.ManagedClientConnectionImpl.receiveResponseHeader(ManagedClientConnectionImpl.java:197)
   [junit4]    > 	at org.apache.http.protocol.HttpRequestExecutor.doReceiveResponse(HttpRequestExecutor.java:271)
   [junit4]    > 	at org.apache.http.protocol.HttpRequestExecutor.execute(HttpRequestExecutor.java:123)
   [junit4]    > 	at org.apache.http.impl.client.DefaultRequestDirector.tryExecute(DefaultRequestDirector.java:682)
   [junit4]    > 	at org.apache.http.impl.client.DefaultRequestDirector.execute(DefaultRequestDirector.java:486)
   [junit4]    > 	at org.apache.http.impl.client.AbstractHttpClient.doExecute(AbstractHttpClient.java:863)
   [junit4]    > 	at org.apache.http.impl.client.CloseableHttpClient.execute(CloseableHttpClient.java:82)
   [junit4]    > 	at org.apache.http.impl.client.CloseableHttpClient.execute(CloseableHttpClient.java:106)
   [junit4]    > 	at org.apache.http.impl.client.CloseableHttpClient.execute(CloseableHttpClient.java:57)
   [junit4]    > 	at org.apache.solr.client.solrj.impl.HttpSolrClient.executeMethod(HttpSolrClient.java:464)
   [junit4]    > 	... 53 more
   [junit4]   2> 302366 T621 oas.SolrTestCaseJ4.deleteCore ###deleteCore
   [junit4]   2> NOTE: leaving temporary files on disk at: /usr/home/jenkins/jenkins-slave/workspace/Lucene-Solr-Tests-5.x-Java7/solr/build/solr-core/test/J2/temp/solr.cloud.HttpPartitionTest 6DEB3E57C8B66EF1-001
   [junit4]   2> 98532 T620 ccr.ThreadLeakControl.checkThreadLeaks WARNING Will linger awaiting termination of 1 leaked thread(s).
   [junit4]   2> NOTE: test params are: codec=Asserting(Lucene50): {a_t=PostingsFormat(name=MockRandom), text=TestBloomFilteredLucenePostings(BloomFilteringPostingsFormat(Lucene50(blocksize=128))), _version_=PostingsFormat(name=MockRandom), range_facet_l=PostingsFormat(name=MockRandom), multiDefault=PostingsFormat(name=Memory doPackFST= false), timestamp=PostingsFormat(name=MockRandom), intDefault=PostingsFormat(name=MockRandom), id=FSTOrd50}, docValues:{timestamp=DocValuesFormat(name=Lucene50)}, sim=DefaultSimilarity, locale=et, timezone=Antarctica/Syowa
   [junit4]   2> NOTE: FreeBSD 9.1-RELEASE-p3 amd64/Oracle Corporation 1.7.0_65 (64-bit)/cpus=16,threads=1,free=170309136,total=276824064
   [junit4]   2> NOTE: All tests run in this JVM: [TestCoreDiscovery, TestExtendedDismaxParser, TestStressVersions, TestDynamicFieldCollectionResource, SpellCheckComponentTest, RAMDirectoryFactoryTest, TestCursorMarkWithoutUniqueKey, TestSweetSpotSimilarityFactory, UpdateRequestProcessorFactoryTest, TestHighFrequencyDictionaryFactory, TestFastWriter, TestSolrConfigHandler, TestDefaultSimilarityFactory, TestManagedResource, PrimUtilsTest, AtomicUpdatesTest, HdfsWriteToMultipleCollectionsTest, TestValueSourceCache, UpdateParamsTest, TestPostingsSolrHighlighter, RecoveryAfterSoftCommitTest, CoreAdminHandlerTest, TestBinaryField, LeaderElectionTest, HttpPartitionTest]
   [junit4] Completed on J2 in 99.06s, 1 test, 1 error <<< FAILURES!

[...truncated 1218 lines...]
BUILD FAILED
/usr/home/jenkins/jenkins-slave/workspace/Lucene-Solr-Tests-5.x-Java7/build.xml:529: The following error occurred while executing this line:
/usr/home/jenkins/jenkins-slave/workspace/Lucene-Solr-Tests-5.x-Java7/build.xml:477: The following error occurred while executing this line:
/usr/home/jenkins/jenkins-slave/workspace/Lucene-Solr-Tests-5.x-Java7/build.xml:61: The following error occurred while executing this line:
/usr/home/jenkins/jenkins-slave/workspace/Lucene-Solr-Tests-5.x-Java7/extra-targets.xml:39: The following error occurred while executing this line:
/usr/home/jenkins/jenkins-slave/workspace/Lucene-Solr-Tests-5.x-Java7/solr/build.xml:191: The following error occurred while executing this line:
/usr/home/jenkins/jenkins-slave/workspace/Lucene-Solr-Tests-5.x-Java7/solr/common-build.xml:509: The following error occurred while executing this line:
/usr/home/jenkins/jenkins-slave/workspace/Lucene-Solr-Tests-5.x-Java7/lucene/common-build.xml:1370: The following error occurred while executing this line:
/usr/home/jenkins/jenkins-slave/workspace/Lucene-Solr-Tests-5.x-Java7/lucene/common-build.xml:976: There were test failures: 469 suites, 1871 tests, 5 errors, 62 ignored (22 assumptions)

Total time: 52 minutes 27 seconds
Build step 'Invoke Ant' marked build as failure
Archiving artifacts
Sending artifact delta relative to Lucene-Solr-Tests-5.x-Java7 #2431
Archived 5 artifacts
Archive block size is 32768
Received 0 blocks and 174357267 bytes
Compression is 0.0%
Took 33 sec
Recording test results
Email was triggered for: Failure
Sending email for trigger: Failure



Mime
View raw message