lucene-dev mailing list archives

Site index · List index
Message view « Date » · « Thread »
Top « Date » · « Thread »
From Policeman Jenkins Server <jenk...@thetaphi.de>
Subject [JENKINS] Lucene-Solr-5.x-Linux (64bit/jdk1.7.0_80-ea-b05) - Build # 11779 - Still Failing!
Date Mon, 09 Mar 2015 14:37:32 GMT
Build: http://jenkins.thetaphi.de/job/Lucene-Solr-5.x-Linux/11779/
Java: 64bit/jdk1.7.0_80-ea-b05 -XX:-UseCompressedOops -XX:+UseSerialGC

3 tests failed.
FAILED:  junit.framework.TestSuite.org.apache.solr.util.TestUtils

Error Message:
1 thread leaked from SUITE scope at org.apache.solr.util.TestUtils:     1) Thread[id=4110,
name=nanoTimeTestThread-2110-thread-1, state=TIMED_WAITING, group=TGRP-TestUtils]        
at sun.misc.Unsafe.park(Native Method)         at java.util.concurrent.locks.LockSupport.parkNanos(LockSupport.java:226)
        at java.util.concurrent.SynchronousQueue$TransferStack.awaitFulfill(SynchronousQueue.java:460)
        at java.util.concurrent.SynchronousQueue$TransferStack.transfer(SynchronousQueue.java:359)
        at java.util.concurrent.SynchronousQueue.poll(SynchronousQueue.java:942)         at
java.util.concurrent.ThreadPoolExecutor.getTask(ThreadPoolExecutor.java:1068)         at java.util.concurrent.ThreadPoolExecutor.runWorker(ThreadPoolExecutor.java:1130)
        at java.util.concurrent.ThreadPoolExecutor$Worker.run(ThreadPoolExecutor.java:615)
        at java.lang.Thread.run(Thread.java:745)

Stack Trace:
com.carrotsearch.randomizedtesting.ThreadLeakError: 1 thread leaked from SUITE scope at org.apache.solr.util.TestUtils:

   1) Thread[id=4110, name=nanoTimeTestThread-2110-thread-1, state=TIMED_WAITING, group=TGRP-TestUtils]
        at sun.misc.Unsafe.park(Native Method)
        at java.util.concurrent.locks.LockSupport.parkNanos(LockSupport.java:226)
        at java.util.concurrent.SynchronousQueue$TransferStack.awaitFulfill(SynchronousQueue.java:460)
        at java.util.concurrent.SynchronousQueue$TransferStack.transfer(SynchronousQueue.java:359)
        at java.util.concurrent.SynchronousQueue.poll(SynchronousQueue.java:942)
        at java.util.concurrent.ThreadPoolExecutor.getTask(ThreadPoolExecutor.java:1068)
        at java.util.concurrent.ThreadPoolExecutor.runWorker(ThreadPoolExecutor.java:1130)
        at java.util.concurrent.ThreadPoolExecutor$Worker.run(ThreadPoolExecutor.java:615)
        at java.lang.Thread.run(Thread.java:745)
	at __randomizedtesting.SeedInfo.seed([84F46C7A1DDC1EB7]:0)


FAILED:  junit.framework.TestSuite.org.apache.solr.util.TestUtils

Error Message:
There are still zombie threads that couldn't be terminated:    1) Thread[id=4110, name=nanoTimeTestThread-2110-thread-1,
state=TIMED_WAITING, group=TGRP-TestUtils]         at sun.misc.Unsafe.park(Native Method)
        at java.util.concurrent.locks.LockSupport.parkNanos(LockSupport.java:226)        
at java.util.concurrent.SynchronousQueue$TransferStack.awaitFulfill(SynchronousQueue.java:460)
        at java.util.concurrent.SynchronousQueue$TransferStack.transfer(SynchronousQueue.java:359)
        at java.util.concurrent.SynchronousQueue.poll(SynchronousQueue.java:942)         at
java.util.concurrent.ThreadPoolExecutor.getTask(ThreadPoolExecutor.java:1068)         at java.util.concurrent.ThreadPoolExecutor.runWorker(ThreadPoolExecutor.java:1130)
        at java.util.concurrent.ThreadPoolExecutor$Worker.run(ThreadPoolExecutor.java:615)
        at java.lang.Thread.run(Thread.java:745)

Stack Trace:
com.carrotsearch.randomizedtesting.ThreadLeakError: There are still zombie threads that couldn't
be terminated:
   1) Thread[id=4110, name=nanoTimeTestThread-2110-thread-1, state=TIMED_WAITING, group=TGRP-TestUtils]
        at sun.misc.Unsafe.park(Native Method)
        at java.util.concurrent.locks.LockSupport.parkNanos(LockSupport.java:226)
        at java.util.concurrent.SynchronousQueue$TransferStack.awaitFulfill(SynchronousQueue.java:460)
        at java.util.concurrent.SynchronousQueue$TransferStack.transfer(SynchronousQueue.java:359)
        at java.util.concurrent.SynchronousQueue.poll(SynchronousQueue.java:942)
        at java.util.concurrent.ThreadPoolExecutor.getTask(ThreadPoolExecutor.java:1068)
        at java.util.concurrent.ThreadPoolExecutor.runWorker(ThreadPoolExecutor.java:1130)
        at java.util.concurrent.ThreadPoolExecutor$Worker.run(ThreadPoolExecutor.java:615)
        at java.lang.Thread.run(Thread.java:745)
	at __randomizedtesting.SeedInfo.seed([84F46C7A1DDC1EB7]:0)


FAILED:  org.apache.solr.util.TestUtils.testNanoTimeSpeed

Error Message:
Time taken for System.nanoTime is too high

Stack Trace:
java.lang.AssertionError: Time taken for System.nanoTime is too high
	at __randomizedtesting.SeedInfo.seed([84F46C7A1DDC1EB7:F20E784C1177C5E7]:0)
	at org.junit.Assert.fail(Assert.java:93)
	at org.junit.Assert.assertTrue(Assert.java:43)
	at org.apache.solr.util.TestUtils.testNanoTimeSpeed(TestUtils.java:197)
	at sun.reflect.NativeMethodAccessorImpl.invoke0(Native Method)
	at sun.reflect.NativeMethodAccessorImpl.invoke(NativeMethodAccessorImpl.java:57)
	at sun.reflect.DelegatingMethodAccessorImpl.invoke(DelegatingMethodAccessorImpl.java:43)
	at java.lang.reflect.Method.invoke(Method.java:606)
	at com.carrotsearch.randomizedtesting.RandomizedRunner.invoke(RandomizedRunner.java:1627)
	at com.carrotsearch.randomizedtesting.RandomizedRunner$6.evaluate(RandomizedRunner.java:836)
	at com.carrotsearch.randomizedtesting.RandomizedRunner$7.evaluate(RandomizedRunner.java:872)
	at com.carrotsearch.randomizedtesting.RandomizedRunner$8.evaluate(RandomizedRunner.java:886)
	at com.carrotsearch.randomizedtesting.rules.SystemPropertiesRestoreRule$1.evaluate(SystemPropertiesRestoreRule.java:53)
	at org.apache.lucene.util.TestRuleSetupTeardownChained$1.evaluate(TestRuleSetupTeardownChained.java:50)
	at org.apache.lucene.util.AbstractBeforeAfterRule$1.evaluate(AbstractBeforeAfterRule.java:46)
	at org.apache.lucene.util.TestRuleThreadAndTestName$1.evaluate(TestRuleThreadAndTestName.java:49)
	at org.apache.lucene.util.TestRuleIgnoreAfterMaxFailures$1.evaluate(TestRuleIgnoreAfterMaxFailures.java:65)
	at org.apache.lucene.util.TestRuleMarkFailure$1.evaluate(TestRuleMarkFailure.java:48)
	at com.carrotsearch.randomizedtesting.rules.StatementAdapter.evaluate(StatementAdapter.java:36)
	at com.carrotsearch.randomizedtesting.ThreadLeakControl$StatementRunner.run(ThreadLeakControl.java:365)
	at com.carrotsearch.randomizedtesting.ThreadLeakControl.forkTimeoutingTask(ThreadLeakControl.java:798)
	at com.carrotsearch.randomizedtesting.ThreadLeakControl$3.evaluate(ThreadLeakControl.java:458)
	at com.carrotsearch.randomizedtesting.RandomizedRunner.runSingleTest(RandomizedRunner.java:845)
	at com.carrotsearch.randomizedtesting.RandomizedRunner$3.evaluate(RandomizedRunner.java:747)
	at com.carrotsearch.randomizedtesting.RandomizedRunner$4.evaluate(RandomizedRunner.java:781)
	at com.carrotsearch.randomizedtesting.RandomizedRunner$5.evaluate(RandomizedRunner.java:792)
	at com.carrotsearch.randomizedtesting.rules.StatementAdapter.evaluate(StatementAdapter.java:36)
	at com.carrotsearch.randomizedtesting.rules.SystemPropertiesRestoreRule$1.evaluate(SystemPropertiesRestoreRule.java:53)
	at org.apache.lucene.util.AbstractBeforeAfterRule$1.evaluate(AbstractBeforeAfterRule.java:46)
	at com.carrotsearch.randomizedtesting.rules.StatementAdapter.evaluate(StatementAdapter.java:36)
	at org.apache.lucene.util.TestRuleStoreClassName$1.evaluate(TestRuleStoreClassName.java:42)
	at com.carrotsearch.randomizedtesting.rules.NoShadowingOrOverridesOnMethodsRule$1.evaluate(NoShadowingOrOverridesOnMethodsRule.java:39)
	at com.carrotsearch.randomizedtesting.rules.NoShadowingOrOverridesOnMethodsRule$1.evaluate(NoShadowingOrOverridesOnMethodsRule.java:39)
	at com.carrotsearch.randomizedtesting.rules.StatementAdapter.evaluate(StatementAdapter.java:36)
	at com.carrotsearch.randomizedtesting.rules.StatementAdapter.evaluate(StatementAdapter.java:36)
	at com.carrotsearch.randomizedtesting.rules.StatementAdapter.evaluate(StatementAdapter.java:36)
	at org.apache.lucene.util.TestRuleAssertionsRequired$1.evaluate(TestRuleAssertionsRequired.java:54)
	at org.apache.lucene.util.TestRuleMarkFailure$1.evaluate(TestRuleMarkFailure.java:48)
	at org.apache.lucene.util.TestRuleIgnoreAfterMaxFailures$1.evaluate(TestRuleIgnoreAfterMaxFailures.java:65)
	at org.apache.lucene.util.TestRuleIgnoreTestSuites$1.evaluate(TestRuleIgnoreTestSuites.java:55)
	at com.carrotsearch.randomizedtesting.rules.StatementAdapter.evaluate(StatementAdapter.java:36)
	at com.carrotsearch.randomizedtesting.ThreadLeakControl$StatementRunner.run(ThreadLeakControl.java:365)
	at java.lang.Thread.run(Thread.java:745)




Build Log:
[...truncated 9982 lines...]
   [junit4] Suite: org.apache.solr.util.TestUtils
   [junit4]   2> Creating dataDir: /mnt/ssd/jenkins/workspace/Lucene-Solr-5.x-Linux/solr/build/solr-core/test/J1/temp/solr.util.TestUtils
84F46C7A1DDC1EB7-001/init-core-data-001
   [junit4]   2> 1068409 T4109 oas.SolrTestCaseJ4.buildSSLConfig Randomized ssl (false)
and clientAuth (false)
   [junit4]   2> 1068414 T4109 oas.SolrTestCaseJ4.setUp ###Starting testEscapeTextWithSeparator
   [junit4]   2> 1068414 T4109 oas.SolrTestCaseJ4.tearDown ###Ending testEscapeTextWithSeparator
   [junit4]   2> 1068418 T4109 oas.SolrTestCaseJ4.setUp ###Starting testJoin
   [junit4]   2> 1068419 T4109 oas.SolrTestCaseJ4.tearDown ###Ending testJoin
   [junit4]   2> 1068422 T4109 oas.SolrTestCaseJ4.setUp ###Starting testNanoTimeSpeed
   [junit4]   2> 1068439 T4109 oas.SolrTestCaseJ4.tearDown ###Ending testNanoTimeSpeed
   [junit4]   2> NOTE: reproduce with: ant test  -Dtestcase=TestUtils -Dtests.method=testNanoTimeSpeed
-Dtests.seed=84F46C7A1DDC1EB7 -Dtests.multiplier=3 -Dtests.slow=true -Dtests.locale=mk_MK
-Dtests.timezone=America/Cancun -Dtests.asserts=true -Dtests.file.encoding=US-ASCII
   [junit4] FAILURE 0.04s J1 | TestUtils.testNanoTimeSpeed <<<
   [junit4]    > Throwable #1: java.lang.AssertionError: Time taken for System.nanoTime
is too high
   [junit4]    > 	at __randomizedtesting.SeedInfo.seed([84F46C7A1DDC1EB7:F20E784C1177C5E7]:0)
   [junit4]    > 	at org.apache.solr.util.TestUtils.testNanoTimeSpeed(TestUtils.java:197)
   [junit4]    > 	at java.lang.Thread.run(Thread.java:745)
   [junit4]   2> 1068462 T4109 oas.SolrTestCaseJ4.setUp ###Starting testSplitEscaping
   [junit4]   2> 1068463 T4109 oas.SolrTestCaseJ4.tearDown ###Ending testSplitEscaping
   [junit4]   2> 1068467 T4109 oas.SolrTestCaseJ4.setUp ###Starting testNumberUtils
   [junit4]   2> 1068468 T4109 oas.SolrTestCaseJ4.tearDown ###Ending testNumberUtils
   [junit4]   2> 1068471 T4109 oas.SolrTestCaseJ4.setUp ###Starting testNamedLists
   [junit4]   2> 1068472 T4109 oas.SolrTestCaseJ4.tearDown ###Ending testNamedLists
   [junit4]   2> 1068472 T4109 oas.SolrTestCaseJ4.deleteCore ###deleteCore
   [junit4]   2> NOTE: leaving temporary files on disk at: /mnt/ssd/jenkins/workspace/Lucene-Solr-5.x-Linux/solr/build/solr-core/test/J1/temp/solr.util.TestUtils
84F46C7A1DDC1EB7-001
   [junit4]   2> 69 T4108 ccr.ThreadLeakControl.checkThreadLeaks WARNING Will linger awaiting
termination of 1 leaked thread(s).
   [junit4]   2> 20218 T4108 ccr.ThreadLeakControl.checkThreadLeaks SEVERE 1 thread leaked
from SUITE scope at org.apache.solr.util.TestUtils: 
   [junit4]   2> 	   1) Thread[id=4110, name=nanoTimeTestThread-2110-thread-1, state=TIMED_WAITING,
group=TGRP-TestUtils]
   [junit4]   2> 	        at sun.misc.Unsafe.park(Native Method)
   [junit4]   2> 	        at java.util.concurrent.locks.LockSupport.parkNanos(LockSupport.java:226)
   [junit4]   2> 	        at java.util.concurrent.SynchronousQueue$TransferStack.awaitFulfill(SynchronousQueue.java:460)
   [junit4]   2> 	        at java.util.concurrent.SynchronousQueue$TransferStack.transfer(SynchronousQueue.java:359)
   [junit4]   2> 	        at java.util.concurrent.SynchronousQueue.poll(SynchronousQueue.java:942)
   [junit4]   2> 	        at java.util.concurrent.ThreadPoolExecutor.getTask(ThreadPoolExecutor.java:1068)
   [junit4]   2> 	        at java.util.concurrent.ThreadPoolExecutor.runWorker(ThreadPoolExecutor.java:1130)
   [junit4]   2> 	        at java.util.concurrent.ThreadPoolExecutor$Worker.run(ThreadPoolExecutor.java:615)
   [junit4]   2> 	        at java.lang.Thread.run(Thread.java:745)
   [junit4]   2> 20218 T4108 ccr.ThreadLeakControl.tryToInterruptAll Starting to interrupt
leaked threads:
   [junit4]   2> 	   1) Thread[id=4110, name=nanoTimeTestThread-2110-thread-1, state=TIMED_WAITING,
group=TGRP-TestUtils]
   [junit4]   2> 23220 T4108 ccr.ThreadLeakControl.tryToInterruptAll SEVERE There are still
zombie threads that couldn't be terminated:
   [junit4]   2> 	   1) Thread[id=4110, name=nanoTimeTestThread-2110-thread-1, state=TIMED_WAITING,
group=TGRP-TestUtils]
   [junit4]   2> 	        at sun.misc.Unsafe.park(Native Method)
   [junit4]   2> 	        at java.util.concurrent.locks.LockSupport.parkNanos(LockSupport.java:226)
   [junit4]   2> 	        at java.util.concurrent.SynchronousQueue$TransferStack.awaitFulfill(SynchronousQueue.java:460)
   [junit4]   2> 	        at java.util.concurrent.SynchronousQueue$TransferStack.transfer(SynchronousQueue.java:359)
   [junit4]   2> 	        at java.util.concurrent.SynchronousQueue.poll(SynchronousQueue.java:942)
   [junit4]   2> 	        at java.util.concurrent.ThreadPoolExecutor.getTask(ThreadPoolExecutor.java:1068)
   [junit4]   2> 	        at java.util.concurrent.ThreadPoolExecutor.runWorker(ThreadPoolExecutor.java:1130)
   [junit4]   2> 	        at java.util.concurrent.ThreadPoolExecutor$Worker.run(ThreadPoolExecutor.java:615)
   [junit4]   2> 	        at java.lang.Thread.run(Thread.java:745)
   [junit4]   2> NOTE: test params are: codec=Asserting(Lucene50), sim=DefaultSimilarity,
locale=mk_MK, timezone=America/Cancun
   [junit4]   2> NOTE: Linux 3.13.0-46-generic amd64/Oracle Corporation 1.7.0_80-ea (64-bit)/cpus=8,threads=2,free=111507768,total=260591616
   [junit4]   2> NOTE: All tests run in this JVM: [TestRecovery, SpellPossibilityIteratorTest,
TestExactSharedStatsCache, HighlighterTest, TestFuzzyAnalyzedSuggestions, IndexBasedSpellCheckerTest,
TestRandomFaceting, SegmentsInfoRequestHandlerTest, JsonLoaderTest, ConnectionManagerTest,
ShardSplitTest, EnumFieldTest, TestCloudPivotFacet, SolrXmlInZkTest, TestLMJelinekMercerSimilarityFactory,
BadIndexSchemaTest, TestReload, MinimalSchemaTest, StatelessScriptUpdateProcessorFactoryTest,
BlockDirectoryTest, MoreLikeThisHandlerTest, NotRequiredUniqueKeyTest, TestSolrJ, TestSolrDeletionPolicy2,
TestSerializedLuceneMatchVersion, TestFastOutputStream, HdfsLockFactoryTest, OverseerStatusTest,
RecoveryAfterSoftCommitTest, DocValuesMissingTest, TestStandardQParsers, TestClusterStateMutator,
TestPHPSerializedResponseWriter, TestFiltering, TestSolrConfigHandlerConcurrent, TestDocBasedVersionConstraints,
ShardRoutingCustomTest, AssignTest, CurrencyFieldXmlFileTest, TestSolrQueryParser, ConvertedLegacyTest,
CursorPagingTest, SuggesterTSTTest, TestStressUserVersions, UpdateParamsTest, TestRebalanceLeaders,
TestShardHandlerFactory, TestOverriddenPrefixQueryForCustomFieldType, OpenCloseCoreStressTest,
TestCopyFieldCollectionResource, SpellingQueryConverterTest, MultiThreadedOCPTest, TestSolrCoreProperties,
TestSchemaVersionResource, PluginInfoTest, TestTolerantSearch, TestDynamicFieldCollectionResource,
TestChildDocTransformer, TestInfoStreamLogging, TestQuerySenderListener, TermVectorComponentTest,
FileUtilsTest, TestSystemIdResolver, ZkSolrClientTest, BJQParserTest, TestBlobHandler, TestJettySolrRunner,
TestCloudInspectUtil, CursorMarkTest, TestMiniSolrCloudCluster, DistributedFacetPivotLargeTest,
TestRawResponseWriter, DistributedExpandComponentTest, BasicZkTest, TestSolrDeletionPolicy1,
TestDefaultSearchFieldResource, TestAddFieldRealTimeGet, TestIntervalFaceting, TestReplicaProperties,
TestSolrXml, ResponseHeaderTest, CSVRequestHandlerTest, TestAnalyzeInfixSuggestions, TestConfig,
TestSortingResponseWriter, TestRemoteStreaming, SchemaVersionSpecificBehaviorTest, DistributedQueryComponentOptimizationTest,
CoreAdminCreateDiscoverTest, BasicDistributedZk2Test, TestBulkSchemaAPI, BinaryUpdateRequestHandlerTest,
DebugComponentTest, DateFieldTest, SpellCheckCollatorTest, DateMathParserTest, IndexSchemaTest,
TestLRUStatsCache, SolrRequestParserTest, OpenExchangeRatesOrgProviderTest, RAMDirectoryFactoryTest,
EchoParamsTest, BasicFunctionalityTest, SpatialFilterTest, TestUtils]
   [junit4]   2> NOTE: reproduce with: ant test  -Dtestcase=TestUtils -Dtests.seed=84F46C7A1DDC1EB7
-Dtests.multiplier=3 -Dtests.slow=true -Dtests.locale=mk_MK -Dtests.timezone=America/Cancun
-Dtests.asserts=true -Dtests.file.encoding=US-ASCII
   [junit4] ERROR   0.00s J1 | TestUtils (suite) <<<
   [junit4]    > Throwable #1: com.carrotsearch.randomizedtesting.ThreadLeakError: 1 thread
leaked from SUITE scope at org.apache.solr.util.TestUtils: 
   [junit4]    >    1) Thread[id=4110, name=nanoTimeTestThread-2110-thread-1, state=TIMED_WAITING,
group=TGRP-TestUtils]
   [junit4]    >         at sun.misc.Unsafe.park(Native Method)
   [junit4]    >         at java.util.concurrent.locks.LockSupport.parkNanos(LockSupport.java:226)
   [junit4]    >         at java.util.concurrent.SynchronousQueue$TransferStack.awaitFulfill(SynchronousQueue.java:460)
   [junit4]    >         at java.util.concurrent.SynchronousQueue$TransferStack.transfer(SynchronousQueue.java:359)
   [junit4]    >         at java.util.concurrent.SynchronousQueue.poll(SynchronousQueue.java:942)
   [junit4]    >         at java.util.concurrent.ThreadPoolExecutor.getTask(ThreadPoolExecutor.java:1068)
   [junit4]    >         at java.util.concurrent.ThreadPoolExecutor.runWorker(ThreadPoolExecutor.java:1130)
   [junit4]    >         at java.util.concurrent.ThreadPoolExecutor$Worker.run(ThreadPoolExecutor.java:615)
   [junit4]    >         at java.lang.Thread.run(Thread.java:745)
   [junit4]    > 	at __randomizedtesting.SeedInfo.seed([84F46C7A1DDC1EB7]:0)Throwable #2:
com.carrotsearch.randomizedtesting.ThreadLeakError: There are still zombie threads that couldn't
be terminated:
   [junit4]    >    1) Thread[id=4110, name=nanoTimeTestThread-2110-thread-1, state=TIMED_WAITING,
group=TGRP-TestUtils]
   [junit4]    >         at sun.misc.Unsafe.park(Native Method)
   [junit4]    >         at java.util.concurrent.locks.LockSupport.parkNanos(LockSupport.java:226)
   [junit4]    >         at java.util.concurrent.SynchronousQueue$TransferStack.awaitFulfill(SynchronousQueue.java:460)
   [junit4]    >         at java.util.concurrent.SynchronousQueue$TransferStack.transfer(SynchronousQueue.java:359)
   [junit4]    >         at java.util.concurrent.SynchronousQueue.poll(SynchronousQueue.java:942)
   [junit4]    >         at java.util.concurrent.ThreadPoolExecutor.getTask(ThreadPoolExecutor.java:1068)
   [junit4]    >         at java.util.concurrent.ThreadPoolExecutor.runWorker(ThreadPoolExecutor.java:1130)
   [junit4]    >         at java.util.concurrent.ThreadPoolExecutor$Worker.run(ThreadPoolExecutor.java:615)
   [junit4]    >         at java.lang.Thread.run(Thread.java:745)
   [junit4]    > 	at __randomizedtesting.SeedInfo.seed([84F46C7A1DDC1EB7]:0)
   [junit4] Completed on J1 in 23.27s, 6 tests, 1 failure, 2 errors <<< FAILURES!

[...truncated 844 lines...]
BUILD FAILED
/mnt/ssd/jenkins/workspace/Lucene-Solr-5.x-Linux/build.xml:529: The following error occurred
while executing this line:
/mnt/ssd/jenkins/workspace/Lucene-Solr-5.x-Linux/build.xml:477: The following error occurred
while executing this line:
/mnt/ssd/jenkins/workspace/Lucene-Solr-5.x-Linux/build.xml:61: The following error occurred
while executing this line:
/mnt/ssd/jenkins/workspace/Lucene-Solr-5.x-Linux/extra-targets.xml:39: The following error
occurred while executing this line:
/mnt/ssd/jenkins/workspace/Lucene-Solr-5.x-Linux/solr/build.xml:191: The following error occurred
while executing this line:
/mnt/ssd/jenkins/workspace/Lucene-Solr-5.x-Linux/solr/common-build.xml:509: The following
error occurred while executing this line:
/mnt/ssd/jenkins/workspace/Lucene-Solr-5.x-Linux/lucene/common-build.xml:1370: The following
error occurred while executing this line:
/mnt/ssd/jenkins/workspace/Lucene-Solr-5.x-Linux/lucene/common-build.xml:976: There were test
failures: 471 suites, 1875 tests, 2 suite-level errors, 1 failure, 959 ignored (18 assumptions)

Total time: 77 minutes 38 seconds
Build step 'Invoke Ant' marked build as failure
[description-setter] Description set: Java: 64bit/jdk1.7.0_80-ea-b05 -XX:-UseCompressedOops
-XX:+UseSerialGC
Archiving artifacts
Recording test results
Email was triggered for: Failure - Any
Sending email for trigger: Failure - Any



Mime
View raw message