lucene-dev mailing list archives

Site index · List index
Message view « Date » · « Thread »
Top « Date » · « Thread »
From Policeman Jenkins Server <jenk...@thetaphi.de>
Subject [JENKINS] Lucene-Solr-trunk-MacOSX (64bit/jdk1.8.0) - Build # 2099 - Still Failing!
Date Fri, 27 Mar 2015 02:03:32 GMT
Build: http://jenkins.thetaphi.de/job/Lucene-Solr-trunk-MacOSX/2099/
Java: 64bit/jdk1.8.0 -XX:+UseCompressedOops -XX:+UseSerialGC

1 tests failed.
FAILED:  org.apache.solr.handler.TestSolrConfigHandlerCloud.test

Error Message:


Stack Trace:
java.lang.NullPointerException
	at __randomizedtesting.SeedInfo.seed([799BE67D77D9E6B4:F1CFD9A7D9258B4C]:0)
	at org.apache.solr.core.TestSolrConfigHandler.reqhandlertests(TestSolrConfigHandler.java:382)
	at org.apache.solr.handler.TestSolrConfigHandlerCloud.testReqHandlerAPIs(TestSolrConfigHandlerCloud.java:91)
	at org.apache.solr.handler.TestSolrConfigHandlerCloud.test(TestSolrConfigHandlerCloud.java:77)
	at sun.reflect.NativeMethodAccessorImpl.invoke0(Native Method)
	at sun.reflect.NativeMethodAccessorImpl.invoke(NativeMethodAccessorImpl.java:62)
	at sun.reflect.DelegatingMethodAccessorImpl.invoke(DelegatingMethodAccessorImpl.java:43)
	at java.lang.reflect.Method.invoke(Method.java:497)
	at com.carrotsearch.randomizedtesting.RandomizedRunner.invoke(RandomizedRunner.java:1627)
	at com.carrotsearch.randomizedtesting.RandomizedRunner$6.evaluate(RandomizedRunner.java:836)
	at com.carrotsearch.randomizedtesting.RandomizedRunner$7.evaluate(RandomizedRunner.java:872)
	at com.carrotsearch.randomizedtesting.RandomizedRunner$8.evaluate(RandomizedRunner.java:886)
	at org.apache.solr.BaseDistributedSearchTestCase$ShardsRepeatRule$ShardsFixedStatement.callStatement(BaseDistributedSearchTestCase.java:960)
	at org.apache.solr.BaseDistributedSearchTestCase$ShardsRepeatRule$ShardsStatement.evaluate(BaseDistributedSearchTestCase.java:935)
	at com.carrotsearch.randomizedtesting.rules.SystemPropertiesRestoreRule$1.evaluate(SystemPropertiesRestoreRule.java:53)
	at org.apache.lucene.util.TestRuleSetupTeardownChained$1.evaluate(TestRuleSetupTeardownChained.java:50)
	at org.apache.lucene.util.AbstractBeforeAfterRule$1.evaluate(AbstractBeforeAfterRule.java:46)
	at org.apache.lucene.util.TestRuleThreadAndTestName$1.evaluate(TestRuleThreadAndTestName.java:49)
	at org.apache.lucene.util.TestRuleIgnoreAfterMaxFailures$1.evaluate(TestRuleIgnoreAfterMaxFailures.java:65)
	at org.apache.lucene.util.TestRuleMarkFailure$1.evaluate(TestRuleMarkFailure.java:48)
	at com.carrotsearch.randomizedtesting.rules.StatementAdapter.evaluate(StatementAdapter.java:36)
	at com.carrotsearch.randomizedtesting.ThreadLeakControl$StatementRunner.run(ThreadLeakControl.java:365)
	at com.carrotsearch.randomizedtesting.ThreadLeakControl.forkTimeoutingTask(ThreadLeakControl.java:798)
	at com.carrotsearch.randomizedtesting.ThreadLeakControl$3.evaluate(ThreadLeakControl.java:458)
	at com.carrotsearch.randomizedtesting.RandomizedRunner.runSingleTest(RandomizedRunner.java:845)
	at com.carrotsearch.randomizedtesting.RandomizedRunner$3.evaluate(RandomizedRunner.java:747)
	at com.carrotsearch.randomizedtesting.RandomizedRunner$4.evaluate(RandomizedRunner.java:781)
	at com.carrotsearch.randomizedtesting.RandomizedRunner$5.evaluate(RandomizedRunner.java:792)
	at com.carrotsearch.randomizedtesting.rules.StatementAdapter.evaluate(StatementAdapter.java:36)
	at com.carrotsearch.randomizedtesting.rules.SystemPropertiesRestoreRule$1.evaluate(SystemPropertiesRestoreRule.java:53)
	at org.apache.lucene.util.AbstractBeforeAfterRule$1.evaluate(AbstractBeforeAfterRule.java:46)
	at com.carrotsearch.randomizedtesting.rules.StatementAdapter.evaluate(StatementAdapter.java:36)
	at org.apache.lucene.util.TestRuleStoreClassName$1.evaluate(TestRuleStoreClassName.java:42)
	at com.carrotsearch.randomizedtesting.rules.NoShadowingOrOverridesOnMethodsRule$1.evaluate(NoShadowingOrOverridesOnMethodsRule.java:39)
	at com.carrotsearch.randomizedtesting.rules.NoShadowingOrOverridesOnMethodsRule$1.evaluate(NoShadowingOrOverridesOnMethodsRule.java:39)
	at com.carrotsearch.randomizedtesting.rules.StatementAdapter.evaluate(StatementAdapter.java:36)
	at com.carrotsearch.randomizedtesting.rules.StatementAdapter.evaluate(StatementAdapter.java:36)
	at com.carrotsearch.randomizedtesting.rules.StatementAdapter.evaluate(StatementAdapter.java:36)
	at org.apache.lucene.util.TestRuleAssertionsRequired$1.evaluate(TestRuleAssertionsRequired.java:54)
	at org.apache.lucene.util.TestRuleMarkFailure$1.evaluate(TestRuleMarkFailure.java:48)
	at org.apache.lucene.util.TestRuleIgnoreAfterMaxFailures$1.evaluate(TestRuleIgnoreAfterMaxFailures.java:65)
	at org.apache.lucene.util.TestRuleIgnoreTestSuites$1.evaluate(TestRuleIgnoreTestSuites.java:55)
	at com.carrotsearch.randomizedtesting.rules.StatementAdapter.evaluate(StatementAdapter.java:36)
	at com.carrotsearch.randomizedtesting.ThreadLeakControl$StatementRunner.run(ThreadLeakControl.java:365)
	at java.lang.Thread.run(Thread.java:745)




Build Log:
[...truncated 9226 lines...]
   [junit4] Suite: org.apache.solr.handler.TestSolrConfigHandlerCloud
   [junit4]   2> Creating dataDir: /Users/jenkins/workspace/Lucene-Solr-trunk-MacOSX/solr/build/solr-core/test/J1/temp/solr.handler.TestSolrConfigHandlerCloud 799BE67D77D9E6B4-001/init-core-data-001
   [junit4]   2> 415989 T1983 oas.SolrTestCaseJ4.buildSSLConfig Randomized ssl (false) and clientAuth (false)
   [junit4]   2> 415989 T1983 oas.BaseDistributedSearchTestCase.initHostContext Setting hostContext system property: /mz_yj/p
   [junit4]   2> 415991 T1983 oasc.ZkTestServer.run STARTING ZK TEST SERVER
   [junit4]   1> client port:0.0.0.0/0.0.0.0:0
   [junit4]   2> 415991 T1984 oasc.ZkTestServer$ZKServerMain.runFromConfig Starting server
   [junit4]   2> 416092 T1983 oasc.ZkTestServer.run start zk server on port:64150
   [junit4]   2> 416093 T1983 oascc.SolrZkClient.createZkCredentialsToAddAutomatically Using default ZkCredentialsProvider
   [junit4]   2> 416094 T1983 oascc.ConnectionManager.waitForConnected Waiting for client to connect to ZooKeeper
   [junit4]   2> 416099 T1991 oascc.ConnectionManager.process Watcher org.apache.solr.common.cloud.ConnectionManager@5c14c5a6 name:ZooKeeperConnection Watcher:127.0.0.1:64150 got event WatchedEvent state:SyncConnected type:None path:null path:null type:None
   [junit4]   2> 416099 T1983 oascc.ConnectionManager.waitForConnected Client is connected to ZooKeeper
   [junit4]   2> 416099 T1983 oascc.SolrZkClient.createZkACLProvider Using default ZkACLProvider
   [junit4]   2> 416099 T1983 oascc.SolrZkClient.makePath makePath: /solr
   [junit4]   2> 416105 T1983 oascc.SolrZkClient.createZkCredentialsToAddAutomatically Using default ZkCredentialsProvider
   [junit4]   2> 416107 T1983 oascc.ConnectionManager.waitForConnected Waiting for client to connect to ZooKeeper
   [junit4]   2> 416110 T1994 oascc.ConnectionManager.process Watcher org.apache.solr.common.cloud.ConnectionManager@475f463 name:ZooKeeperConnection Watcher:127.0.0.1:64150/solr got event WatchedEvent state:SyncConnected type:None path:null path:null type:None
   [junit4]   2> 416110 T1983 oascc.ConnectionManager.waitForConnected Client is connected to ZooKeeper
   [junit4]   2> 416110 T1983 oascc.SolrZkClient.createZkACLProvider Using default ZkACLProvider
   [junit4]   2> 416110 T1983 oascc.SolrZkClient.makePath makePath: /collections/collection1
   [junit4]   2> 416115 T1983 oascc.SolrZkClient.makePath makePath: /collections/collection1/shards
   [junit4]   2> 416119 T1983 oascc.SolrZkClient.makePath makePath: /collections/control_collection
   [junit4]   2> 416123 T1983 oascc.SolrZkClient.makePath makePath: /collections/control_collection/shards
   [junit4]   2> 416127 T1983 oasc.AbstractZkTestCase.putConfig put /Users/jenkins/workspace/Lucene-Solr-trunk-MacOSX/solr/core/src/test-files/solr/collection1/conf/solrconfig-tlog.xml to /configs/conf1/solrconfig.xml
   [junit4]   2> 416128 T1983 oascc.SolrZkClient.makePath makePath: /configs/conf1/solrconfig.xml
   [junit4]   2> 416134 T1983 oasc.AbstractZkTestCase.putConfig put /Users/jenkins/workspace/Lucene-Solr-trunk-MacOSX/solr/core/src/test-files/solr/collection1/conf/schema.xml to /configs/conf1/schema.xml
   [junit4]   2> 416135 T1983 oascc.SolrZkClient.makePath makePath: /configs/conf1/schema.xml
   [junit4]   2> 416139 T1983 oasc.AbstractZkTestCase.putConfig put /Users/jenkins/workspace/Lucene-Solr-trunk-MacOSX/solr/core/src/test-files/solr/collection1/conf/solrconfig.snippet.randomindexconfig.xml to /configs/conf1/solrconfig.snippet.randomindexconfig.xml
   [junit4]   2> 416139 T1983 oascc.SolrZkClient.makePath makePath: /configs/conf1/solrconfig.snippet.randomindexconfig.xml
   [junit4]   2> 416143 T1983 oasc.AbstractZkTestCase.putConfig put /Users/jenkins/workspace/Lucene-Solr-trunk-MacOSX/solr/core/src/test-files/solr/collection1/conf/stopwords.txt to /configs/conf1/stopwords.txt
   [junit4]   2> 416144 T1983 oascc.SolrZkClient.makePath makePath: /configs/conf1/stopwords.txt
   [junit4]   2> 416148 T1983 oasc.AbstractZkTestCase.putConfig put /Users/jenkins/workspace/Lucene-Solr-trunk-MacOSX/solr/core/src/test-files/solr/collection1/conf/protwords.txt to /configs/conf1/protwords.txt
   [junit4]   2> 416149 T1983 oascc.SolrZkClient.makePath makePath: /configs/conf1/protwords.txt
   [junit4]   2> 416153 T1983 oasc.AbstractZkTestCase.putConfig put /Users/jenkins/workspace/Lucene-Solr-trunk-MacOSX/solr/core/src/test-files/solr/collection1/conf/currency.xml to /configs/conf1/currency.xml
   [junit4]   2> 416154 T1983 oascc.SolrZkClient.makePath makePath: /configs/conf1/currency.xml
   [junit4]   2> 416158 T1983 oasc.AbstractZkTestCase.putConfig put /Users/jenkins/workspace/Lucene-Solr-trunk-MacOSX/solr/core/src/test-files/solr/collection1/conf/enumsConfig.xml to /configs/conf1/enumsConfig.xml
   [junit4]   2> 416158 T1983 oascc.SolrZkClient.makePath makePath: /configs/conf1/enumsConfig.xml
   [junit4]   2> 416161 T1983 oasc.AbstractZkTestCase.putConfig put /Users/jenkins/workspace/Lucene-Solr-trunk-MacOSX/solr/core/src/test-files/solr/collection1/conf/open-exchange-rates.json to /configs/conf1/open-exchange-rates.json
   [junit4]   2> 416162 T1983 oascc.SolrZkClient.makePath makePath: /configs/conf1/open-exchange-rates.json
   [junit4]   2> 416167 T1983 oasc.AbstractZkTestCase.putConfig put /Users/jenkins/workspace/Lucene-Solr-trunk-MacOSX/solr/core/src/test-files/solr/collection1/conf/mapping-ISOLatin1Accent.txt to /configs/conf1/mapping-ISOLatin1Accent.txt
   [junit4]   2> 416167 T1983 oascc.SolrZkClient.makePath makePath: /configs/conf1/mapping-ISOLatin1Accent.txt
   [junit4]   2> 416171 T1983 oasc.AbstractZkTestCase.putConfig put /Users/jenkins/workspace/Lucene-Solr-trunk-MacOSX/solr/core/src/test-files/solr/collection1/conf/old_synonyms.txt to /configs/conf1/old_synonyms.txt
   [junit4]   2> 416172 T1983 oascc.SolrZkClient.makePath makePath: /configs/conf1/old_synonyms.txt
   [junit4]   2> 416176 T1983 oasc.AbstractZkTestCase.putConfig put /Users/jenkins/workspace/Lucene-Solr-trunk-MacOSX/solr/core/src/test-files/solr/collection1/conf/synonyms.txt to /configs/conf1/synonyms.txt
   [junit4]   2> 416176 T1983 oascc.SolrZkClient.makePath makePath: /configs/conf1/synonyms.txt
   [junit4]   2> 416505 T1983 oas.SolrTestCaseJ4.writeCoreProperties Writing core.properties file to /Users/jenkins/workspace/Lucene-Solr-trunk-MacOSX/solr/build/solr-core/test/J1/temp/solr.handler.TestSolrConfigHandlerCloud 799BE67D77D9E6B4-001/control-001/cores/collection1
   [junit4]   2> 416508 T1983 oejs.Server.doStart jetty-9.2.9.v20150224
   [junit4]   2> 416513 T1983 oejsh.ContextHandler.doStart Started o.e.j.s.ServletContextHandler@3b0f35a9{/mz_yj/p,null,AVAILABLE}
   [junit4]   2> 416530 T1983 oejs.AbstractConnector.doStart Started ServerConnector@5e73de90{HTTP/1.1}{127.0.0.1:64153}
   [junit4]   2> 416531 T1983 oejs.Server.doStart Started @418980ms
   [junit4]   2> 416531 T1983 oascse.JettySolrRunner$1.lifeCycleStarted Jetty properties: {solr.data.dir=/Users/jenkins/workspace/Lucene-Solr-trunk-MacOSX/solr/build/solr-core/test/J1/temp/solr.handler.TestSolrConfigHandlerCloud 799BE67D77D9E6B4-001/tempDir-001/control/data, hostContext=/mz_yj/p, hostPort=64153, coreRootDirectory=/Users/jenkins/workspace/Lucene-Solr-trunk-MacOSX/solr/build/solr-core/test/J1/temp/solr.handler.TestSolrConfigHandlerCloud 799BE67D77D9E6B4-001/control-001/cores}
   [junit4]   2> 416532 T1983 oass.SolrDispatchFilter.init SolrDispatchFilter.init()sun.misc.Launcher$AppClassLoader@74a14482
   [junit4]   2> 416532 T1983 oasc.SolrResourceLoader.<init> new SolrResourceLoader for directory: '/Users/jenkins/workspace/Lucene-Solr-trunk-MacOSX/solr/build/solr-core/test/J1/temp/solr.handler.TestSolrConfigHandlerCloud 799BE67D77D9E6B4-001/control-001/'
   [junit4]   2> 416573 T1983 oasc.SolrXmlConfig.fromFile Loading container configuration from /Users/jenkins/workspace/Lucene-Solr-trunk-MacOSX/solr/build/solr-core/test/J1/temp/solr.handler.TestSolrConfigHandlerCloud 799BE67D77D9E6B4-001/control-001/solr.xml
   [junit4]   2> 416586 T1983 oasc.CorePropertiesLocator.<init> Config-defined core root directory: /Users/jenkins/workspace/Lucene-Solr-trunk-MacOSX/solr/build/solr-core/test/J1/temp/solr.handler.TestSolrConfigHandlerCloud 799BE67D77D9E6B4-001/control-001/cores
   [junit4]   2> 416586 T1983 oasc.CoreContainer.<init> New CoreContainer 1471214425
   [junit4]   2> 416586 T1983 oasc.CoreContainer.load Loading cores into CoreContainer [instanceDir=/Users/jenkins/workspace/Lucene-Solr-trunk-MacOSX/solr/build/solr-core/test/J1/temp/solr.handler.TestSolrConfigHandlerCloud 799BE67D77D9E6B4-001/control-001/]
   [junit4]   2> 416586 T1983 oasc.CoreContainer.load loading shared library: /Users/jenkins/workspace/Lucene-Solr-trunk-MacOSX/solr/build/solr-core/test/J1/temp/solr.handler.TestSolrConfigHandlerCloud 799BE67D77D9E6B4-001/control-001/lib
   [junit4]   2> 416588 T1983 oasc.SolrResourceLoader.addToClassLoader WARN Can't find (or read) directory to add to classloader: lib (resolved as: /Users/jenkins/workspace/Lucene-Solr-trunk-MacOSX/solr/build/solr-core/test/J1/temp/solr.handler.TestSolrConfigHandlerCloud 799BE67D77D9E6B4-001/control-001/lib).
   [junit4]   2> 416602 T1983 oashc.HttpShardHandlerFactory.getParameter Setting socketTimeout to: 90000
   [junit4]   2> 416603 T1983 oashc.HttpShardHandlerFactory.getParameter Setting urlScheme to: 
   [junit4]   2> 416603 T1983 oashc.HttpShardHandlerFactory.getParameter Setting connTimeout to: 15000
   [junit4]   2> 416603 T1983 oashc.HttpShardHandlerFactory.getParameter Setting maxConnectionsPerHost to: 20
   [junit4]   2> 416604 T1983 oashc.HttpShardHandlerFactory.getParameter Setting maxConnections to: 10000
   [junit4]   2> 416604 T1983 oashc.HttpShardHandlerFactory.getParameter Setting corePoolSize to: 0
   [junit4]   2> 416604 T1983 oashc.HttpShardHandlerFactory.getParameter Setting maximumPoolSize to: 2147483647
   [junit4]   2> 416605 T1983 oashc.HttpShardHandlerFactory.getParameter Setting maxThreadIdleTime to: 5
   [junit4]   2> 416605 T1983 oashc.HttpShardHandlerFactory.getParameter Setting sizeOfQueue to: -1
   [junit4]   2> 416605 T1983 oashc.HttpShardHandlerFactory.getParameter Setting fairnessPolicy to: false
   [junit4]   2> 416606 T1983 oashc.HttpShardHandlerFactory.getParameter Setting useRetries to: false
   [junit4]   2> 416606 T1983 oasu.UpdateShardHandler.<init> Creating UpdateShardHandler HTTP client with params: socketTimeout=340000&connTimeout=45000&retry=true
   [junit4]   2> 416607 T1983 oasl.LogWatcher.createWatcher SLF4J impl is org.slf4j.impl.Log4jLoggerFactory
   [junit4]   2> 416607 T1983 oasl.LogWatcher.newRegisteredLogWatcher Registering Log Listener [Log4j (org.slf4j.impl.Log4jLoggerFactory)]
   [junit4]   2> 416607 T1983 oasc.CoreContainer.load Node Name: 127.0.0.1
   [junit4]   2> 416607 T1983 oasc.ZkContainer.initZooKeeper Zookeeper client=127.0.0.1:64150/solr
   [junit4]   2> 416608 T1983 oasc.ZkController.checkChrootPath zkHost includes chroot
   [junit4]   2> 416608 T1983 oascc.SolrZkClient.createZkCredentialsToAddAutomatically Using default ZkCredentialsProvider
   [junit4]   2> 416612 T1983 oascc.ConnectionManager.waitForConnected Waiting for client to connect to ZooKeeper
   [junit4]   2> 416618 T2008 oascc.ConnectionManager.process Watcher org.apache.solr.common.cloud.ConnectionManager@ba95b14 name:ZooKeeperConnection Watcher:127.0.0.1:64150 got event WatchedEvent state:SyncConnected type:None path:null path:null type:None
   [junit4]   2> 416620 T1983 oascc.ConnectionManager.waitForConnected Client is connected to ZooKeeper
   [junit4]   2> 416621 T1983 oascc.SolrZkClient.createZkACLProvider Using default ZkACLProvider
   [junit4]   2> 416626 T1983 oascc.ConnectionManager.waitForConnected Waiting for client to connect to ZooKeeper
   [junit4]   2> 416630 T2011 oascc.ConnectionManager.process Watcher org.apache.solr.common.cloud.ConnectionManager@7614410d name:ZooKeeperConnection Watcher:127.0.0.1:64150/solr got event WatchedEvent state:SyncConnected type:None path:null path:null type:None
   [junit4]   2> 416630 T1983 oascc.ConnectionManager.waitForConnected Client is connected to ZooKeeper
   [junit4]   2> 416634 T1983 oascc.SolrZkClient.makePath makePath: /overseer/queue
   [junit4]   2> 416639 T1983 oascc.SolrZkClient.makePath makePath: /overseer/collection-queue-work
   [junit4]   2> 416645 T1983 oascc.SolrZkClient.makePath makePath: /overseer/collection-map-running
   [junit4]   2> 416650 T1983 oascc.SolrZkClient.makePath makePath: /overseer/collection-map-completed
   [junit4]   2> 416655 T1983 oascc.SolrZkClient.makePath makePath: /overseer/collection-map-failure
   [junit4]   2> 416661 T1983 oascc.SolrZkClient.makePath makePath: /live_nodes
   [junit4]   2> 416665 T1983 oascc.SolrZkClient.makePath makePath: /aliases.json
   [junit4]   2> 416668 T1983 oascc.SolrZkClient.makePath makePath: /clusterstate.json
   [junit4]   2> 416671 T1983 oasc.ZkController.createEphemeralLiveNode Register node as live in ZooKeeper:/live_nodes/127.0.0.1:64153_mz_yj%2Fp
   [junit4]   2> 416672 T1983 oascc.SolrZkClient.makePath makePath: /live_nodes/127.0.0.1:64153_mz_yj%2Fp
   [junit4]   2> 416676 T1983 oascc.SolrZkClient.makePath makePath: /overseer_elect
   [junit4]   2> 416679 T1983 oascc.SolrZkClient.makePath makePath: /overseer_elect/election
   [junit4]   2> 416683 T1983 oasc.Overseer.close Overseer (id=null) closing
   [junit4]   2> 416687 T1983 oasc.OverseerElectionContext.runLeaderProcess I am going to be the leader 127.0.0.1:64153_mz_yj%2Fp
   [junit4]   2> 416687 T1983 oascc.SolrZkClient.makePath makePath: /overseer_elect/leader
   [junit4]   2> 416691 T1983 oasc.Overseer.start Overseer (id=93547379087835139-127.0.0.1:64153_mz_yj%2Fp-n_0000000000) starting
   [junit4]   2> 416696 T1983 oascc.SolrZkClient.makePath makePath: /overseer/queue-work
   [junit4]   2> 416712 T1983 oasc.OverseerAutoReplicaFailoverThread.<init> Starting OverseerAutoReplicaFailoverThread autoReplicaFailoverWorkLoopDelay=10000 autoReplicaFailoverWaitAfterExpiration=30000 autoReplicaFailoverBadNodeExpiration=60000
   [junit4]   2> 416713 T2013 oasc.OverseerCollectionProcessor.run Process current queue of collection creations
   [junit4]   2> 416713 T1983 oascc.ZkStateReader.createClusterStateWatchersAndUpdate Updating cluster state from ZooKeeper... 
   [junit4]   2> 416714 T2012 oasc.Overseer$ClusterStateUpdater.run Starting to work on the main queue
   [junit4]   2> 416726 T1983 oasc.CorePropertiesLocator.discover Looking for core definitions underneath /Users/jenkins/workspace/Lucene-Solr-trunk-MacOSX/solr/build/solr-core/test/J1/temp/solr.handler.TestSolrConfigHandlerCloud 799BE67D77D9E6B4-001/control-001/cores
   [junit4]   2> 416728 T1983 oasc.CoreDescriptor.<init> CORE DESCRIPTOR: {name=collection1, config=solrconfig.xml, transient=false, schema=schema.xml, loadOnStartup=true, instanceDir=/Users/jenkins/workspace/Lucene-Solr-trunk-MacOSX/solr/build/solr-core/test/J1/temp/solr.handler.TestSolrConfigHandlerCloud 799BE67D77D9E6B4-001/control-001/cores/collection1, collection=control_collection, absoluteInstDir=/Users/jenkins/workspace/Lucene-Solr-trunk-MacOSX/solr/build/solr-core/test/J1/temp/solr.handler.TestSolrConfigHandlerCloud 799BE67D77D9E6B4-001/control-001/cores/collection1/, coreNodeName=, dataDir=data/, shard=}
   [junit4]   2> 416728 T1983 oasc.CorePropertiesLocator.discoverUnder Found core collection1 in /Users/jenkins/workspace/Lucene-Solr-trunk-MacOSX/solr/build/solr-core/test/J1/temp/solr.handler.TestSolrConfigHandlerCloud 799BE67D77D9E6B4-001/control-001/cores/collection1/
   [junit4]   2> 416728 T1983 oasc.CorePropertiesLocator.discover Found 1 core definitions
   [junit4]   2> 416730 T2015 C:control_collection c:collection1 oasc.ZkController.publish publishing core=collection1 state=down collection=control_collection
   [junit4]   2> 416730 T2015 C:control_collection c:collection1 oasc.ZkController.publish numShards not found on descriptor - reading it from system property
   [junit4]   2> 416731 T2011 oasc.DistributedQueue$LatchWatcher.process NodeChildrenChanged fired on path /overseer/queue state SyncConnected
   [junit4]   2> 416731 T2015 C:control_collection c:collection1 oasc.ZkController.waitForCoreNodeName look for our core node name
   [junit4]   2> 416733 T2012 oasc.Overseer$ClusterStateUpdater.run processMessage: queueSize: 1, message = {
   [junit4]   2> 	  "core":"collection1",
   [junit4]   2> 	  "roles":null,
   [junit4]   2> 	  "base_url":"http://127.0.0.1:64153/mz_yj/p",
   [junit4]   2> 	  "node_name":"127.0.0.1:64153_mz_yj%2Fp",
   [junit4]   2> 	  "numShards":"1",
   [junit4]   2> 	  "state":"down",
   [junit4]   2> 	  "shard":null,
   [junit4]   2> 	  "collection":"control_collection",
   [junit4]   2> 	  "operation":"state"} current state version: 0
   [junit4]   2> 416734 T2012 oasco.ReplicaMutator.updateState Update state numShards=1 message={
   [junit4]   2> 	  "core":"collection1",
   [junit4]   2> 	  "roles":null,
   [junit4]   2> 	  "base_url":"http://127.0.0.1:64153/mz_yj/p",
   [junit4]   2> 	  "node_name":"127.0.0.1:64153_mz_yj%2Fp",
   [junit4]   2> 	  "numShards":"1",
   [junit4]   2> 	  "state":"down",
   [junit4]   2> 	  "shard":null,
   [junit4]   2> 	  "collection":"control_collection",
   [junit4]   2> 	  "operation":"state"}
   [junit4]   2> 416734 T2012 oasco.ClusterStateMutator.createCollection building a new cName: control_collection
   [junit4]   2> 416735 T2012 oasco.ReplicaMutator.updateState Assigning new node to shard shard=shard1
   [junit4]   2> 416738 T2011 oascc.ZkStateReader$2.process A cluster state change: WatchedEvent state:SyncConnected type:NodeDataChanged path:/clusterstate.json, has occurred - updating... (live nodes size: 1)
   [junit4]   2> 417734 T2015 C:control_collection c:collection1 oasc.ZkController.waitForShardId waiting to find shard id in clusterstate for collection1
   [junit4]   2> 417734 T2015 C:control_collection c:collection1 oasc.ZkController.createCollectionZkNode Check for collection zkNode:control_collection
   [junit4]   2> 417735 T2015 C:control_collection c:collection1 oasc.ZkController.createCollectionZkNode Collection zkNode exists
   [junit4]   2> 417735 T2015 C:control_collection c:collection1 oascc.ZkStateReader.readConfigName Load collection config from:/collections/control_collection
   [junit4]   2> 417736 T2015 C:control_collection c:collection1 oascc.ZkStateReader.readConfigName path=/collections/control_collection configName=conf1 specified config exists in ZooKeeper
   [junit4]   2> 417737 T2015 C:control_collection c:collection1 oasc.SolrResourceLoader.<init> new SolrResourceLoader for directory: '/Users/jenkins/workspace/Lucene-Solr-trunk-MacOSX/solr/build/solr-core/test/J1/temp/solr.handler.TestSolrConfigHandlerCloud 799BE67D77D9E6B4-001/control-001/cores/collection1/'
   [junit4]   2> 417763 T2015 C:control_collection c:collection1 oasc.ZkController.watchZKConfDir watch zkdir /configs/conf1
   [junit4]   2> 417767 T2015 C:control_collection c:collection1 oasc.Config.<init> loaded config solrconfig.xml with version 0 
   [junit4]   2> 417813 T2015 C:control_collection c:collection1 oasc.SolrConfig.refreshRequestParams current version of requestparams : -1
   [junit4]   2> 417815 T2015 C:control_collection c:collection1 oasc.SolrConfig.<init> Using Lucene MatchVersion: 6.0.0
   [junit4]   2> 417838 T2015 C:control_collection c:collection1 oasc.SolrConfig.<init> Loaded SolrConfig: solrconfig.xml
   [junit4]   2> 417854 T2015 C:control_collection c:collection1 oass.IndexSchema.readSchema Reading Solr Schema from /configs/conf1/schema.xml
   [junit4]   2> 417858 T2015 C:control_collection c:collection1 oass.IndexSchema.readSchema [collection1] Schema name=test
   [junit4]   2> 417999 T2015 C:control_collection c:collection1 oass.OpenExchangeRatesOrgProvider.init Initialized with rates=open-exchange-rates.json, refreshInterval=1440.
   [junit4]   2> 418006 T2015 C:control_collection c:collection1 oass.IndexSchema.readSchema default search field in schema is text
   [junit4]   2> 418007 T2015 C:control_collection c:collection1 oass.IndexSchema.readSchema unique key field: id
   [junit4]   2> 418024 T2015 C:control_collection c:collection1 oass.FileExchangeRateProvider.reload Reloading exchange rates from file currency.xml
   [junit4]   2> 418027 T2015 C:control_collection c:collection1 oass.FileExchangeRateProvider.reload Reloading exchange rates from file currency.xml
   [junit4]   2> 418030 T2015 C:control_collection c:collection1 oass.OpenExchangeRatesOrgProvider.reload Reloading exchange rates from open-exchange-rates.json
   [junit4]   2> 418031 T2015 C:control_collection c:collection1 oass.OpenExchangeRatesOrgProvider$OpenExchangeRates.<init> WARN Unknown key IMPORTANT NOTE
   [junit4]   2> 418031 T2015 C:control_collection c:collection1 oass.OpenExchangeRatesOrgProvider$OpenExchangeRates.<init> WARN Expected key, got STRING
   [junit4]   2> 418031 T2015 C:control_collection c:collection1 oass.OpenExchangeRatesOrgProvider.reload Reloading exchange rates from open-exchange-rates.json
   [junit4]   2> 418033 T2015 C:control_collection c:collection1 oass.OpenExchangeRatesOrgProvider$OpenExchangeRates.<init> WARN Unknown key IMPORTANT NOTE
   [junit4]   2> 418034 T2015 C:control_collection c:collection1 oass.OpenExchangeRatesOrgProvider$OpenExchangeRates.<init> WARN Expected key, got STRING
   [junit4]   2> 418034 T2015 C:control_collection c:collection1 oasc.CoreContainer.create Creating SolrCore 'collection1' using configuration from collection control_collection
   [junit4]   2> 418034 T2015 C:control_collection c:collection1 oasc.SolrCore.initDirectoryFactory org.apache.solr.core.MockDirectoryFactory
   [junit4]   2> 418034 T2015 C:control_collection c:collection1 oasc.SolrCore.<init> [collection1] Opening new SolrCore at /Users/jenkins/workspace/Lucene-Solr-trunk-MacOSX/solr/build/solr-core/test/J1/temp/solr.handler.TestSolrConfigHandlerCloud 799BE67D77D9E6B4-001/control-001/cores/collection1/, dataDir=/Users/jenkins/workspace/Lucene-Solr-trunk-MacOSX/solr/build/solr-core/test/J1/temp/solr.handler.TestSolrConfigHandlerCloud 799BE67D77D9E6B4-001/control-001/cores/collection1/data/
   [junit4]   2> 418034 T2015 C:control_collection c:collection1 oasc.JmxMonitoredMap.<init> JMX monitoring is enabled. Adding Solr mbeans to JMX Server: com.sun.jmx.mbeanserver.JmxMBeanServer@664c443b
   [junit4]   2> 418035 T2015 C:control_collection c:collection1 oasc.CachingDirectoryFactory.get return new directory for /Users/jenkins/workspace/Lucene-Solr-trunk-MacOSX/solr/build/solr-core/test/J1/temp/solr.handler.TestSolrConfigHandlerCloud 799BE67D77D9E6B4-001/control-001/cores/collection1/data
   [junit4]   2> 418035 T2015 C:control_collection c:collection1 oasc.SolrCore.getNewIndexDir New index directory detected: old=null new=/Users/jenkins/workspace/Lucene-Solr-trunk-MacOSX/solr/build/solr-core/test/J1/temp/solr.handler.TestSolrConfigHandlerCloud 799BE67D77D9E6B4-001/control-001/cores/collection1/data/index/
   [junit4]   2> 418035 T2015 C:control_collection c:collection1 oasc.SolrCore.initIndex WARN [collection1] Solr index directory '/Users/jenkins/workspace/Lucene-Solr-trunk-MacOSX/solr/build/solr-core/test/J1/temp/solr.handler.TestSolrConfigHandlerCloud 799BE67D77D9E6B4-001/control-001/cores/collection1/data/index' doesn't exist. Creating new index...
   [junit4]   2> 418035 T2015 C:control_collection c:collection1 oasc.CachingDirectoryFactory.get return new directory for /Users/jenkins/workspace/Lucene-Solr-trunk-MacOSX/solr/build/solr-core/test/J1/temp/solr.handler.TestSolrConfigHandlerCloud 799BE67D77D9E6B4-001/control-001/cores/collection1/data/index
   [junit4]   2> 418036 T2015 C:control_collection c:collection1 oasu.RandomMergePolicy.<init> RandomMergePolicy wrapping class org.apache.lucene.index.TieredMergePolicy: [TieredMergePolicy: maxMergeAtOnce=37, maxMergeAtOnceExplicit=25, maxMergedSegmentMB=40.611328125, floorSegmentMB=1.3447265625, forceMergeDeletesPctAllowed=26.12088765201614, segmentsPerTier=50.0, maxCFSSegmentSizeMB=8.796093022207999E12, noCFSRatio=0.6920041567443677
   [junit4]   2> 418036 T2015 C:control_collection c:collection1 oasc.SolrDeletionPolicy.onCommit SolrDeletionPolicy.onCommit: commits: num=1
   [junit4]   2> 		commit{dir=MockDirectoryWrapper(RAMDirectory@4a55d0af lockFactory=org.apache.lucene.store.SingleInstanceLockFactory@45588c4d),segFN=segments_1,generation=1}
   [junit4]   2> 418036 T2015 C:control_collection c:collection1 oasc.SolrDeletionPolicy.updateCommits newest commit generation = 1
   [junit4]   2> 418040 T2015 C:control_collection c:collection1 oasup.UpdateRequestProcessorChain.init creating updateRequestProcessorChain "nodistrib"
   [junit4]   2> 418040 T2015 C:control_collection c:collection1 oasup.UpdateRequestProcessorChain.init creating updateRequestProcessorChain "dedupe"
   [junit4]   2> 418040 T2015 C:control_collection c:collection1 oasup.UpdateRequestProcessorChain.init inserting DistributedUpdateProcessorFactory into updateRequestProcessorChain "dedupe"
   [junit4]   2> 418041 T2015 C:control_collection c:collection1 oasup.UpdateRequestProcessorChain.init creating updateRequestProcessorChain "stored_sig"
   [junit4]   2> 418041 T2015 C:control_collection c:collection1 oasup.UpdateRequestProcessorChain.init inserting DistributedUpdateProcessorFactory into updateRequestProcessorChain "stored_sig"
   [junit4]   2> 418041 T2015 C:control_collection c:collection1 oasup.UpdateRequestProcessorChain.init creating updateRequestProcessorChain "distrib-dup-test-chain-explicit"
   [junit4]   2> 418041 T2015 C:control_collection c:collection1 oasup.UpdateRequestProcessorChain.init creating updateRequestProcessorChain "distrib-dup-test-chain-implicit"
   [junit4]   2> 418041 T2015 C:control_collection c:collection1 oasup.UpdateRequestProcessorChain.init inserting DistributedUpdateProcessorFactory into updateRequestProcessorChain "distrib-dup-test-chain-implicit"
   [junit4]   2> 418041 T2015 C:control_collection c:collection1 oasc.SolrCore.loadUpdateProcessorChains no updateRequestProcessorChain defined as default, creating implicit default
   [junit4]   2> 418048 T2015 C:control_collection c:collection1 oashl.XMLLoader.init xsltCacheLifetimeSeconds=60
   [junit4]   2> 418050 T2015 C:control_collection c:collection1 oashl.XMLLoader.init xsltCacheLifetimeSeconds=60
   [junit4]   2> 418051 T2015 C:control_collection c:collection1 oashl.XMLLoader.init xsltCacheLifetimeSeconds=60
   [junit4]   2> 418053 T2015 C:control_collection c:collection1 oashl.XMLLoader.init xsltCacheLifetimeSeconds=60
   [junit4]   2> 418057 T2015 C:control_collection c:collection1 oasc.RequestHandlers.initHandlersFromConfig Registered paths: /admin/mbeans,standard,/update/csv,/update/json/docs,/admin/luke,/admin/segments,/get,/admin/system,/replication,/admin/properties,/config,/schema,/admin/plugins,/admin/logging,/update/json,/admin/threads,/admin/ping,/update,/admin/file
   [junit4]   2> 418057 T2015 C:control_collection c:collection1 oasc.SolrCore.initStatsCache Using default statsCache cache: org.apache.solr.search.stats.LocalStatsCache
   [junit4]   2> 418058 T2015 C:control_collection c:collection1 oasu.UpdateHandler.<init> Using UpdateLog implementation: org.apache.solr.update.UpdateLog
   [junit4]   2> 418059 T2015 C:control_collection c:collection1 oasu.UpdateLog.init Initializing UpdateLog: dataDir= defaultSyncLevel=FLUSH numRecordsToKeep=100 maxNumLogsToKeep=10
   [junit4]   2> 418060 T2015 C:control_collection c:collection1 oasu.CommitTracker.<init> Hard AutoCommit: disabled
   [junit4]   2> 418060 T2015 C:control_collection c:collection1 oasu.CommitTracker.<init> Soft AutoCommit: disabled
   [junit4]   2> 418060 T2015 C:control_collection c:collection1 oasu.RandomMergePolicy.<init> RandomMergePolicy wrapping class org.apache.lucene.index.LogDocMergePolicy: [LogDocMergePolicy: minMergeSize=1000, mergeFactor=37, maxMergeSize=9223372036854775807, maxMergeSizeForForcedMerge=9223372036854775807, calibrateSizeByDeletes=false, maxMergeDocs=2147483647, maxCFSSegmentSizeMB=8.796093022207999E12, noCFSRatio=0.0]
   [junit4]   2> 418060 T2015 C:control_collection c:collection1 oasc.SolrDeletionPolicy.onInit SolrDeletionPolicy.onInit: commits: num=1
   [junit4]   2> 		commit{dir=MockDirectoryWrapper(RAMDirectory@4a55d0af lockFactory=org.apache.lucene.store.SingleInstanceLockFactory@45588c4d),segFN=segments_1,generation=1}
   [junit4]   2> 418061 T2015 C:control_collection c:collection1 oasc.SolrDeletionPolicy.updateCommits newest commit generation = 1
   [junit4]   2> 418061 T2015 C:control_collection c:collection1 oass.SolrIndexSearcher.<init> Opening Searcher@e0932c1[collection1] main
   [junit4]   2> 418061 T2015 C:control_collection c:collection1 oascc.ZkStateReader.readConfigName Load collection config from:/collections/control_collection
   [junit4]   2> 418063 T2015 C:control_collection c:collection1 oascc.ZkStateReader.readConfigName path=/collections/control_collection configName=conf1 specified config exists in ZooKeeper
   [junit4]   2> 418063 T2015 C:control_collection c:collection1 oasr.ManagedResourceStorage.newStorageIO Setting up ZooKeeper-based storage for the RestManager with znodeBase: /configs/conf1
   [junit4]   2> 418066 T2015 C:control_collection c:collection1 oasr.ManagedResourceStorage$ZooKeeperStorageIO.configure Configured ZooKeeperStorageIO with znodeBase: /configs/conf1
   [junit4]   2> 418066 T2015 C:control_collection c:collection1 oasr.RestManager.init Initializing RestManager with initArgs: {}
   [junit4]   2> 418066 T2015 C:control_collection c:collection1 oasr.ManagedResourceStorage.load Reading _rest_managed.json using ZooKeeperStorageIO:path=/configs/conf1
   [junit4]   2> 418069 T2015 C:control_collection c:collection1 oasr.ManagedResourceStorage$ZooKeeperStorageIO.openInputStream No data found for znode /configs/conf1/_rest_managed.json
   [junit4]   2> 418069 T2015 C:control_collection c:collection1 oasr.ManagedResourceStorage.load Loaded null at path _rest_managed.json using ZooKeeperStorageIO:path=/configs/conf1
   [junit4]   2> 418069 T2015 C:control_collection c:collection1 oasr.RestManager.init Initializing 0 registered ManagedResources
   [junit4]   2> 418069 T2015 C:control_collection c:collection1 oash.ReplicationHandler.inform Commits will be reserved for  10000
   [junit4]   2> 418071 T2016 C:control_collection c:collection1 oasc.SolrCore.registerSearcher [collection1] Registered new searcher Searcher@e0932c1[collection1] main{ExitableDirectoryReader(UninvertingDirectoryReader())}
   [junit4]   2> 418071 T2015 C:control_collection c:collection1 oasc.CoreContainer.registerCore registering core: collection1
   [junit4]   2> 418075 T2019 C:control_collection S:shard1 oasc.ZkController.register Register replica - core:collection1 address:http://127.0.0.1:64153/mz_yj/p collection:control_collection shard:shard1
   [junit4]   2> 418077 T1983 oass.SolrDispatchFilter.init user.dir=/Users/jenkins/workspace/Lucene-Solr-trunk-MacOSX/solr/build/solr-core/test/J1
   [junit4]   2> 418077 T1983 oass.SolrDispatchFilter.init SolrDispatchFilter.init() done
   [junit4]   2> 418078 T1983 oascc.SolrZkClient.createZkCredentialsToAddAutomatically Using default ZkCredentialsProvider
   [junit4]   2> 418080 T1983 oascc.ConnectionManager.waitForConnected Waiting for client to connect to ZooKeeper
   [junit4]   2> 418081 T2019 C:control_collection S:shard1 oascc.SolrZkClient.makePath makePath: /collections/control_collection/leader_elect/shard1/election
   [junit4]   2> 418088 T2022 oascc.ConnectionManager.process Watcher org.apache.solr.common.cloud.ConnectionManager@7a1ab836 name:ZooKeeperConnection Watcher:127.0.0.1:64150/solr got event WatchedEvent state:SyncConnected type:None path:null path:null type:None
   [junit4]   2> 418088 T1983 oascc.ConnectionManager.waitForConnected Client is connected to ZooKeeper
   [junit4]   2> 418088 T1983 oascc.SolrZkClient.createZkACLProvider Using default ZkACLProvider
   [junit4]   2> 418089 T1983 oascc.ZkStateReader.createClusterStateWatchersAndUpdate Updating cluster state from ZooKeeper... 
   [junit4]   2> 418100 T2019 C:control_collection S:shard1 oasc.ShardLeaderElectionContext.runLeaderProcess Running the leader process for shard shard1
   [junit4]   2> 418100 T1983 oasc.ChaosMonkey.monkeyLog monkey: init - expire sessions:false cause connection loss:false
   [junit4]   2> 418103 T2011 oasc.DistributedQueue$LatchWatcher.process NodeChildrenChanged fired on path /overseer/queue state SyncConnected
   [junit4]   2> 418104 T2019 C:control_collection S:shard1 oasc.ShardLeaderElectionContext.waitForReplicasToComeUp Enough replicas found to continue.
   [junit4]   2> 418104 T2019 C:control_collection S:shard1 oasc.ShardLeaderElectionContext.runLeaderProcess I may be the new leader - try and sync
   [junit4]   2> ASYNC  NEW_CORE C994 name=collection1 org.apache.solr.core.SolrCore@63dd3c00 url=http://127.0.0.1:64153/mz_yj/p/collection1 node=127.0.0.1:64153_mz_yj%2Fp C994_STATE=coll:control_collection core:collection1 props:{core=collection1, base_url=http://127.0.0.1:64153/mz_yj/p, node_name=127.0.0.1:64153_mz_yj%2Fp, state=down}
   [junit4]   2> 418104 T2019 C:control_collection S:shard1 C994 P64153 oasc.SyncStrategy.sync Sync replicas to http://127.0.0.1:64153/mz_yj/p/collection1/
   [junit4]   2> 418104 T2019 C:control_collection S:shard1 C994 P64153 oasc.SyncStrategy.syncReplicas Sync Success - now sync replicas to me
   [junit4]   2> 418104 T2019 C:control_collection S:shard1 C994 P64153 oasc.SyncStrategy.syncToMe http://127.0.0.1:64153/mz_yj/p/collection1/ has no replicas
   [junit4]   2> 418105 T2019 C:control_collection S:shard1 oasc.ShardLeaderElectionContext.runLeaderProcess I am the new leader: http://127.0.0.1:64153/mz_yj/p/collection1/ shard1
   [junit4]   2> 418105 T2019 C:control_collection S:shard1 oascc.SolrZkClient.makePath makePath: /collections/control_collection/leaders/shard1
   [junit4]   2> 418106 T2012 oasc.Overseer$ClusterStateUpdater.run processMessage: queueSize: 1, message = {
   [junit4]   2> 	  "operation":"leader",
   [junit4]   2> 	  "shard":"shard1",
   [junit4]   2> 	  "collection":"control_collection"} current state version: 1
   [junit4]   2> 418127 T2011 oasc.DistributedQueue$LatchWatcher.process NodeChildrenChanged fired on path /overseer/queue state SyncConnected
   [junit4]   2> 418131 T2012 oasc.Overseer$ClusterStateUpdater.run processMessage: queueSize: 1, message = {
   [junit4]   2> 	  "operation":"leader",
   [junit4]   2> 	  "shard":"shard1",
   [junit4]   2> 	  "collection":"control_collection",
   [junit4]   2> 	  "base_url":"http://127.0.0.1:64153/mz_yj/p",
   [junit4]   2> 	  "core":"collection1",
   [junit4]   2> 	  "state":"active"} current state version: 1
   [junit4]   2> 418240 T2022 oascc.ZkStateReader$2.process A cluster state change: WatchedEvent state:SyncConnected type:NodeDataChanged path:/clusterstate.json, has occurred - updating... (live nodes size: 1)
   [junit4]   2> 418241 T2011 oascc.ZkStateReader$2.process A cluster state change: WatchedEvent state:SyncConnected type:NodeDataChanged path:/clusterstate.json, has occurred - updating... (live nodes size: 1)
   [junit4]   2> 418286 T2019 C:control_collection S:shard1 oasc.ZkController.register We are http://127.0.0.1:64153/mz_yj/p/collection1/ and leader is http://127.0.0.1:64153/mz_yj/p/collection1/
   [junit4]   2> 418287 T2019 C:control_collection S:shard1 oasc.ZkController.register No LogReplay needed for core=collection1 baseURL=http://127.0.0.1:64153/mz_yj/p
   [junit4]   2> 418287 T2019 C:control_collection S:shard1 oasc.ZkController.checkRecovery I am the leader, no recovery necessary
   [junit4]   2> 418287 T2019 C:control_collection S:shard1 c:collection1 oasc.ZkController.publish publishing core=collection1 state=active collection=control_collection
   [junit4]   2> 418287 T2019 C:control_collection S:shard1 c:collection1 oasc.ZkController.publish numShards not found on descriptor - reading it from system property
   [junit4]   2> 418290 T2011 oasc.DistributedQueue$LatchWatcher.process NodeChildrenChanged fired on path /overseer/queue state SyncConnected
   [junit4]   2> 418294 T2012 oasc.Overseer$ClusterStateUpdater.run processMessage: queueSize: 1, message = {
   [junit4]   2> 	  "core":"collection1",
   [junit4]   2> 	  "core_node_name":"core_node1",
   [junit4]   2> 	  "roles":null,
   [junit4]   2> 	  "base_url":"http://127.0.0.1:64153/mz_yj/p",
   [junit4]   2> 	  "node_name":"127.0.0.1:64153_mz_yj%2Fp",
   [junit4]   2> 	  "numShards":"2",
   [junit4]   2> 	  "state":"active",
   [junit4]   2> 	  "shard":"shard1",
   [junit4]   2> 	  "collection":"control_collection",
   [junit4]   2> 	  "operation":"state"} current state version: 2
   [junit4]   2> 418295 T2012 oasco.ReplicaMutator.updateState Update state numShards=2 message={
   [junit4]   2> 	  "core":"collection1",
   [junit4]   2> 	  "core_node_name":"core_node1",
   [junit4]   2> 	  "roles":null,
   [junit4]   2> 	  "base_url":"http://127.0.0.1:64153/mz_yj/p",
   [junit4]   2> 	  "node_name":"127.0.0.1:64153_mz_yj%2Fp",
   [junit4]   2> 	  "numShards":"2",
   [junit4]   2> 	  "state":"active",
   [junit4]   2> 	  "shard":"shard1",
   [junit4]   2> 	  "collection":"control_collection",
   [junit4]   2> 	  "operation":"state"}
   [junit4]   2> 418405 T2011 oascc.ZkStateReader$2.process A cluster state change: WatchedEvent state:SyncConnected type:NodeDataChanged path:/clusterstate.json, has occurred - updating... (live nodes size: 1)
   [junit4]   2> 418405 T2022 oascc.ZkStateReader$2.process A cluster state change: WatchedEvent state:SyncConnected type:NodeDataChanged path:/clusterstate.json, has occurred - updating... (live nodes size: 1)
   [junit4]   2> 418540 T1983 oas.SolrTestCaseJ4.writeCoreProperties Writing core.properties file to /Users/jenkins/workspace/Lucene-Solr-trunk-MacOSX/solr/build/solr-core/test/J1/temp/solr.handler.TestSolrConfigHandlerCloud 799BE67D77D9E6B4-001/shard-1-001/cores/collection1
   [junit4]   2> 418542 T1983 oasc.AbstractFullDistribZkTestBase.createJettys create jetty 1 in directory /Users/jenkins/workspace/Lucene-Solr-trunk-MacOSX/solr/build/solr-core/test/J1/temp/solr.handler.TestSolrConfigHandlerCloud 799BE67D77D9E6B4-001/shard-1-001
   [junit4]   2> 418543 T1983 oejs.Server.doStart jetty-9.2.9.v20150224
   [junit4]   2> 418546 T1983 oejsh.ContextHandler.doStart Started o.e.j.s.ServletContextHandler@7624130b{/mz_yj/p,null,AVAILABLE}
   [junit4]   2> 418547 T1983 oejs.AbstractConnector.doStart Started ServerConnector@5e9ca8b1{HTTP/1.1}{127.0.0.1:64165}
   [junit4]   2> 418547 T1983 oejs.Server.doStart Started @420996ms
   [junit4]   2> 418547 T1983 oascse.JettySolrRunner$1.lifeCycleStarted Jetty properties: {solr.data.dir=/Users/jenkins/workspace/Lucene-Solr-trunk-MacOSX/solr/build/solr-core/test/J1/temp/solr.handler.TestSolrConfigHandlerCloud 799BE67D77D9E6B4-001/tempDir-001/jetty1, solrconfig=solrconfig.xml, hostContext=/mz_yj/p, hostPort=64165, coreRootDirectory=/Users/jenkins/workspace/Lucene-Solr-trunk-MacOSX/solr/build/solr-core/test/J1/../../../../../../../../../Users/jenkins/workspace/Lucene-Solr-trunk-MacOSX/solr/build/solr-core/test/J1/temp/solr.handler.TestSolrConfigHandlerCloud 799BE67D77D9E6B4-001/shard-1-001/cores}
   [junit4]   2> 418548 T1983 oass.SolrDispatchFilter.init SolrDispatchFilter.init()sun.misc.Launcher$AppClassLoader@74a14482
   [junit4]   2> 418548 T1983 oasc.SolrResourceLoader.<init> new SolrResourceLoader for directory: '../../../../../../../../../Users/jenkins/workspace/Lucene-Solr-trunk-MacOSX/solr/build/solr-core/test/J1/temp/solr.handler.TestSolrConfigHandlerCloud 799BE67D77D9E6B4-001/shard-1-001/'
   [junit4]   2> 418580 T1983 oasc.SolrXmlConfig.fromFile Loading container configuration from /Users/jenkins/workspace/Lucene-Solr-trunk-MacOSX/solr/build/solr-core/test/J1/../../../../../../../../../Users/jenkins/workspace/Lucene-Solr-trunk-MacOSX/solr/build/solr-core/test/J1/temp/solr.handler.TestSolrConfigHandlerCloud 799BE67D77D9E6B4-001/shard-1-001/solr.xml
   [junit4]   2> 418590 T1983 oasc.CorePropertiesLocator.<init> Config-defined core root directory: /Users/jenkins/workspace/Lucene-Solr-trunk-MacOSX/solr/build/solr-core/test/J1/../../../../../../../../../Users/jenkins/workspace/Lucene-Solr-trunk-MacOSX/solr/build/solr-core/test/J1/temp/solr.handler.TestSolrConfigHandlerCloud 799BE67D77D9E6B4-001/shard-1-001/cores
   [junit4]   2> 418590 T1983 oasc.CoreContainer.<init> New CoreContainer 449053221
   [junit4]   2> 418591 T1983 oasc.CoreContainer.load Loading cores into CoreContainer [instanceDir=../../../../../../../../../Users/jenkins/workspace/Lucene-Solr-trunk-MacOSX/solr/build/solr-core/test/J1/temp/solr.handler.TestSolrConfigHandlerCloud 799BE67D77D9E6B4-001/shard-1-001/]
   [junit4]   2> 418591 T1983 oasc.CoreContainer.load loading shared library: /Users/jenkins/workspace/Lucene-Solr-trunk-MacOSX/solr/build/solr-core/test/J1/../../../../../../../../../Users/jenkins/workspace/Lucene-Solr-trunk-MacOSX/solr/build/solr-core/test/J1/temp/solr.handler.TestSolrConfigHandlerCloud 799BE67D77D9E6B4-001/shard-1-001/lib
   [junit4]   2> 418592 T1983 oasc.SolrResourceLoader.addToClassLoader WARN Can't find (or read) directory to add to classloader: lib (resolved as: /Users/jenkins/workspace/Lucene-Solr-trunk-MacOSX/solr/build/solr-core/test/J1/../../../../../../../../../Users/jenkins/workspace/Lucene-Solr-trunk-MacOSX/solr/build/solr-core/test/J1/temp/solr.handler.TestSolrConfigHandlerCloud 799BE67D77D9E6B4-001/shard-1-001/lib).
   [junit4]   2> 418602 T1983 oashc.HttpShardHandlerFactory.getParameter Setting socketTimeout to: 90000
   [junit4]   2> 418602 T1983 oashc.HttpShardHandlerFactory.getParameter Setting urlScheme to: 
   [junit4]   2> 418603 T1983 oashc.HttpShardHandlerFactory.getParameter Setting connTimeout to: 15000
   [junit4]   2> 418603 T1983 oashc.HttpShardHandlerFactory.getParameter Setting maxConnectionsPerHost to: 20
   [junit4]   2> 418603 T1983 oashc.HttpShardHandlerFactory.getParameter Setting maxConnections to: 10000
   [junit4]   2> 418603 T1983 oashc.HttpShardHandlerFactory.getParameter Setting corePoolSize to: 0
   [junit4]   2> 418604 T1983 oashc.HttpShardHandlerFactory.getParameter Setting maximumPoolSize to: 2147483647
   [junit4]   2> 418604 T1983 oashc.HttpShardHandlerFactory.getParameter Setting maxThreadIdleTime to: 5
   [junit4]   2> 418604 T1983 oashc.HttpShardHandlerFactory.getParameter Setting sizeOfQueue to: -1
   [junit4]   2> 418604 T1983 oashc.HttpShardHandlerFactory.getParameter Setting fairnessPolicy to: false
   [junit4]   2> 418604 T1983 oashc.HttpShardHandlerFactory.getParameter Setting useRetries to: false
   [junit4]   2> 418605 T1983 oasu.UpdateShardHandler.<init> Creating UpdateShardHandler HTTP client with params: socketTimeout=340000&connTimeout=45000&retry=true
   [junit4]   2> 418605 T1983 oasl.LogWatcher.createWatcher SLF4J impl is org.slf4j.impl.Log4jLoggerFactory
   [junit4]   2> 418605 T1983 oasl.LogWatcher.newRegisteredLogWatcher Registering Log Listener [Log4j (org.slf4j.impl.Log4jLoggerFactory)]
   [junit4]   2> 418605 T1983 oasc.CoreContainer.load Node Name: 127.0.0.1
   [junit4]   2> 418606 T1983 oasc.ZkContainer.initZooKeeper Zookeeper client=127.0.0.1:64150/solr
   [junit4]   2> 418606 T1983 oasc.ZkController.checkChrootPath zkHost includes chroot
   [junit4]   2> 418606 T1983 oascc.SolrZkClient.createZkCredentialsToAddAutomatically Using default ZkCredentialsProvider
   [junit4]   2> 418608 T1983 oascc.ConnectionManager.waitForConnected Waiting for client to connect to ZooKeeper
   [junit4]   2> 418611 T2036 oascc.ConnectionManager.process Watcher org.apache.solr.common.cloud.ConnectionManager@930dc53 name:ZooKeeperConnection Watcher:127.0.0.1:64150 got event WatchedEvent state:SyncConnected type:None path:null path:null type:None
   [junit4]   2> 418612 T1983 oascc.ConnectionManager.waitForConnected Client is connected to ZooKeeper
   [junit4]   2> 418613 T1983 oascc.SolrZkClient.createZkACLProvider Using default ZkACLProvider
   [junit4]   2> 418618 T1983 oascc.ConnectionManager.waitForConnected Waiting for client to connect to ZooKeeper
   [junit4]   2> 418622 T2039 oascc.ConnectionManager.process Watcher org.apache.solr.common.cloud.ConnectionManager@380016c8 name:ZooKeeperConnection Watcher:127.0.0.1:64150/solr got event WatchedEvent state:SyncConnected type:None path:null path:null type:None
   [junit4]   2> 418622 T1983 oascc.ConnectionManager.waitForConnected Client is connected to ZooKeeper
   [junit4]   2> 418634 T1983 oascc.ZkStateReader.createClusterStateWatchersAndUpdate Updating cluster state from ZooKeeper... 
   [junit4]   2> 419649 T1983 oasc.ZkController.createEphemeralLiveNode Register node as live in ZooKeeper:/live_nodes/127.0.0.1:64165_mz_yj%2Fp
   [junit4]   2> 419650 T1983 oascc.SolrZkClient.makePath makePath: /live_nodes/127.0.0.1:64165_mz_yj%2Fp
   [junit4]   2> 419657 T1983 oasc.Overseer.close Overseer (id=null) closing
   [junit4]   2> 419662 T1983 oasc.CorePropertiesLocator.discover Looking for core definitions underneath /Users/jenkins/workspace/Lucene-Solr-trunk-MacOSX/solr/build/solr-core/test/J1/../../../../../../../../../Users/jenkins/workspace/Lucene-Solr-trunk-MacOSX/solr/build/solr-core/test/J1/temp/solr.handler.TestSolrConfigHandlerCloud 799BE67D77D9E6B4-001/shard-1-001/cores
   [junit4]   2> 419666 T1983 oasc.CoreDescriptor.<init> CORE DESCRIPTOR: {name=collection1, config=solrconfig.xml, transient=false, schema=schema.xml, loadOnStartup=true, instanceDir=/Users/jenkins/workspace/Lucene-Solr-trunk-MacOSX/solr/build/solr-core/test/J1/../../../../../../../../../Users/jenkins/workspace/Lucene-Solr-trunk-MacOSX/solr/build/solr-core/test/J1/temp/solr.handler.TestSolrConfigHandlerCloud 799BE67D77D9E6B4-001/shard-1-001/cores/collection1, collection=collection1, absoluteInstDir=/Users/jenkins/workspace/Lucene-Solr-trunk-MacOSX/solr/build/solr-core/test/J1/../../../../../../../../../Users/jenkins/workspace/Lucene-Solr-trunk-MacOSX/solr/build/solr-core/test/J1/temp/solr.handler.TestSolrConfigHandlerCloud 799BE67D77D9E6B4-001/shard-1-001/cores/collection1/, coreNodeName=, dataDir=data/, shard=}
   [junit4]   2> 419666 T1983 oasc.CorePropertiesLocator.discoverUnder Found core collection1 in /Users/jenkins/workspace/Lucene-Solr-trunk-MacOSX/solr/build/solr-core/test/J1/../../../../../../../../../Users/jenkins/workspace/Lucene-Solr-trunk-MacOSX/solr/build/solr-core/test/J1/temp/solr.handler.TestSolrConfigHandlerCloud 799BE67D77D9E6B4-001/shard-1-001/cores/collection1/
   [junit4]   2> 419667 T1983 oasc.CorePropertiesLocator.discover Found 1 core definitions
   [junit4]   2> 419679 T2040 C:collection1 c:collection1 oasc.ZkController.publish publishing core=collection1 state=down collection=collection1
   [junit4]   2> 419679 T2040 C:collection1 c:collection1 oasc.ZkController.publish numShards not found on descriptor - reading it from system property
   [junit4]   2> 419683 T2040 C:collection1 c:collection1 oasc.ZkController.waitForCoreNodeName look for our core node name
   [junit4]   2> 419683 T2011 oasc.DistributedQueue$LatchWatcher.process NodeChildrenChanged fired on path /overseer/queue state SyncConnected
   [junit4]   2> 419696 T2012 oasc.Overseer$ClusterStateUpdater.run processMessage: queueSize: 1, message = {
   [junit4]   2> 	  "core":"collection1",
   [junit4]   2> 	  "roles":null,
   [junit4]   2> 	  "base_url":"http://127.0.0.1:64165/mz_yj/p",
   [junit4]   2> 	  "node_name":"127.0.0.1:64165_mz_yj%2Fp",
   [junit4]   2> 	  "numShards":"2",
   [junit4]   2> 	  "state":"down",
   [junit4]   2> 	  "shard":null,
   [junit4]   2> 	  "collection":"collection1",
   [junit4]   2> 	  "operation":"state"} current state version: 3
   [junit4]   2> 419698 T2012 oasco.ReplicaMutator.updateState Update state numShards=2 message={
   [junit4]   2> 	  "core":"collection1",
   [junit4]   2> 	  "roles":null,
   [junit4]   2> 	  "base_url":"http://127.0.0.1:64165/mz_yj/p",
   [junit4]   2> 	  "node_name":"127.0.0.1:64165_mz_yj%2Fp",
   [junit4]   2> 	  "numShards":"2",
   [junit4]   2> 	  "state":"down",
   [junit4]   2> 	  "shard":null,
   [junit4]   2> 	  "collection":"collection1",
   [junit4]   2> 	  "operation":"state"}
   [junit4]   2> 419698 T2012 oasco.ClusterStateMutator.createCollection building a new cName: collection1
   [junit4]   2> 419698 T2012 oasco.ReplicaMutator.updateState Assigning new node to shard shard=shard2
   [junit4]   2> 419814 T2039 oascc.ZkStateReader$2.process A cluster state change: WatchedEvent state:SyncConnected type:NodeDataChanged path:/clusterstate.json, has occurred - updating... (live nodes size: 2)
   [junit4]   2> 419814 T2022 oascc.ZkStateReader$2.process A cluster state change: WatchedEvent state:SyncConnected type:NodeDataChanged path:/clusterstate.json, has occurred - updating... (live nodes size: 2)
   [junit4]   2> 419814 T2011 oascc.ZkStateReader$2.process A cluster state change: WatchedEvent state:SyncConnected type:NodeDataChanged path:/clusterstate.json, has occurred - updating... (live nodes size: 2)
   [junit4]   2> 420685 T2040 C:collection1 c:collection1 oasc.ZkController.waitForShardId waiting to find shard id in clusterstate for collection1
   [junit4]   2> 420685 T2040 C:collection1 c:collection1 oasc.ZkController.createCollectionZkNode Check for collection zkNode:collection1
   [junit4]   2> 420686 T2040 C:collection1 c:collection1 oasc.ZkController.createCollectionZkNode Collection zkNode exists
   [junit4]   2> 420687 T2040 C:collection1 c:collection1 oascc.ZkStateReader.readConfigName Load collection config from:/collections/collection1
   [junit4]   2> 420689 T2040 C:collection1 c:collection1 oascc.ZkStateReader.readConfigName path=/collections/collection1 configName=conf1 specified config exists in ZooKeeper
   [junit4]   2> 420689 T2040 C:collection1 c:collection1 oasc.SolrResourceLoader.<init> new SolrResourceLoader for directory: '/Users/jenkins/workspace/Lucene-Solr-trunk-MacOSX/solr/build/solr-core/test/J1/../../../../../../../../../Users/jenkins/workspace/Lucene-Solr-trunk-MacOSX/solr/build/solr-core/test/J1/temp/solr.handler.TestSolrConfigHandlerCloud 799BE67D77D9E6B4-001/shard-1-001/cores/collection1/'
   [junit4]   2> 420707 T2040 C:collection1 c:collection1 oasc.ZkController.watchZKConfDir watch zkdir /configs/conf1
   [junit4]   2> 420710 T2040 C:collection1 c:collection1 oasc.Config.<init> loaded config solrconfig.xml with version 0 
   [junit4]   2> 420720 T2040 C:collection1 c:collection1 oasc.SolrConfig.refreshRequestParams current version of requestparams : -1
   [junit4]   2> 420734 T2040 C:collection1 c:collection1 oasc.SolrConfig.<init> Using Lucene MatchVersion: 6.0.0
   [junit4]   2> 420741 T2040 C:collection1 c:collection1 oasc.SolrConfig.<init> Loaded SolrConfig: solrconfig.xml
   [junit4]   2> 420744 T2040 C:collection1 c:collection1 oass.IndexSchema.readSchema Reading Solr Schema from /configs/conf1/schema.xml
   [junit4]   2> 420748 T2040 C:collection1 c:collection1 oass.IndexSchema.readSchema [collection1] Schema name=test
   [junit4]   2> 420883 T2040 C:collection1 c:collection1 oass.OpenExchangeRatesOrgProvider.init Initialized with rates=open-exchange-rates.json, refreshInterval=1440.
   [junit4]   2> 420896 T2040 C:collection1 c:collection1 oass.IndexSchema.readSchema default search field in schema is text
   [junit4]   2> 420898 T2040 C:collection1 c:collection1 oass.IndexSchema.readSchema unique key field: id
   [junit4]   2> 420922 T2040 C:collection1 c:collection1 oass.FileExchangeRateProvider.reload Reloading exchange rates from file currency.xml
   [junit4]   2> 420926 T2040 C:collection1 c:collection1 oass.FileExchangeRateProvider.reload Reloading exchange rates from file currency.xml
   [junit4]   2> 420931 T2040 C:collection1 c:collection1 oass.OpenExchangeRatesOrgProvider.reload Reloading exchange rates from open-exchange-rates.json
   [junit4]   2> 420933 T2040 C:collection1 c:collection1 oass.OpenExchangeRatesOrgProvider$OpenExchangeRates.<init> WARN Unknown key IMPORTANT NOTE
   [junit4]   2> 420934 T2040 C:collection1 c:collection1 oass.OpenExchangeRatesOrgProvider$OpenExchangeRates.<init> WARN Expected key, got STRING
   [junit4]   2> 420934 T2040 C:collection1 c:collection1 oass.OpenExchangeRatesOrgProvider.reload Reloading exchange rates from open-exchange-rates.json
   [junit4]   2> 420936 T2040 C:collection1 c:collection1 oass.OpenExchangeRatesOrgProvider$OpenExchangeRates.<init> WARN Unknown key IMPORTANT NOTE
   [junit4]   2> 420936 T2040 C:collection1 c:collection1 oass.OpenExchangeRatesOrgProvider$OpenExchangeRates.<init> WARN Expected key, got STRING
   [junit4]   2> 420936 T2040 C:collection1 c:collection1 oasc.CoreContainer.create Creating SolrCore 'collection1' using configuration from collection collection1
   [junit4]   2> 420937 T2040 C:collection1 c:collection1 oasc.SolrCore.initDirectoryFactory org.apache.solr.core.MockDirectoryFactory
   [junit4]   2> 420937 T2040 C:collection1 c:collection1 oasc.SolrCore.<init> [collection1] Opening new SolrCore at /Users/jenkins/workspace/Lucene-Solr-trunk-MacOSX/solr/build/solr-core/test/J1/../../../../../../../../../Users/jenkins/workspace/Lucene-Solr-trunk-MacOSX/solr/build/solr-core/test/J1/temp/solr.handler.TestSolrConfigHandlerCloud 799BE67D77D9E6B4-001/shard-1-001/cores/collection1/, dataDir=/Users/jenkins/workspace/Lucene-Solr-trunk-MacOSX/solr/build/solr-core/test/J1/../../../../../../../../../Users/jenkins/workspace/Lucene-Solr-trunk-MacOSX/solr/build/solr-core/test/J1/temp/solr.handler.TestSolrConfigHandlerCloud 799BE67D77D9E6B4-001/shard-1-001/cores/collection1/data/
   [junit4]   2> 420937 T2040 C:collection1 c:collection1 oasc.JmxMonitoredMap.<init> JMX monitoring is enabled. Adding Solr mbeans to JMX Server: com.sun.jmx.mbeanserver.JmxMBeanServer@664c443b
   [junit4]   2> 420938 T2040 C:collection1 c:collection1 oasc.CachingDirectoryFactory.get return new directory for /Users/jenkins/workspace/Lucene-Solr-trunk-MacOSX/solr/build/solr-core/test/J1/../../../../../../../../../Users/jenkins/workspace/Lucene-Solr-trunk-MacOSX/solr/build/solr-core/test/J1/temp/solr.handler.TestSolrConfigHandlerCloud 799BE67D77D9E6B4-001/shard-1-001/cores/collection1/data
   [junit4]   2> 420938 T2040 C:collection1 c:collection1 oasc.SolrCore.getNewIndexDir New index directory detected: old=null new=/Users/jenkins/workspace/Lucene-Solr-trunk-MacOSX/solr/build/solr-core/test/J1/../../../../../../../../../Users/jenkins/workspace/Lucene-Solr-trunk-MacOSX/solr/build/solr-core/test/J1/temp/solr.handler.TestSolrConfigHandlerCloud 799BE67D77D9E6B4-001/shard-1-001/cores/collection1/data/index/
   [junit4]   2> 420938 T2040 C:collection1 c:collection1 oasc.SolrCore.initIndex WARN [collection1] Solr index directory '/Users/jenkins/workspace/Lucene-Solr-trunk-MacOSX/solr/build/solr-core/test/J1/../../../../../../../../../Users/jenkins/workspace/Lucene-Solr-trunk-MacOSX/solr/build/solr-core/test/J1/temp/solr.handler.TestSolrConfigHandlerCloud 799BE67D77D9E6B4-001/shard-1-001/cores/collection1/data/index' doesn't exist. Creating new index...
   [junit4]   2> 420939 T2040 C:collection1 c:collection1 oasc.CachingDirectoryFactory.get return new directory for /Users/jenkins/workspace/Lucene-Solr-trunk-MacOSX/solr/build/solr-core/test/J1/../../../../../../../../../Users/jenkins/workspace/Lucene-Solr-trunk-MacOSX/solr/build/solr-core/test/J1/temp/solr.handler.TestSolrConfigHandlerCloud 799BE67D77D9E6B4-001/shard-1-001/cores/collection1/data/index
   [junit4]   2> 420939 T2040 C:collection1 c:collection1 oasu.RandomMergePolicy.<init> RandomMergePolicy wrapping class org.apache.lucene.index.TieredMergePolicy: [TieredMergePolicy: maxMergeAtOnce=37, maxMergeAtOnceExplicit=25, maxMergedSegmentMB=40.611328125, floorSegmentMB=1.3447265625, forceMergeDeletesPctAllowed=26.12088765201614, segmentsPerTier=50.0, maxCFSSegmentSizeMB=8.796093022207999E12, noCFSRatio=0.6920041567443677
   [junit4]   2> 420940 T2040 C:collection1 c:collection1 oasc.SolrDeletionPolicy.onCommit SolrDeletionPolicy.onCommit: commits: num=1
   [junit4]   2> 		commit{dir=MockDirectoryWrapper(RAMDirectory@18b802cc lockFactory=org.apache.lucene.store.SingleInstanceLockFactory@7385fe6b),segFN=segments_1,generation=1}
   [junit4]   2> 420940 T2040 C:collection1 c:collection1 oasc.SolrDeletionPolicy.updateCommits newest commit generation = 1
   [junit4]   2> 420944 T2040 C:collection1 c:collection1 oasup.UpdateRequestProcessorChain.init creating updateRequestProcessorChain "nodistrib"
   [junit4]   2> 420944 T2040 C:collection1 c:collection1 oasup.UpdateRequestProcessorChain.init creating updateRequestProcessorChain "dedupe"
   [junit4]   2> 420945 T2040 C:collection1 c:collection1 oasup.UpdateRequestProcessorChain.init inserting DistributedUpdateProcessorFactory into updateRequestProcessorChain "dedupe"
   [junit4]   2> 420945 T2040 C:collection1 c:collection1 oasup.UpdateRequestProcessorChain.init creating updateRequestProcessorChain "stored_sig"
   [junit4]   2> 420945 T2040 C:collection1 c:collection1 oasup.UpdateRequestProcessorChain.init inserting DistributedUpdateProcessorFactory into updateRequestProcessorChain "stored_sig"
   [junit4]   2> 420945 T2040 C:collection1 c:collection1 oasup.UpdateRequestProcessorChain.init creating updateRequestProcessorChain "distrib-dup-test-chain-explicit"
   [junit4]   2> 420945 T2040 C:collection1 c:collection1 oasup.UpdateRequestProcessorChain.init creating updateRequestProcessorChain "distrib-dup-test-chain-implicit"
   [junit4]   2> 420946 T2040 C:collection1 c:collection1 oasup.UpdateRequestProcessorChain.init inserting DistributedUpdateProcessorFactory into updateRequestProcessorChain "distrib-dup-test-chain-implicit"
   [junit4]   2> 420946 T2040 C:collection1 c:collection1 oasc.SolrCore.loadUpdateProcessorChains no updateRequestProcessorChain defined as default, creating implicit default
   [junit4]   2> 420954 T2040 C:collection1 c:collection1 oashl.XMLLoader.init xsltCacheLifetimeSeconds=60
   [junit4]   2> 420957 T2040 C:collection1 c:collection1 oashl.XMLLoader.init xsltCacheLifetimeSeconds=60
   [junit4]   2> 420959 T2040 C:collection1 c:collection1 oashl.XMLLoader.init xsltCacheLifetimeSeconds=60
   [junit4]   2> 420961 T2040 C:collection1 c:collection1 oashl.XMLLoader.init xsltCacheLifetimeSeconds=60
   [junit4]   2> 420969 T2040 C:collection1 c:collection1 oasc.RequestHandlers.initHandlersFromConfig Registered paths: /admin/mbeans,standard,/update/csv,/update/json/docs,/admin/luke,/admin/segments,/get,/admin/system,/replication,/admin/properties,/config,/schema,/admin/plugins,/admin/logging,/update/json,/admin/threads,/admin/ping,/update,/admin/file
   [junit4]   2> 420970 T2040 C:collection1 c:collection1 oasc.SolrCore.initStatsCache Using default statsCache cache: org.apache.solr.search.stats.LocalStatsCache
   [junit4]   2> 420974 T2040 C:collection1 c:collection1 oasu.UpdateHandler.<init> Using UpdateLog implementation: org.apache.solr.update.UpdateLog
   [junit4]   2> 420974 T2040 C:collection1 c:collection1 oasu.UpdateLog.init Initializing UpdateLog: dataDir= defaultSyncLevel=FLUSH numRecordsToKeep=100 maxNumLogsToKeep=10
   [junit4]   2> 420975 T2040 C:collection1 c:collection1 oasu.CommitTracker.<init> Hard AutoCommit: disabled
   [junit4]   2> 420976 T2040 C:collection1 c:collection1 oasu.CommitTracker.<init> Soft AutoCommit: disabled
   [junit4]   2> 420980 T2040 C:collection1 c:collection1 oasu.RandomMergePolicy.<init> RandomMergePolicy wrapping class org.apache.lucene.index.LogDocMergePolicy: [LogDocMergePolicy: minMergeSize=1000, mergeFactor=37, maxMergeSize=9223372036854775807, maxMergeSizeForForcedMerge=9223372036854775807, calibrateSizeByDeletes=false, maxMergeDocs=2147483647, maxCFSSegmentSizeMB=8.796093022207999E12, noCFSRatio=0.0]
   [junit4]   2> 420981 T2040 C:collection1 c:collection1 oasc.SolrDeletionPolicy.onInit SolrDeletionPolicy.onInit: commits: num=1
   [junit4]   2> 		commit{dir=MockDirectoryWrapper(RAMDirectory@18b802cc lockFactory=org.apache.lucene.store.SingleInstanceLockFactory@7385fe6b),segFN=segments_1,generation=1}
   [junit4]   2> 420981 T2040 C:collection1 c:collection1 oasc.SolrDeletionPolicy.updateCommits newest commit generation = 1
   [junit4]   2> 420981 T2040 C:collection1 c:collection1 oass.SolrIndexSearcher.<init> Opening Searcher@1fb82923[collection1] main
   [junit4]   2> 420982 T2040 C:collection1 c:collection1 oascc.ZkStateReader.readConfigName Load collection config from:/collections/collection1
   [junit4]   2> 420993 T2040 C:collection1 c:collection1 oascc.ZkStateReader.readConfigName path=/collections/collection1 configName=conf1 specified config exists in ZooKeeper
   [junit4]   2> 420994 T2040 C:collection1 c:collection1 oasr.ManagedResourceStorage.newStorageIO Setting up ZooKeeper-based storage for the RestManager with znodeBase: /configs/conf1
   [junit4]   2> 421002 T2040 C:collection1 c:collection1 oasr.ManagedResourceStorage$ZooKeeperStorageIO.configure Configured ZooKeeperStorageIO with znodeBase: /configs/conf1
   [junit4]   2> 421002 T2040 C:collection1 c:collection1 oasr.RestManager.init Initializing RestManager with initArgs: {}
   [junit4]   2> 421002 T2040 C:collection1 c:collection1 oasr.ManagedResourceStorage.load Reading _rest_managed.json using ZooKeeperStorageIO:path=/configs/conf1
   [junit4]   2> 421005 T2040 C:collection1 c:collection1 oasr.ManagedResourceStorage$ZooKeeperStorageIO.openInputStream No data found for znode /configs/conf1/_rest_managed.json
   [junit4]   2> 421006 T2040 C:collection1 c:collection1 oasr.ManagedResourceStorage.load Loaded null at path _rest_managed.json using ZooKeeperStorageIO:path=/configs/conf1
   [junit4]   2> 421006 T2040 C:collection1 c:collection1 oasr.RestManager.init Initializing 0 registered ManagedResources
   [junit4]   2> 421006 T2040 C:collection1 c:collection1 oash.ReplicationHandler.inform Commits will be reserved for  10000
   [junit4]   2> 421012 T2041 C:collection1 c:collection1 oasc.SolrCore.registerSearcher [collection1] Registered new searcher Searcher@1fb82923[collection1] main{ExitableDirectoryReader(UninvertingDirectoryReader())}
   [junit4]   2> 421013 T2040 C:collection1 c:collection1 oasc.CoreContainer.registerCore registering core: collection1
   [junit4]   2> 421017 T2044 C:collection1 S:shard2 oasc.ZkController.register Register replica - core:collection1 address:http://127.0.0.1:64165/mz_yj/p collection:collection1 shard:shard2
   [junit4]   2> 421018 T1983 oass.SolrDispatchFilter.init user.dir=/Users/jenkins/workspace/Lucene-Solr-trunk-MacOSX/solr/build/solr-core/test/J1
   [junit4]   2> 421019 T1983 oass.SolrDispatchFilter.init SolrDispatchFilter.init() done
   [junit4]   2> 421022 T2044 C:collection1 S:shard2 oascc.SolrZkClient.makePath makePath: /collections/collection1/leader_elect/shard2/election
   [junit4]   2> 421061 T2044 C:collection1 S:shard2 oasc.ShardLeaderElectionContext.runLeaderProcess Running the leader process for shard shard2
   [junit4]   2> 421072 T2011 oasc.DistributedQueue$LatchWatcher.process NodeChildrenChanged fired on path /overseer/queue state SyncConnected
   [junit4]   2> 421076 T2012 oasc.Overseer$ClusterStateUpdater.run processMessage: queueSize: 1, message = {
   [junit4]   2> 	  "operation":"leader",
   [junit4]   2> 	  "shard":"shard2",
   [junit4]   2> 	  "collection":"collection1"} current state version: 4
   [junit4]   2> 421077 T2044 C:collection1 S:shard2 oasc.ShardLeaderElectionContext.waitForReplicasToComeUp Enough replicas found to continue.
   [junit4]   2> 421077 T2044 C:collection1 S:shard2 oasc.ShardLeaderElectionContext.runLeaderProcess I may be the new leader - try and sync
   [junit4]   2> ASYNC  NEW_CORE C995 name=collection1 org.apache.solr.core.SolrCore@7f013afb url=http://127.0.0.1:64165/mz_yj/p/collection1 node=127.0.0.1:64165_mz_yj%2Fp C995_STATE=coll:collection1 core:collection1 props:{core=collection1, base_url=http://127.0.0.1:64165/mz_yj/p, node_name=127.0.0.1:64165_mz_yj%2Fp, state=down}
   [junit4]   2> 421078 T2044 C:collection1 S:shard2 C995 P64165 oasc.SyncStrategy.sync Sync replicas to http://127.0.0.1:64165/mz_yj/p/collection1/
   [junit4]   2> 421078 T2044 C:collection1 S:shard2 C995 P64165 oasc.SyncStrategy.syncReplicas Sync Success - now sync replicas to me
   [junit4]   2> 421078 T2044 C:collection1 S:shard2 C995 P64165 oasc.SyncStrategy.syncToMe http://127.0.0.1:64165/mz_yj/p/collection1/ has no replicas
   [junit4]   2> 421078 T2044 C:collection1 S:shard2 oasc.ShardLeaderElectionContext.runLeaderProcess I am the new leader: http://127.0.0.1:64165/mz_yj/p/collection1/ shard2
   [junit4]   2> 421079 T2044 C:collection1 S:shard2 oascc.SolrZkClient.makePath makePath: /collections/collection1/leaders/shard2
   [junit4]   2> 421111 T2011 oasc.DistributedQueue$LatchWatcher.process NodeChildrenChanged fired on path /overseer/queue state SyncConnected
   [junit4]   2> 421114 T2012 oasc.Overseer$ClusterStateUpdater.run processMessage: queueSize: 1, message = {
   [junit4]   2> 	  "operation":"leader",
   [junit4]   2> 	  "shard":"shard2",
   [junit4]   2> 	  "collection":"collection1",
   [junit4]   2> 	  "base_url":"http://127.0.0.1:64165/mz_yj/p",
   [junit4]   2> 	  "core":"collection1",
   [junit4]   2> 	  "state":"active"} current state version: 4
   [junit4]   2> 421235 T2022 oascc.ZkStateReader$2.process A cluster state change: WatchedEvent state:SyncConnected type:NodeDataChanged path:/clusterstate.json, has occurred - updating... (live nodes size: 2)
   [junit4]   2> 421236 T2011 oascc.ZkStateReader$2.process A cluster state change: WatchedEvent state:SyncConnected type:NodeDataChanged path:/clusterstate.json, has occurred - updating... (live nodes size: 2)
   [junit4]   2> 421237 T2039 oascc.ZkStateReader$2.process A cluster state change: WatchedEvent state:SyncConnected type:NodeDataChanged path:/clusterstate.json, has occurred - updating... (live nodes size: 2)
   [junit4]   2> 421281 T2044 C:collection1 S:shard2 oasc.ZkController.register We are http://127.0.0.1:64165/mz_yj/p/collection1/ and leader is http://127.0.0.1:64165/mz_yj/p/collection1/
   [junit4]   2> 421282 T2044 C:collection1 S:shard2 oasc.ZkController.register No LogReplay needed for core=collection1 baseURL=http://127.0.0.1:64165/mz_yj/p
   [junit4]   2> 421283 T2044 C:collection1 S:shard2 oasc.ZkController.checkRecovery I am the leader, no recovery necessary
   [junit4]   2> 421283 T2044 C:collection1 S:shard2 c:collection1 oasc.ZkController.publish publishing core=collection1 state=active collection=collection1
   [junit4]   2> 421283 T2044 C:collection1 S:shard2 c:collection1 oasc.ZkController.publish numShards not found on descriptor - reading it from system property
   [junit4]   2> 421287 T2011 oasc.DistributedQueue$LatchWatcher.process NodeChildrenChanged fired on path /overseer/queue state SyncConnected
   [junit4]   2> 421292 T2012 oasc.Overseer$ClusterStateUpdater.run processMessage: queueSize: 1, message = {
   [junit4]   2> 	  "core":"collection1",
   [junit4]   2> 	  "core_node_name":"core_node1",
   [junit4]   2> 	  "roles":null,
   [junit4]   2> 	  "base_url":"http://127.0.0.1:64165/mz_yj/p",
   [junit4]   2> 	  "node_name":"127.0.0.1:64165_mz_yj%2Fp",
   [junit4]   2> 	  "numShards":"2",
   [junit4]   2> 	  "state":"active",
   [junit4]   2> 	  "shard":"shard2",
   [junit4]   2> 	  "collection":"collection1",
   [junit4]   2> 	  "operation":"state"} current state version: 5
   [junit4]   2> 421294 T2012 oasco.ReplicaMutator.updateState Update state numShards=2 message={
   [junit4]   2> 	  "core":"collection1",
   [junit4]   2> 	  "core_node_name":"core_node1",
   [junit4]   2> 	  "roles":null,
   [junit4]   2> 	  "base_url":"http://127.0.0.1:64165/mz_yj/p",
   [junit4]   2> 	  "node_name":"127.0.0.1:64165_mz_yj%2Fp",
   [junit4]   2> 	  "numShards":"2",
   [junit4]   2> 	  "state":"active",
   [junit4]   2> 	  "shard":"shard2",
   [junit4]   2> 	  "collection":"collection1",
   [junit4]   2> 	  "operation":"state"}
   [junit4]   2> 421406 T2011 oascc.ZkStateReader$2.process A cluster state change: WatchedEvent state:SyncConnected type:NodeDataChanged path:/clusterstate.json, has occurred - updating... (live nodes size: 2)
   [junit4]   2> 421407 T2039 oascc.ZkStateReader$2.process A cluster state change: WatchedEvent state:SyncConnected type:NodeDataChanged path:/clusterstate.json, has occurred - updating... (live nodes size: 2)
   [junit4]   2> 421407 T2022 oascc.ZkStateReader$2.process A cluster state change: WatchedEvent state:SyncConnected type:NodeDataChanged path:/clusterstate.json, has occurred - updating... (live nodes size: 2)
   [junit4]   2> 421621 T1983 oas.SolrTestCaseJ4.writeCoreProperties Writing core.properties file to /Users/jenkins/workspace/Lucene-Solr-trunk-MacOSX/solr/build/solr-core/test/J1/temp/solr.handler.TestSolrConfigHandlerCloud 799BE67D77D9E6B4-001/shard-2-001/cores/collection1
   [junit4]   2> 421626 T1983 oasc.AbstractFullDistribZkTestBase.createJettys create jetty 2 in directory /Users/jenkins/workspace/Lucene-Solr-trunk-MacOSX/solr/build/solr-core/test/J1/temp/solr.handler.TestSolrConfigHandlerCloud 799BE67D77D9E6B4-001/shard-2-001
   [junit4]   2> 421627 T1983 oejs.Server.doStart jetty-9.2.9.v20150224
   [junit4]   2> 421635 T1983 oejsh.ContextHandler.doStart Started o.e.j.s.ServletContextHandler@552ba97{/mz_yj/p,null,AVAILABLE}
   [junit4]   2> 421636 T1983 oejs.AbstractConnector.doStart Started ServerConnector@2500df59{HTTP/1.1}{127.0.0.1:64172}
   [junit4]   2> 421637 T1983 oejs.Server.doStart Started @424084ms
   [junit4]   2> 421637 T1983 oascse.JettySolrRunner$1.lifeCycleStarted Jetty properties: {solr.data.dir=/Users/jenkins/workspace/Lucene-Solr-trunk-MacOSX/solr/build/solr-core/test/J1/temp/solr.handler.TestSolrConfigHandlerCloud 799BE67D77D9E6B4-001/tempDir-001/jetty2, solrconfig=solrconfig.xml, hostContext=/mz_yj/p, hostPort=64172, coreRootDirectory=/Users/jenkins/workspace/Lucene-Solr-trunk-MacOSX/solr/build/solr-core/test/J1/temp/solr.handler.TestSolrConfigHandlerCloud 799BE67D77D9E6B4-001/shard-2-001/cores}
   [junit4]   2> 421637 T1983 oass.SolrDispatchFilter.init SolrDispatchFilter.init()sun.misc.Launcher$AppClassLoader@74a14482
   [junit4]   2> 421638 T1983 oasc.SolrResourceLoader.<init> new SolrResourceLoader for directory: '/Users/jenkins/workspace/Lucene-Solr-trunk-MacOSX/solr/build/solr-core/test/J1/temp/solr.handler.TestSolrConfigHandlerCloud 799BE67D77D9E6B4-001/shard-2-001/'
   [junit4]   2> 421681 T1983 oasc.SolrXmlConfig.fromFile Loading container configuration from /Users/jenkins/workspace/Lucene-Solr-trunk-MacOSX/solr/build/solr-core/test/J1/temp/solr.handler.TestSolrConfigHandlerCloud 799BE67D77D9E6B4-001/shard-2-001/solr.xml
   [junit4]   2> 421709 T1983 oasc.CorePropertiesLocator.<init> Config-defined core root directory: /Users/jenkins/workspace/Lucene-Solr-trunk-MacOSX/solr/build/solr-core/test/J1/temp/solr.handler.TestSolrConfigHandlerCloud 799BE67D77D9E6B4-001/shard-2-001/cores
   [junit4]   2> 421710 T1983 oasc.CoreContainer.<init> New CoreContainer 1737279138
   [junit4]   2> 421710 T1983 oasc.CoreContainer.load Loading cores into CoreContainer [instanceDir=/Users/jenkins/workspace/Lucene-Solr-trunk-MacOSX/solr/build/solr-core/test/J1/temp/solr.handler.TestSolrConfigHandlerCloud 799BE67D77D9E6B4-001/shard-2-001/]
   [junit4]   2> 421710 T1983 oasc.CoreContainer.load loading shared library: /Users/jenkins/workspace/Lucene-Solr-trunk-MacOSX/solr/build/solr-core/test/J1/temp/solr.handler.TestSolrConfigHandlerCloud 799BE67D77D9E6B4-001/shard-2-001/lib
   [junit4]   2> 421711 T1983 oasc.SolrResourceLoader.addToClassLoader WARN Can't find (or read) directory to add to classloader: lib (resolved as: /Users/jenkins/workspace/Lucene-Solr-trunk-MacOSX/solr/build/solr-core/test/J1/temp/solr.handler.TestSolrConfigHandlerCloud 799BE67D77D9E6B4-001/shard-2-001/lib).
   [junit4]   2> 421725 T1983 oashc.HttpShardHandlerFactory.getParameter Setting socketTimeout to: 90000
   [junit4]   2> 421725 T1983 oashc.HttpShardHandlerFactory.getParameter Setting urlScheme to: 
   [junit4]   2> 421726 T1983 oashc.HttpShardHandlerFactory.getParameter Setting connTimeout to: 15000
   [junit4]   2> 421726 T1983 oashc.HttpShardHandlerFactory.getParameter Setting maxConnectionsPerHost to: 20
   [junit4]   2> 421727 T1983 oashc.HttpShardHandlerFactory.getParameter Setting maxConnections to: 10000
   [junit4]   2> 421727 T1983 oashc.HttpShardHandlerFactory.getParameter Setting corePoolSize to: 0
   [junit4]   2> 421727 T1983 oashc.HttpShardHandlerFactory.getParameter Setting maximumPoolSize to: 2147483647
   [junit4]   2> 421727 T1983 oashc.HttpShardHandlerFactory.getParameter Setting maxThreadIdleTime to: 5
   [junit4]   2> 421727 T1983 oashc.HttpShardHandlerFactory.getParameter Setting sizeOfQueue to: -1
   [junit4]   2> 421728 T1983 oashc.HttpShardHandlerFactory.getParameter Setting fairnessPolicy to: false
   [junit4]   2> 421729 T1983 oashc.HttpShardHandlerFactory.getParameter Setting useRetries to: false
   [junit4]   2> 421729 T1983 oasu.UpdateShardHandler.<init> Creating UpdateShardHandler HTTP client with params: socketTimeout=340000&connTimeout=45000&retry=true
   [junit4]   2> 421730 T1983 oasl.LogWatcher.createWatcher SLF4J impl is org.slf4j.impl.Log4jLoggerFactory
   [junit4]   2> 421730 T1983 oasl.LogWatcher.newRegisteredLogWatcher Registering Log Listener [Log4j (org.slf4j.impl.Log4jLoggerFactory)]
   [junit4]   2> 421730 T1983 oasc.CoreContainer.load Node Name: 127.0.0.1
   [junit4]   2> 421731 T1983 oasc.ZkContainer.initZooKeeper Zookeeper client=127.0.0.1:64150/solr
   [junit4]   2> 421731 T1983 oasc.ZkController.checkChrootPath zkHost includes chroot
   [junit4]   2> 421731 T1983 oascc.SolrZkClient.createZkCredentialsToAddAutomatically Using default ZkCredentialsProvider
   [junit4]   2> 421733 T1983 oascc.ConnectionManager.waitForConnected Waiting for client to connect to ZooKeeper
   [junit4]   2> 421738 T2058 oascc.ConnectionManager.process Watcher org.apache.solr.common.cloud.ConnectionManager@247b090c name:ZooKeeperConnection Watcher:127.0.0.1:64150 got event WatchedEvent state:SyncConnected type:None path:null path:null type:None
   [junit4]   2> 421739 T1983 oascc.ConnectionManager.waitForConnected Client is connected to ZooKeeper
   [junit4]   2> 421740 T1983 oascc.SolrZkClient.createZkACLProvider Using default ZkACLProvider
   [junit4]   2> 421745 T1983 oascc.ConnectionManager.waitForConnected Waiting for client to connect to ZooKeeper
   [junit4]   2> 421750 T2061 oascc.ConnectionManager.process Watcher org.apache.solr.common.cloud.ConnectionManager@2e294347 name:ZooKeeperConnection Watcher:127.0.0.1:64150/solr got event WatchedEvent state:SyncConnected type:None path:null path:null type:None
   [junit4]   2> 421750 T1983 oascc.ConnectionManager.waitForConnected Client is connected to ZooKeeper
   [junit4]   2> 421771 T1983 oascc.ZkStateReader.createClusterStateWatchersAndUpdate Updating cluster state from ZooKeeper... 
   [junit4]   2> 422785 T1983 oasc.ZkController.createEphemeralLiveNode Register node as live in ZooKeeper:/live_nodes/127.0.0.1:64172_mz_yj%2Fp
   [junit4]   2> 422786 T1983 oascc.SolrZkClient.makePath makePath: /live_nodes/127.0.0.1:64172_mz_yj%2Fp
   [junit4]   2> 422797 T1983 oasc.Overseer.close Overseer (id=null) closing
   [junit4]   2> 422805 T1983 oasc.CorePropertiesLocator.discover Looking for core definitions underneath /Users/jenkins/workspace/Lucene-Solr-trunk-MacOSX/solr/build/solr-core/test/J1/temp/solr.handler.TestSolrConfigHandlerCloud 799BE67D77D9E6B4-001/shard-2-001/cores
   [junit4]   2> 422807 T1983 oasc.CoreDescriptor.<init> CORE DESCRIPTOR: {name=collection1, config=solrconfig.xml, transient=false, schema=schema.xml, loadOnStartup=true, instanceDir=/Users/jenkins/workspace/Lucene-Solr-trunk-MacOSX/solr/build/solr-core/test/J1/temp/solr.handler.TestSolrConfigHandlerCloud 799BE67D77D9E6B4-001/shard-2-001/cores/collection1, collection=collection1, absoluteInstDir=/Users/jenkins/workspace/Lucene-Solr-trunk-MacOSX/solr/build/solr-core/test/J1/temp/solr.handler.TestSolrConfigHandlerCloud 799BE67D77D9E6B4-001/shard-2-001/cores/collection1/, coreNodeName=, dataDir=data/, shard=}
   [junit4]   2> 422807 T1983 oasc.CorePropertiesLocator.discoverUnder Found core collection1 in /Users/jenkins/workspace/Lucene-Solr-trunk-MacOSX/solr/build/solr-core/test/J1/temp/solr.handler.TestSolrConfigHandlerCloud 799BE67D77D9E6B4-001/shard-2-001/cores/collection1/
   [junit4]   2> 422807 T1983 oasc.CorePropertiesLocator.discover Found 1 core definitions
   [junit4]   2> 422810 T2062 C:collection1 c:collection1 oasc.ZkController.publish publishing core=collection1 state=down collection=collection1
   [junit4]   2> 422810 T2062 C:collection1 c:collection1 oasc.ZkController.publish numShards not found on descriptor - reading it from system property
   [junit4]   2> 422812 T2062 C:collection1 c:collection1 oasc.ZkController.waitForCoreNodeName look for our core node name
   [junit4]   2> 422812 T2011 oasc.DistributedQueue$LatchWatcher.process NodeChildrenChanged fired on path /overseer/queue state SyncConnected
   [junit4]   2> 422814 T2012 oasc.Overseer$ClusterStateUpdater.run processMessage: queueSize: 1, message = {
   [junit4]   2> 	  "core":"collection1",
   [junit4]   2> 	  "roles":null,
   [junit4]   2> 	  "base_url":"http://127.0.0.1:64172/mz_yj/p",
   [junit4]   2> 	  "node_name":"127.0.0.1:64172_mz_yj%2Fp",
   [junit4]   2> 	  "numShards":"2",
   [junit4]   2> 	  "state":"down",
   [junit4]   2> 	  "shard":null,
   [junit4]   2> 	  "collection":"collection1",
   [junit4]   2> 	  "operation":"state"} current state version: 6
   [junit4]   2> 422816 T2012 oasco.ReplicaMutator.updateState Update state numShards=2 message={
   [junit4]   2> 	  "core":"collection1",
   [junit4]   2> 	  "roles":null,
   [junit4]   2> 	  "base_url":"http://127.0.0.1:64172/mz_yj/p",
   [junit4]   2> 	  "node_name":"127.0.0.1:64172_mz_yj%2Fp",
   [junit4]   2> 	  "numShards":"2",
   [junit4]   2> 	  "state":"down",
   [junit4]   2> 	  "shard":null,
   [junit4]   2> 	  "collection":"collection1",
   [junit4]   2> 	  "operation":"state"}
   [junit4]   2> 422816 T2012 oasco.ReplicaMutator.updateState Collection already exists with numShards=2
   [junit4]   2> 422816 T2012 oasco.ReplicaMutator.updateState Assigning new node to shard shard=shard1
   [junit4]   2> 422927 T2039 oascc.ZkStateReader$2.process A cluster state change: WatchedEvent state:SyncConnected type:NodeDataChanged path:/clusterstate.json, has occurred - updating... (live nodes size: 3)
   [junit4]   2> 422928 T2011 oascc.ZkStateReader$2.process A cluster state change: WatchedEvent state:SyncConnected type:NodeDataChanged path:/clusterstate.json, has occurred - updating... (live nodes size: 3)
   [junit4]   2> 422927 T2022 oascc.ZkStateReader$2.process A cluster state change: WatchedEvent state:SyncConnected type:NodeDataChanged path:/clusterstate.json, has occurred - updating... (live nodes size: 3)
   [junit4]   2> 422927 T2061 oascc.ZkStateReader$2.process A cluster state change: WatchedEvent state:SyncConnected type:NodeDataChanged path:/clusterstate.json, has occurred - updating... (live nodes size: 3)
   [junit4]   2> 423814 T2062 C:collection1 c:collection1 oasc.ZkController.waitForShardId waiting to find shard id in clusterstate for collection1
   [junit4]   2> 423814 T2062 C:collection1 c:collection1 oasc.ZkController.createCollectionZkNode Check for collection zkNode:collection1
   [junit4]   2> 423815 T2062 C:collection1 c:collection1 oasc.ZkController.createCollectionZkNode Collection zkNode exists
   [junit4]   2> 423815 T2062 C:collection1 c:collection1 oascc.ZkStateReader.readConfigName Load collection config from:/collections/collection1
   [junit4]   2> 423818 T2062 C:collection1 c:collection1 oascc.ZkStateReader.readConfigName path=/collections/collection1 configName=conf1 specified config exists in ZooKeeper
   [junit4]   2> 423818 T2062 C:collection1 c:collection1 oasc.SolrResourceLoader.<init> new SolrResourceLoader for directory: '/Users/jenkins/workspace/Lucene-Solr-trunk-MacOSX/solr/build/solr-core/test/J1/temp/solr.handler.TestSolrConfigHandlerCloud 799BE67D77D9E6B4-001/shard-2-001/cores/collection1/'
   [junit4]   2> 423842 T2062 C:collection1 c:collection1 oasc.ZkController.watchZKConfDir watch zkdir /configs/conf1
   [junit4]   2> 423847 T2062 C:collection1 c:collection1 oasc.Config.<init> loaded config solrconfig.xml with version 0 
   [junit4]   2> 423860 T2062 C:collection1 c:collection1 oasc.SolrConfig.refreshRequestParams current version of requestparams : -1
   [junit4]   2> 423865 T2062 C:collection1 c:collection1 oasc.SolrConfig.<init> Using Lucene MatchVersion: 6.0.0
   [junit4]   2> 423873 T2062 C:collection1 c:collection1 oasc.SolrConfig.<init> Loaded SolrConfig: solrconfig.xml
   [junit4]   2> 423875 T2062 C:collection1 c:collection1 oass.IndexSchema.readSchema Reading Solr Schema from /configs/conf1/schema.xml
   [junit4]   2> 423879 T2062 C:collection1 c:collection1 oass.IndexSchema.readSchema [collection1] Schema name=test
   [junit4]   2> 424024 T2062 C:collection1 c:collection1 oass.OpenExchangeRatesOrgProvider.init Initialized with rates=open-exchange-rates.json, refreshInterval=1440.
   [junit4]   2> 424040 T2062 C:collection1 c:collection1 oass.IndexSchema.readSchema default search field in schema is text
   [junit4]   2> 424042 T2062 C:collection1 c:collection1 oass.IndexSchema.readSchema unique key field: id
   [junit4]   2> 424078 T2062 C:collection1 c:collection1 oass.FileExchangeRateProvider.reload Reloading exchange rates from file currency.xml
   [junit4]   2> 424084 T2062 C:collection1 c:collection1 oass.FileExchangeRateProvider.reload Reloading exchange rates from file currency.xml
   [junit4]   2> 424088 T2062 C:collection1 c:collection1 oass.OpenExchangeRatesOrgProvider.reload Reloading exchange rates from open-exchange-rates.json
   [junit4]   2> 424090 T2062 C:collection1 c:collection1 oass.OpenExchangeRatesOrgProvider$OpenExchangeRates.<init> WARN Unknown key IMPORTANT NOTE
   [junit4]   2> 424091 T2062 C:collection1 c:collection1 oass.OpenExchangeRatesOrgProvider$OpenExchangeRates.<init> WARN Expected key, got STRING
   [junit4]   2> 424091 T2062 C:collection1 c:collection1 oass.OpenExchangeRatesOrgProvider.reload Reloading exchange rates from open-exchange-rates.json
   [junit4]   2> 424093 T2062 C:collection1 c:collection1 oass.OpenExchangeRatesOrgProvider$OpenExchangeRates.<init> WARN Unknown key IMPORTANT NOTE
   [junit4]   2> 424094 T2062 C:collection1 c:collection1 oass.OpenExchangeRatesOrgProvider$OpenExchangeRates.<init> WARN Expected key, got STRING
   [junit4]   2> 424094 T2062 C:collection1 c:collection1 oasc.CoreContainer.create Creating SolrCore 'collection1' using configuration from collection collection1
   [junit4]   2> 424094 T2062 C:collection1 c:collection1 oasc.SolrCore.initDirectoryFactory org.apache.solr.core.MockDirectoryFactory
   [junit4]   2> 424094 T2062 C:collection1 c:collection1 oasc.SolrCore.<init> [collection1] Opening new SolrCore at /Users/jenkins/workspace/Lucene-Solr-trunk-MacOSX/solr/build/solr-core/test/J1/temp/solr.handler.TestSolrConfigHandlerCloud 799BE67D77D9E6B4-001/shard-2-001/cores/collection1/, dataDir=/Users/jenkins/workspace/Lucene-Solr-trunk-MacOSX/solr/build/solr-core/test/J1/temp/solr.handler.TestSolrConfigHandlerCloud 799BE67D77D9E6B4-001/shard-2-001/cores/collection1/data/
   [junit4]   2> 424094 T2062 C:collection1 c:collection1 oasc.JmxMonitoredMap.<init> JMX monitoring is enabled. Adding Solr mbeans to JMX Server: com.sun.jmx.mbeanserver.JmxMBeanServer@664c443b
   [junit4]   2> 424096 T2062 C:collection1 c:collection1 oasc.CachingDirectoryFactory.get return new directory for /Users/jenkins/workspace/Lucene-Solr-trunk-MacOSX/solr/build/solr-core/test/J1/temp/solr.handler.TestSolrConfigHandlerCloud 799BE67D77D9E6B4-001/shard-2-001/cores/collection1/data
   [junit4]   2> 424096 T2062 C:collection1 c:collection1 oasc.SolrCore.getNewIndexDir New index directory detected: old=null new=/Users/jenkins/workspace/Lucene-Solr-trunk-MacOSX/solr/build/solr-core/test/J1/temp/solr.handler.TestSolrConfigHandlerCloud 799BE67D77D9E6B4-001/shard-2-001/cores/collection1/data/index/
   [junit4]   2> 424097 T2062 C:collection1 c:collection1 oasc.SolrCore.initIndex WARN [collection1] Solr index directory '/Users/jenkins/workspace/Lucene-Solr-trunk-MacOSX/solr/build/solr-core/test/J1/temp/solr.handler.TestSolrConfigHandlerCloud 799BE67D77D9E6B4-001/shard-2-001/cores/collection1/data/index' doesn't exist. Creating new index...
   [junit4]   2> 424097 T2062 C:collection1 c:collection1 oasc.CachingDirectoryFactory.get return new directory for /Users/jenkins/workspace/Lucene-Solr-trunk-MacOSX/solr/build/solr-core/test/J1/temp/solr.handler.TestSolrConfigHandlerCloud 799BE67D77D9E6B4-001/shard-2-001/cores/collection1/data/index
   [junit4]   2> 424097 T2062 C:collection1 c:collection1 oasu.RandomMergePolic

[...truncated too long message...]

oryFactory.closeCacheValue looking to close /Users/jenkins/workspace/Lucene-Solr-trunk-MacOSX/solr/build/solr-core/test/J1/temp/solr.handler.TestSolrConfigHandlerCloud 799BE67D77D9E6B4-001/shard-4-001/cores/collection1/data [CachedDir<<refCount=0;path=/Users/jenkins/workspace/Lucene-Solr-trunk-MacOSX/solr/build/solr-core/test/J1/temp/solr.handler.TestSolrConfigHandlerCloud 799BE67D77D9E6B4-001/shard-4-001/cores/collection1/data;done=false>>]
   [junit4]   2> 460803 T2278 oasc.CachingDirectoryFactory.close Closing directory: /Users/jenkins/workspace/Lucene-Solr-trunk-MacOSX/solr/build/solr-core/test/J1/temp/solr.handler.TestSolrConfigHandlerCloud 799BE67D77D9E6B4-001/shard-4-001/cores/collection1/data
   [junit4]   2> 460803 T2278 oasc.CachingDirectoryFactory.closeCacheValue looking to close /Users/jenkins/workspace/Lucene-Solr-trunk-MacOSX/solr/build/solr-core/test/J1/temp/solr.handler.TestSolrConfigHandlerCloud 799BE67D77D9E6B4-001/shard-4-001/cores/collection1/data/index [CachedDir<<refCount=0;path=/Users/jenkins/workspace/Lucene-Solr-trunk-MacOSX/solr/build/solr-core/test/J1/temp/solr.handler.TestSolrConfigHandlerCloud 799BE67D77D9E6B4-001/shard-4-001/cores/collection1/data/index;done=false>>]
   [junit4]   2> 460804 T2278 oasc.CachingDirectoryFactory.close Closing directory: /Users/jenkins/workspace/Lucene-Solr-trunk-MacOSX/solr/build/solr-core/test/J1/temp/solr.handler.TestSolrConfigHandlerCloud 799BE67D77D9E6B4-001/shard-4-001/cores/collection1/data/index
   [junit4]   2> 460805 T2278 oascc.SolrZkClient.makePath makePath: /collections/collection1/leaders/shard1
   [junit4]   2> 460806 T2278 oasc.SolrException.log ERROR There was a problem trying to register as the leader:org.apache.solr.common.SolrException: Could not register as the leader because creating the ephemeral registration node in ZooKeeper failed
   [junit4]   2> 		at org.apache.solr.cloud.ShardLeaderElectionContextBase.runLeaderProcess(ElectionContext.java:154)
   [junit4]   2> 		at org.apache.solr.cloud.ShardLeaderElectionContext.runLeaderProcess(ElectionContext.java:330)
   [junit4]   2> 		at org.apache.solr.cloud.LeaderElector.runIamLeaderProcess(LeaderElector.java:198)
   [junit4]   2> 		at org.apache.solr.cloud.LeaderElector.checkIfIamLeader(LeaderElector.java:159)
   [junit4]   2> 		at org.apache.solr.cloud.LeaderElector.access$200(LeaderElector.java:56)
   [junit4]   2> 		at org.apache.solr.cloud.LeaderElector$ElectionWatcher.process(LeaderElector.java:390)
   [junit4]   2> 		at org.apache.solr.common.cloud.SolrZkClient$3$1.run(SolrZkClient.java:264)
   [junit4]   2> 		at java.util.concurrent.Executors$RunnableAdapter.call(Executors.java:511)
   [junit4]   2> 		at java.util.concurrent.FutureTask.run(FutureTask.java:266)
   [junit4]   2> 		at java.util.concurrent.ThreadPoolExecutor.runWorker(ThreadPoolExecutor.java:1142)
   [junit4]   2> 		at java.util.concurrent.ThreadPoolExecutor$Worker.run(ThreadPoolExecutor.java:617)
   [junit4]   2> 		at java.lang.Thread.run(Thread.java:745)
   [junit4]   2> 	Caused by: org.apache.zookeeper.KeeperException$SessionExpiredException: KeeperErrorCode = Session expired for /collections
   [junit4]   2> 		at org.apache.zookeeper.KeeperException.create(KeeperException.java:127)
   [junit4]   2> 		at org.apache.zookeeper.KeeperException.create(KeeperException.java:51)
   [junit4]   2> 		at org.apache.zookeeper.ZooKeeper.exists(ZooKeeper.java:1045)
   [junit4]   2> 		at org.apache.solr.common.cloud.SolrZkClient$4.execute(SolrZkClient.java:294)
   [junit4]   2> 		at org.apache.solr.common.cloud.SolrZkClient$4.execute(SolrZkClient.java:291)
   [junit4]   2> 		at org.apache.solr.common.cloud.ZkCmdExecutor.retryOperation(ZkCmdExecutor.java:61)
   [junit4]   2> 		at org.apache.solr.common.cloud.SolrZkClient.exists(SolrZkClient.java:291)
   [junit4]   2> 		at org.apache.solr.common.cloud.SolrZkClient.makePath(SolrZkClient.java:486)
   [junit4]   2> 		at org.apache.solr.common.cloud.SolrZkClient.makePath(SolrZkClient.java:455)
   [junit4]   2> 		at org.apache.solr.common.cloud.SolrZkClient.makePath(SolrZkClient.java:442)
   [junit4]   2> 		at org.apache.solr.cloud.ShardLeaderElectionContextBase$1.execute(ElectionContext.java:146)
   [junit4]   2> 		at org.apache.solr.common.util.RetryUtil.retryOnThrowable(RetryUtil.java:31)
   [junit4]   2> 		at org.apache.solr.cloud.ShardLeaderElectionContextBase.runLeaderProcess(ElectionContext.java:142)
   [junit4]   2> 		... 11 more
   [junit4]   2> 	
   [junit4]   2> 460810 T1983 C:control_collection S:shard1 c:collection1 oejs.AbstractConnector.doStop Stopped ServerConnector@1528414e{HTTP/1.1}{127.0.0.1:0}
   [junit4]   2> 460811 T1983 C:control_collection S:shard1 c:collection1 oejsh.ContextHandler.doStop Stopped o.e.j.s.ServletContextHandler@284aed6f{/mz_yj/p,null,UNAVAILABLE}
   [junit4]   2> 460814 T1983 C:control_collection S:shard1 c:collection1 oasc.ZkTestServer.send4LetterWord connecting to 127.0.0.1:64150 64150
   [junit4]   2> 460913 T1984 oasc.ZkTestServer.send4LetterWord connecting to 127.0.0.1:64150 64150
   [junit4]   2> 462470 T1984 oasc.ZkTestServer$ZKServerMain.runFromConfig WARN Watch limit violations: 
   [junit4]   2> 	Maximum concurrent create/delete watches above limit:
   [junit4]   2> 	
   [junit4]   2> 		85	/solr/configs/conf1
   [junit4]   2> 		6	/solr/aliases.json
   [junit4]   2> 		6	/solr/clusterstate.json
   [junit4]   2> 	
   [junit4]   2> 	Maximum concurrent children watches above limit:
   [junit4]   2> 	
   [junit4]   2> 		6	/solr/live_nodes
   [junit4]   2> 		4	/solr/overseer/collection-queue-work
   [junit4]   2> 		2	/solr/overseer/queue
   [junit4]   2> 	
   [junit4]   2> NOTE: reproduce with: ant test  -Dtestcase=TestSolrConfigHandlerCloud -Dtests.method=test -Dtests.seed=799BE67D77D9E6B4 -Dtests.slow=true -Dtests.locale=no -Dtests.timezone=US/Hawaii -Dtests.asserts=true -Dtests.file.encoding=UTF-8
   [junit4] ERROR   46.5s J1 | TestSolrConfigHandlerCloud.test <<<
   [junit4]    > Throwable #1: java.lang.NullPointerException
   [junit4]    > 	at __randomizedtesting.SeedInfo.seed([799BE67D77D9E6B4:F1CFD9A7D9258B4C]:0)
   [junit4]    > 	at org.apache.solr.core.TestSolrConfigHandler.reqhandlertests(TestSolrConfigHandler.java:382)
   [junit4]    > 	at org.apache.solr.handler.TestSolrConfigHandlerCloud.testReqHandlerAPIs(TestSolrConfigHandlerCloud.java:91)
   [junit4]    > 	at org.apache.solr.handler.TestSolrConfigHandlerCloud.test(TestSolrConfigHandlerCloud.java:77)
   [junit4]    > 	at org.apache.solr.BaseDistributedSearchTestCase$ShardsRepeatRule$ShardsFixedStatement.callStatement(BaseDistributedSearchTestCase.java:960)
   [junit4]    > 	at org.apache.solr.BaseDistributedSearchTestCase$ShardsRepeatRule$ShardsStatement.evaluate(BaseDistributedSearchTestCase.java:935)
   [junit4]    > 	at java.lang.Thread.run(Thread.java:745)
   [junit4]   2> 462484 T1983 C:control_collection S:shard1 c:collection1 oas.SolrTestCaseJ4.deleteCore ###deleteCore
   [junit4]   2> NOTE: leaving temporary files on disk at: /Users/jenkins/workspace/Lucene-Solr-trunk-MacOSX/solr/build/solr-core/test/J1/temp/solr.handler.TestSolrConfigHandlerCloud 799BE67D77D9E6B4-001
   [junit4]   2> NOTE: test params are: codec=Asserting(Lucene50): {}, docValues:{}, sim=DefaultSimilarity, locale=no, timezone=US/Hawaii
   [junit4]   2> NOTE: Mac OS X 10.8.5 x86_64/Oracle Corporation 1.8.0_40 (64-bit)/cpus=3,threads=1,free=49205008,total=170123264
   [junit4]   2> NOTE: All tests run in this JVM: [ConvertedLegacyTest, StatelessScriptUpdateProcessorFactoryTest, TestQuerySenderListener, TestSerializedLuceneMatchVersion, BasicDistributedZk2Test, RegexBoostProcessorTest, TestSolrConfigHandler, HighlighterTest, TestCopyFieldCollectionResource, SaslZkACLProviderTest, DebugComponentTest, CurrencyFieldOpenExchangeTest, TermVectorComponentDistributedTest, PreAnalyzedUpdateProcessorTest, TestRandomFaceting, SpatialRPTFieldTypeTest, DistribCursorPagingTest, CopyFieldTest, TestPHPSerializedResponseWriter, HdfsThreadLeakTest, TriLevelCompositeIdRoutingTest, FullSolrCloudDistribCmdsTest, HdfsWriteToMultipleCollectionsTest, SuggestComponentTest, SimpleCollectionCreateDeleteTest, TestUniqueKeyFieldResource, ReturnFieldsTest, TestSearcherReuse, TestChildDocTransformer, PrimitiveFieldTypeTest, HdfsRecoveryZkTest, TestSimpleQParserPlugin, TestHdfsUpdateLog, TestBulkSchemaConcurrent, TestInfoStreamLogging, TestFoldingMultitermQuery, TestDFRSimilarityFactory, TestValueSourceCache, DirectUpdateHandlerOptimizeTest, DocValuesMissingTest, TestSolrConfigHandlerCloud]
   [junit4] Completed on J1 in 46.54s, 1 test, 1 error <<< FAILURES!

[...truncated 1215 lines...]
BUILD FAILED
/Users/jenkins/workspace/Lucene-Solr-trunk-MacOSX/build.xml:519: The following error occurred while executing this line:
/Users/jenkins/workspace/Lucene-Solr-trunk-MacOSX/build.xml:467: The following error occurred while executing this line:
/Users/jenkins/workspace/Lucene-Solr-trunk-MacOSX/build.xml:61: The following error occurred while executing this line:
/Users/jenkins/workspace/Lucene-Solr-trunk-MacOSX/extra-targets.xml:39: The following error occurred while executing this line:
/Users/jenkins/workspace/Lucene-Solr-trunk-MacOSX/solr/build.xml:191: The following error occurred while executing this line:
/Users/jenkins/workspace/Lucene-Solr-trunk-MacOSX/solr/common-build.xml:510: The following error occurred while executing this line:
/Users/jenkins/workspace/Lucene-Solr-trunk-MacOSX/lucene/common-build.xml:1351: The following error occurred while executing this line:
/Users/jenkins/workspace/Lucene-Solr-trunk-MacOSX/lucene/common-build.xml:958: There were test failures: 479 suites, 1900 tests, 1 error, 54 ignored (20 assumptions)

Total time: 64 minutes 49 seconds
Build step 'Invoke Ant' marked build as failure
[description-setter] Description set: Java: 64bit/jdk1.8.0 -XX:+UseCompressedOops -XX:+UseSerialGC
Archiving artifacts
Recording test results
Email was triggered for: Failure - Any
Sending email for trigger: Failure - Any



Mime
View raw message