lucene-dev mailing list archives

Site index · List index
Message view « Date » · « Thread »
Top « Date » · « Thread »
From Apache Jenkins Server <jenk...@builds.apache.org>
Subject [JENKINS] Lucene-Solr-NightlyTests-5.x - Build # 789 - Still Failing
Date Tue, 17 Mar 2015 16:49:36 GMT
Build: https://builds.apache.org/job/Lucene-Solr-NightlyTests-5.x/789/

3 tests failed.
FAILED:  org.apache.solr.cloud.LeaderInitiatedRecoveryOnCommitTest.test

Error Message:
IOException occured when talking to server at: http://127.0.0.1:17957/c8n_1x3_commits_shard1_replica3

Stack Trace:
org.apache.solr.client.solrj.SolrServerException: IOException occured when talking to server at: http://127.0.0.1:17957/c8n_1x3_commits_shard1_replica3
	at __randomizedtesting.SeedInfo.seed([8381C26FCFFDE0A1:BD5FDB561018D59]:0)
	at org.apache.solr.client.solrj.impl.HttpSolrClient.executeMethod(HttpSolrClient.java:598)
	at org.apache.solr.client.solrj.impl.HttpSolrClient.request(HttpSolrClient.java:236)
	at org.apache.solr.client.solrj.impl.HttpSolrClient.request(HttpSolrClient.java:228)
	at org.apache.solr.client.solrj.SolrRequest.process(SolrRequest.java:135)
	at org.apache.solr.client.solrj.SolrClient.commit(SolrClient.java:483)
	at org.apache.solr.client.solrj.SolrClient.commit(SolrClient.java:464)
	at org.apache.solr.cloud.LeaderInitiatedRecoveryOnCommitTest.oneShardTest(LeaderInitiatedRecoveryOnCommitTest.java:130)
	at org.apache.solr.cloud.LeaderInitiatedRecoveryOnCommitTest.test(LeaderInitiatedRecoveryOnCommitTest.java:62)
	at sun.reflect.NativeMethodAccessorImpl.invoke0(Native Method)
	at sun.reflect.NativeMethodAccessorImpl.invoke(NativeMethodAccessorImpl.java:57)
	at sun.reflect.DelegatingMethodAccessorImpl.invoke(DelegatingMethodAccessorImpl.java:43)
	at java.lang.reflect.Method.invoke(Method.java:606)
	at com.carrotsearch.randomizedtesting.RandomizedRunner.invoke(RandomizedRunner.java:1627)
	at com.carrotsearch.randomizedtesting.RandomizedRunner$6.evaluate(RandomizedRunner.java:836)
	at com.carrotsearch.randomizedtesting.RandomizedRunner$7.evaluate(RandomizedRunner.java:872)
	at com.carrotsearch.randomizedtesting.RandomizedRunner$8.evaluate(RandomizedRunner.java:886)
	at org.apache.solr.BaseDistributedSearchTestCase$ShardsRepeatRule$ShardsFixedStatement.callStatement(BaseDistributedSearchTestCase.java:958)
	at org.apache.solr.BaseDistributedSearchTestCase$ShardsRepeatRule$ShardsStatement.evaluate(BaseDistributedSearchTestCase.java:933)
	at com.carrotsearch.randomizedtesting.rules.SystemPropertiesRestoreRule$1.evaluate(SystemPropertiesRestoreRule.java:53)
	at org.apache.lucene.util.TestRuleSetupTeardownChained$1.evaluate(TestRuleSetupTeardownChained.java:50)
	at org.apache.lucene.util.AbstractBeforeAfterRule$1.evaluate(AbstractBeforeAfterRule.java:46)
	at org.apache.lucene.util.TestRuleThreadAndTestName$1.evaluate(TestRuleThreadAndTestName.java:49)
	at org.apache.lucene.util.TestRuleIgnoreAfterMaxFailures$1.evaluate(TestRuleIgnoreAfterMaxFailures.java:65)
	at org.apache.lucene.util.TestRuleMarkFailure$1.evaluate(TestRuleMarkFailure.java:48)
	at com.carrotsearch.randomizedtesting.rules.StatementAdapter.evaluate(StatementAdapter.java:36)
	at com.carrotsearch.randomizedtesting.ThreadLeakControl$StatementRunner.run(ThreadLeakControl.java:365)
	at com.carrotsearch.randomizedtesting.ThreadLeakControl.forkTimeoutingTask(ThreadLeakControl.java:798)
	at com.carrotsearch.randomizedtesting.ThreadLeakControl$3.evaluate(ThreadLeakControl.java:458)
	at com.carrotsearch.randomizedtesting.RandomizedRunner.runSingleTest(RandomizedRunner.java:845)
	at com.carrotsearch.randomizedtesting.RandomizedRunner$3.evaluate(RandomizedRunner.java:747)
	at com.carrotsearch.randomizedtesting.RandomizedRunner$4.evaluate(RandomizedRunner.java:781)
	at com.carrotsearch.randomizedtesting.RandomizedRunner$5.evaluate(RandomizedRunner.java:792)
	at com.carrotsearch.randomizedtesting.rules.StatementAdapter.evaluate(StatementAdapter.java:36)
	at com.carrotsearch.randomizedtesting.rules.SystemPropertiesRestoreRule$1.evaluate(SystemPropertiesRestoreRule.java:53)
	at org.apache.lucene.util.AbstractBeforeAfterRule$1.evaluate(AbstractBeforeAfterRule.java:46)
	at com.carrotsearch.randomizedtesting.rules.StatementAdapter.evaluate(StatementAdapter.java:36)
	at org.apache.lucene.util.TestRuleStoreClassName$1.evaluate(TestRuleStoreClassName.java:42)
	at com.carrotsearch.randomizedtesting.rules.NoShadowingOrOverridesOnMethodsRule$1.evaluate(NoShadowingOrOverridesOnMethodsRule.java:39)
	at com.carrotsearch.randomizedtesting.rules.NoShadowingOrOverridesOnMethodsRule$1.evaluate(NoShadowingOrOverridesOnMethodsRule.java:39)
	at com.carrotsearch.randomizedtesting.rules.StatementAdapter.evaluate(StatementAdapter.java:36)
	at com.carrotsearch.randomizedtesting.rules.StatementAdapter.evaluate(StatementAdapter.java:36)
	at com.carrotsearch.randomizedtesting.rules.StatementAdapter.evaluate(StatementAdapter.java:36)
	at org.apache.lucene.util.TestRuleAssertionsRequired$1.evaluate(TestRuleAssertionsRequired.java:54)
	at org.apache.lucene.util.TestRuleMarkFailure$1.evaluate(TestRuleMarkFailure.java:48)
	at org.apache.lucene.util.TestRuleIgnoreAfterMaxFailures$1.evaluate(TestRuleIgnoreAfterMaxFailures.java:65)
	at org.apache.lucene.util.TestRuleIgnoreTestSuites$1.evaluate(TestRuleIgnoreTestSuites.java:55)
	at com.carrotsearch.randomizedtesting.rules.StatementAdapter.evaluate(StatementAdapter.java:36)
	at com.carrotsearch.randomizedtesting.ThreadLeakControl$StatementRunner.run(ThreadLeakControl.java:365)
	at java.lang.Thread.run(Thread.java:745)
Caused by: org.apache.http.NoHttpResponseException: The target server failed to respond
	at org.apache.http.impl.conn.DefaultHttpResponseParser.parseHead(DefaultHttpResponseParser.java:143)
	at org.apache.http.impl.conn.DefaultHttpResponseParser.parseHead(DefaultHttpResponseParser.java:57)
	at org.apache.http.impl.io.AbstractMessageParser.parse(AbstractMessageParser.java:260)
	at org.apache.http.impl.AbstractHttpClientConnection.receiveResponseHeader(AbstractHttpClientConnection.java:283)
	at org.apache.http.impl.conn.DefaultClientConnection.receiveResponseHeader(DefaultClientConnection.java:251)
	at org.apache.http.impl.conn.ManagedClientConnectionImpl.receiveResponseHeader(ManagedClientConnectionImpl.java:197)
	at org.apache.http.protocol.HttpRequestExecutor.doReceiveResponse(HttpRequestExecutor.java:271)
	at org.apache.http.protocol.HttpRequestExecutor.execute(HttpRequestExecutor.java:123)
	at org.apache.http.impl.client.DefaultRequestDirector.tryExecute(DefaultRequestDirector.java:682)
	at org.apache.http.impl.client.DefaultRequestDirector.execute(DefaultRequestDirector.java:486)
	at org.apache.http.impl.client.AbstractHttpClient.doExecute(AbstractHttpClient.java:863)
	at org.apache.http.impl.client.CloseableHttpClient.execute(CloseableHttpClient.java:82)
	at org.apache.http.impl.client.CloseableHttpClient.execute(CloseableHttpClient.java:106)
	at org.apache.http.impl.client.CloseableHttpClient.execute(CloseableHttpClient.java:57)
	at org.apache.solr.client.solrj.impl.HttpSolrClient.executeMethod(HttpSolrClient.java:490)
	... 48 more


FAILED:  org.apache.solr.cloud.RecoveryAfterSoftCommitTest.test

Error Message:
org.apache.http.NoHttpResponseException: The target server failed to respond

Stack Trace:
org.apache.solr.client.solrj.SolrServerException: org.apache.http.NoHttpResponseException: The target server failed to respond
	at __randomizedtesting.SeedInfo.seed([8381C26FCFFDE0A1:BD5FDB561018D59]:0)
	at org.apache.solr.client.solrj.impl.CloudSolrClient.requestWithRetryOnStaleState(CloudSolrClient.java:929)
	at org.apache.solr.client.solrj.impl.CloudSolrClient.request(CloudSolrClient.java:782)
	at org.apache.solr.client.solrj.SolrRequest.process(SolrRequest.java:135)
	at org.apache.solr.client.solrj.SolrClient.add(SolrClient.java:174)
	at org.apache.solr.client.solrj.SolrClient.add(SolrClient.java:139)
	at org.apache.solr.client.solrj.SolrClient.add(SolrClient.java:153)
	at org.apache.solr.cloud.RecoveryAfterSoftCommitTest.test(RecoveryAfterSoftCommitTest.java:88)
	at sun.reflect.NativeMethodAccessorImpl.invoke0(Native Method)
	at sun.reflect.NativeMethodAccessorImpl.invoke(NativeMethodAccessorImpl.java:57)
	at sun.reflect.DelegatingMethodAccessorImpl.invoke(DelegatingMethodAccessorImpl.java:43)
	at java.lang.reflect.Method.invoke(Method.java:606)
	at com.carrotsearch.randomizedtesting.RandomizedRunner.invoke(RandomizedRunner.java:1627)
	at com.carrotsearch.randomizedtesting.RandomizedRunner$6.evaluate(RandomizedRunner.java:836)
	at com.carrotsearch.randomizedtesting.RandomizedRunner$7.evaluate(RandomizedRunner.java:872)
	at com.carrotsearch.randomizedtesting.RandomizedRunner$8.evaluate(RandomizedRunner.java:886)
	at org.apache.solr.BaseDistributedSearchTestCase$ShardsRepeatRule$ShardsFixedStatement.callStatement(BaseDistributedSearchTestCase.java:958)
	at org.apache.solr.BaseDistributedSearchTestCase$ShardsRepeatRule$ShardsStatement.evaluate(BaseDistributedSearchTestCase.java:933)
	at com.carrotsearch.randomizedtesting.rules.SystemPropertiesRestoreRule$1.evaluate(SystemPropertiesRestoreRule.java:53)
	at org.apache.lucene.util.TestRuleSetupTeardownChained$1.evaluate(TestRuleSetupTeardownChained.java:50)
	at org.apache.lucene.util.AbstractBeforeAfterRule$1.evaluate(AbstractBeforeAfterRule.java:46)
	at org.apache.lucene.util.TestRuleThreadAndTestName$1.evaluate(TestRuleThreadAndTestName.java:49)
	at org.apache.lucene.util.TestRuleIgnoreAfterMaxFailures$1.evaluate(TestRuleIgnoreAfterMaxFailures.java:65)
	at org.apache.lucene.util.TestRuleMarkFailure$1.evaluate(TestRuleMarkFailure.java:48)
	at com.carrotsearch.randomizedtesting.rules.StatementAdapter.evaluate(StatementAdapter.java:36)
	at com.carrotsearch.randomizedtesting.ThreadLeakControl$StatementRunner.run(ThreadLeakControl.java:365)
	at com.carrotsearch.randomizedtesting.ThreadLeakControl.forkTimeoutingTask(ThreadLeakControl.java:798)
	at com.carrotsearch.randomizedtesting.ThreadLeakControl$3.evaluate(ThreadLeakControl.java:458)
	at com.carrotsearch.randomizedtesting.RandomizedRunner.runSingleTest(RandomizedRunner.java:845)
	at com.carrotsearch.randomizedtesting.RandomizedRunner$3.evaluate(RandomizedRunner.java:747)
	at com.carrotsearch.randomizedtesting.RandomizedRunner$4.evaluate(RandomizedRunner.java:781)
	at com.carrotsearch.randomizedtesting.RandomizedRunner$5.evaluate(RandomizedRunner.java:792)
	at com.carrotsearch.randomizedtesting.rules.StatementAdapter.evaluate(StatementAdapter.java:36)
	at com.carrotsearch.randomizedtesting.rules.SystemPropertiesRestoreRule$1.evaluate(SystemPropertiesRestoreRule.java:53)
	at org.apache.lucene.util.AbstractBeforeAfterRule$1.evaluate(AbstractBeforeAfterRule.java:46)
	at com.carrotsearch.randomizedtesting.rules.StatementAdapter.evaluate(StatementAdapter.java:36)
	at org.apache.lucene.util.TestRuleStoreClassName$1.evaluate(TestRuleStoreClassName.java:42)
	at com.carrotsearch.randomizedtesting.rules.NoShadowingOrOverridesOnMethodsRule$1.evaluate(NoShadowingOrOverridesOnMethodsRule.java:39)
	at com.carrotsearch.randomizedtesting.rules.NoShadowingOrOverridesOnMethodsRule$1.evaluate(NoShadowingOrOverridesOnMethodsRule.java:39)
	at com.carrotsearch.randomizedtesting.rules.StatementAdapter.evaluate(StatementAdapter.java:36)
	at com.carrotsearch.randomizedtesting.rules.StatementAdapter.evaluate(StatementAdapter.java:36)
	at com.carrotsearch.randomizedtesting.rules.StatementAdapter.evaluate(StatementAdapter.java:36)
	at org.apache.lucene.util.TestRuleAssertionsRequired$1.evaluate(TestRuleAssertionsRequired.java:54)
	at org.apache.lucene.util.TestRuleMarkFailure$1.evaluate(TestRuleMarkFailure.java:48)
	at org.apache.lucene.util.TestRuleIgnoreAfterMaxFailures$1.evaluate(TestRuleIgnoreAfterMaxFailures.java:65)
	at org.apache.lucene.util.TestRuleIgnoreTestSuites$1.evaluate(TestRuleIgnoreTestSuites.java:55)
	at com.carrotsearch.randomizedtesting.rules.StatementAdapter.evaluate(StatementAdapter.java:36)
	at com.carrotsearch.randomizedtesting.ThreadLeakControl$StatementRunner.run(ThreadLeakControl.java:365)
	at java.lang.Thread.run(Thread.java:745)
Caused by: org.apache.http.NoHttpResponseException: The target server failed to respond
	at org.apache.http.impl.conn.DefaultHttpResponseParser.parseHead(DefaultHttpResponseParser.java:143)
	at org.apache.http.impl.conn.DefaultHttpResponseParser.parseHead(DefaultHttpResponseParser.java:57)
	at org.apache.http.impl.io.AbstractMessageParser.parse(AbstractMessageParser.java:260)
	at org.apache.http.impl.AbstractHttpClientConnection.receiveResponseHeader(AbstractHttpClientConnection.java:283)
	at org.apache.http.impl.conn.DefaultClientConnection.receiveResponseHeader(DefaultClientConnection.java:251)
	at org.apache.http.impl.conn.ManagedClientConnectionImpl.receiveResponseHeader(ManagedClientConnectionImpl.java:197)
	at org.apache.http.protocol.HttpRequestExecutor.doReceiveResponse(HttpRequestExecutor.java:271)
	at org.apache.http.protocol.HttpRequestExecutor.execute(HttpRequestExecutor.java:123)
	at org.apache.http.impl.client.DefaultRequestDirector.tryExecute(DefaultRequestDirector.java:682)
	at org.apache.http.impl.client.DefaultRequestDirector.execute(DefaultRequestDirector.java:486)
	at org.apache.http.impl.client.AbstractHttpClient.doExecute(AbstractHttpClient.java:863)
	at org.apache.http.impl.client.CloseableHttpClient.execute(CloseableHttpClient.java:82)
	at org.apache.http.impl.client.CloseableHttpClient.execute(CloseableHttpClient.java:106)
	at org.apache.http.impl.client.CloseableHttpClient.execute(CloseableHttpClient.java:57)
	at org.apache.solr.client.solrj.impl.HttpSolrClient.executeMethod(HttpSolrClient.java:490)
	at org.apache.solr.client.solrj.impl.HttpSolrClient.request(HttpSolrClient.java:236)
	at org.apache.solr.client.solrj.impl.HttpSolrClient.request(HttpSolrClient.java:228)
	at org.apache.solr.client.solrj.impl.LBHttpSolrClient.doRequest(LBHttpSolrClient.java:370)
	at org.apache.solr.client.solrj.impl.LBHttpSolrClient.request(LBHttpSolrClient.java:325)
	at org.apache.solr.client.solrj.impl.CloudSolrClient$2.call(CloudSolrClient.java:596)
	at org.apache.solr.client.solrj.impl.CloudSolrClient$2.call(CloudSolrClient.java:593)
	at java.util.concurrent.FutureTask.run(FutureTask.java:262)
	at java.util.concurrent.ThreadPoolExecutor.runWorker(ThreadPoolExecutor.java:1145)
	at java.util.concurrent.ThreadPoolExecutor$Worker.run(ThreadPoolExecutor.java:615)
	... 1 more


FAILED:  org.apache.solr.cloud.ReplicationFactorTest.test

Error Message:
org.apache.http.NoHttpResponseException: The target server failed to respond

Stack Trace:
org.apache.solr.client.solrj.SolrServerException: org.apache.http.NoHttpResponseException: The target server failed to respond
	at __randomizedtesting.SeedInfo.seed([8381C26FCFFDE0A1:BD5FDB561018D59]:0)
	at org.apache.solr.client.solrj.impl.CloudSolrClient.requestWithRetryOnStaleState(CloudSolrClient.java:929)
	at org.apache.solr.client.solrj.impl.CloudSolrClient.request(CloudSolrClient.java:782)
	at org.apache.solr.client.solrj.SolrClient.request(SolrClient.java:1220)
	at org.apache.solr.cloud.ReplicationFactorTest.sendDoc(ReplicationFactorTest.java:308)
	at org.apache.solr.cloud.ReplicationFactorTest.testRf3(ReplicationFactorTest.java:234)
	at org.apache.solr.cloud.ReplicationFactorTest.test(ReplicationFactorTest.java:113)
	at sun.reflect.NativeMethodAccessorImpl.invoke0(Native Method)
	at sun.reflect.NativeMethodAccessorImpl.invoke(NativeMethodAccessorImpl.java:57)
	at sun.reflect.DelegatingMethodAccessorImpl.invoke(DelegatingMethodAccessorImpl.java:43)
	at java.lang.reflect.Method.invoke(Method.java:606)
	at com.carrotsearch.randomizedtesting.RandomizedRunner.invoke(RandomizedRunner.java:1627)
	at com.carrotsearch.randomizedtesting.RandomizedRunner$6.evaluate(RandomizedRunner.java:836)
	at com.carrotsearch.randomizedtesting.RandomizedRunner$7.evaluate(RandomizedRunner.java:872)
	at com.carrotsearch.randomizedtesting.RandomizedRunner$8.evaluate(RandomizedRunner.java:886)
	at org.apache.solr.BaseDistributedSearchTestCase$ShardsRepeatRule$ShardsFixedStatement.callStatement(BaseDistributedSearchTestCase.java:958)
	at org.apache.solr.BaseDistributedSearchTestCase$ShardsRepeatRule$ShardsStatement.evaluate(BaseDistributedSearchTestCase.java:933)
	at com.carrotsearch.randomizedtesting.rules.SystemPropertiesRestoreRule$1.evaluate(SystemPropertiesRestoreRule.java:53)
	at org.apache.lucene.util.TestRuleSetupTeardownChained$1.evaluate(TestRuleSetupTeardownChained.java:50)
	at org.apache.lucene.util.AbstractBeforeAfterRule$1.evaluate(AbstractBeforeAfterRule.java:46)
	at org.apache.lucene.util.TestRuleThreadAndTestName$1.evaluate(TestRuleThreadAndTestName.java:49)
	at org.apache.lucene.util.TestRuleIgnoreAfterMaxFailures$1.evaluate(TestRuleIgnoreAfterMaxFailures.java:65)
	at org.apache.lucene.util.TestRuleMarkFailure$1.evaluate(TestRuleMarkFailure.java:48)
	at com.carrotsearch.randomizedtesting.rules.StatementAdapter.evaluate(StatementAdapter.java:36)
	at com.carrotsearch.randomizedtesting.ThreadLeakControl$StatementRunner.run(ThreadLeakControl.java:365)
	at com.carrotsearch.randomizedtesting.ThreadLeakControl.forkTimeoutingTask(ThreadLeakControl.java:798)
	at com.carrotsearch.randomizedtesting.ThreadLeakControl$3.evaluate(ThreadLeakControl.java:458)
	at com.carrotsearch.randomizedtesting.RandomizedRunner.runSingleTest(RandomizedRunner.java:845)
	at com.carrotsearch.randomizedtesting.RandomizedRunner$3.evaluate(RandomizedRunner.java:747)
	at com.carrotsearch.randomizedtesting.RandomizedRunner$4.evaluate(RandomizedRunner.java:781)
	at com.carrotsearch.randomizedtesting.RandomizedRunner$5.evaluate(RandomizedRunner.java:792)
	at com.carrotsearch.randomizedtesting.rules.StatementAdapter.evaluate(StatementAdapter.java:36)
	at com.carrotsearch.randomizedtesting.rules.SystemPropertiesRestoreRule$1.evaluate(SystemPropertiesRestoreRule.java:53)
	at org.apache.lucene.util.AbstractBeforeAfterRule$1.evaluate(AbstractBeforeAfterRule.java:46)
	at com.carrotsearch.randomizedtesting.rules.StatementAdapter.evaluate(StatementAdapter.java:36)
	at org.apache.lucene.util.TestRuleStoreClassName$1.evaluate(TestRuleStoreClassName.java:42)
	at com.carrotsearch.randomizedtesting.rules.NoShadowingOrOverridesOnMethodsRule$1.evaluate(NoShadowingOrOverridesOnMethodsRule.java:39)
	at com.carrotsearch.randomizedtesting.rules.NoShadowingOrOverridesOnMethodsRule$1.evaluate(NoShadowingOrOverridesOnMethodsRule.java:39)
	at com.carrotsearch.randomizedtesting.rules.StatementAdapter.evaluate(StatementAdapter.java:36)
	at com.carrotsearch.randomizedtesting.rules.StatementAdapter.evaluate(StatementAdapter.java:36)
	at com.carrotsearch.randomizedtesting.rules.StatementAdapter.evaluate(StatementAdapter.java:36)
	at org.apache.lucene.util.TestRuleAssertionsRequired$1.evaluate(TestRuleAssertionsRequired.java:54)
	at org.apache.lucene.util.TestRuleMarkFailure$1.evaluate(TestRuleMarkFailure.java:48)
	at org.apache.lucene.util.TestRuleIgnoreAfterMaxFailures$1.evaluate(TestRuleIgnoreAfterMaxFailures.java:65)
	at org.apache.lucene.util.TestRuleIgnoreTestSuites$1.evaluate(TestRuleIgnoreTestSuites.java:55)
	at com.carrotsearch.randomizedtesting.rules.StatementAdapter.evaluate(StatementAdapter.java:36)
	at com.carrotsearch.randomizedtesting.ThreadLeakControl$StatementRunner.run(ThreadLeakControl.java:365)
	at java.lang.Thread.run(Thread.java:745)
Caused by: org.apache.http.NoHttpResponseException: The target server failed to respond
	at org.apache.http.impl.conn.DefaultHttpResponseParser.parseHead(DefaultHttpResponseParser.java:143)
	at org.apache.http.impl.conn.DefaultHttpResponseParser.parseHead(DefaultHttpResponseParser.java:57)
	at org.apache.http.impl.io.AbstractMessageParser.parse(AbstractMessageParser.java:260)
	at org.apache.http.impl.AbstractHttpClientConnection.receiveResponseHeader(AbstractHttpClientConnection.java:283)
	at org.apache.http.impl.conn.DefaultClientConnection.receiveResponseHeader(DefaultClientConnection.java:251)
	at org.apache.http.impl.conn.ManagedClientConnectionImpl.receiveResponseHeader(ManagedClientConnectionImpl.java:197)
	at org.apache.http.protocol.HttpRequestExecutor.doReceiveResponse(HttpRequestExecutor.java:271)
	at org.apache.http.protocol.HttpRequestExecutor.execute(HttpRequestExecutor.java:123)
	at org.apache.http.impl.client.DefaultRequestDirector.tryExecute(DefaultRequestDirector.java:682)
	at org.apache.http.impl.client.DefaultRequestDirector.execute(DefaultRequestDirector.java:486)
	at org.apache.http.impl.client.AbstractHttpClient.doExecute(AbstractHttpClient.java:863)
	at org.apache.http.impl.client.CloseableHttpClient.execute(CloseableHttpClient.java:82)
	at org.apache.http.impl.client.CloseableHttpClient.execute(CloseableHttpClient.java:106)
	at org.apache.http.impl.client.CloseableHttpClient.execute(CloseableHttpClient.java:57)
	at org.apache.solr.client.solrj.impl.HttpSolrClient.executeMethod(HttpSolrClient.java:490)
	at org.apache.solr.client.solrj.impl.HttpSolrClient.request(HttpSolrClient.java:236)
	at org.apache.solr.client.solrj.impl.HttpSolrClient.request(HttpSolrClient.java:228)
	at org.apache.solr.client.solrj.impl.LBHttpSolrClient.doRequest(LBHttpSolrClient.java:370)
	at org.apache.solr.client.solrj.impl.LBHttpSolrClient.request(LBHttpSolrClient.java:325)
	at org.apache.solr.client.solrj.impl.CloudSolrClient$2.call(CloudSolrClient.java:596)
	at org.apache.solr.client.solrj.impl.CloudSolrClient$2.call(CloudSolrClient.java:593)
	at java.util.concurrent.FutureTask.run(FutureTask.java:262)
	at java.util.concurrent.ThreadPoolExecutor.runWorker(ThreadPoolExecutor.java:1145)
	at java.util.concurrent.ThreadPoolExecutor$Worker.run(ThreadPoolExecutor.java:615)
	... 1 more




Build Log:
[...truncated 10425 lines...]
   [junit4] Suite: org.apache.solr.cloud.ReplicationFactorTest
   [junit4]   2> Creating dataDir: /usr/home/jenkins/jenkins-slave/workspace/Lucene-Solr-NightlyTests-5.x/solr/build/solr-core/test/J0/temp/solr.cloud.ReplicationFactorTest 8381C26FCFFDE0A1-001/init-core-data-001
   [junit4]   2> 1298782 T3630 oas.BaseDistributedSearchTestCase.initHostContext Setting hostContext system property: /c_/n
   [junit4]   2> 1298789 T3630 oasc.ZkTestServer.run STARTING ZK TEST SERVER
   [junit4]   1> client port:0.0.0.0/0.0.0.0:0
   [junit4]   2> 1298790 T3631 oasc.ZkTestServer$ZKServerMain.runFromConfig Starting server
   [junit4]   2> 1298890 T3630 oasc.ZkTestServer.run start zk server on port:18957
   [junit4]   2> 1298891 T3630 oascc.SolrZkClient.createZkCredentialsToAddAutomatically Using default ZkCredentialsProvider
   [junit4]   2> 1298892 T3630 oascc.ConnectionManager.waitForConnected Waiting for client to connect to ZooKeeper
   [junit4]   2> 1298897 T3638 oascc.ConnectionManager.process Watcher org.apache.solr.common.cloud.ConnectionManager@3a8e8916 name:ZooKeeperConnection Watcher:127.0.0.1:18957 got event WatchedEvent state:SyncConnected type:None path:null path:null type:None
   [junit4]   2> 1298897 T3630 oascc.ConnectionManager.waitForConnected Client is connected to ZooKeeper
   [junit4]   2> 1298897 T3630 oascc.SolrZkClient.createZkACLProvider Using default ZkACLProvider
   [junit4]   2> 1298898 T3630 oascc.SolrZkClient.makePath makePath: /solr
   [junit4]   2> 1298900 T3630 oascc.SolrZkClient.createZkCredentialsToAddAutomatically Using default ZkCredentialsProvider
   [junit4]   2> 1298901 T3630 oascc.ConnectionManager.waitForConnected Waiting for client to connect to ZooKeeper
   [junit4]   2> 1298903 T3641 oascc.ConnectionManager.process Watcher org.apache.solr.common.cloud.ConnectionManager@49e3c6d name:ZooKeeperConnection Watcher:127.0.0.1:18957/solr got event WatchedEvent state:SyncConnected type:None path:null path:null type:None
   [junit4]   2> 1298903 T3630 oascc.ConnectionManager.waitForConnected Client is connected to ZooKeeper
   [junit4]   2> 1298903 T3630 oascc.SolrZkClient.createZkACLProvider Using default ZkACLProvider
   [junit4]   2> 1298904 T3630 oascc.SolrZkClient.makePath makePath: /collections/collection1
   [junit4]   2> 1298906 T3630 oascc.SolrZkClient.makePath makePath: /collections/collection1/shards
   [junit4]   2> 1298907 T3630 oascc.SolrZkClient.makePath makePath: /collections/control_collection
   [junit4]   2> 1298909 T3630 oascc.SolrZkClient.makePath makePath: /collections/control_collection/shards
   [junit4]   2> 1298910 T3630 oasc.AbstractZkTestCase.putConfig put /usr/home/jenkins/jenkins-slave/workspace/Lucene-Solr-NightlyTests-5.x/solr/core/src/test-files/solr/collection1/conf/solrconfig-tlog.xml to /configs/conf1/solrconfig.xml
   [junit4]   2> 1298911 T3630 oascc.SolrZkClient.makePath makePath: /configs/conf1/solrconfig.xml
   [junit4]   2> 1298914 T3630 oasc.AbstractZkTestCase.putConfig put /usr/home/jenkins/jenkins-slave/workspace/Lucene-Solr-NightlyTests-5.x/solr/core/src/test-files/solr/collection1/conf/schema.xml to /configs/conf1/schema.xml
   [junit4]   2> 1298914 T3630 oascc.SolrZkClient.makePath makePath: /configs/conf1/schema.xml
   [junit4]   2> 1299260 T3630 oasc.AbstractZkTestCase.putConfig put /usr/home/jenkins/jenkins-slave/workspace/Lucene-Solr-NightlyTests-5.x/solr/core/src/test-files/solr/collection1/conf/solrconfig.snippet.randomindexconfig.xml to /configs/conf1/solrconfig.snippet.randomindexconfig.xml
   [junit4]   2> 1299260 T3630 oascc.SolrZkClient.makePath makePath: /configs/conf1/solrconfig.snippet.randomindexconfig.xml
   [junit4]   2> 1299262 T3630 oasc.AbstractZkTestCase.putConfig put /usr/home/jenkins/jenkins-slave/workspace/Lucene-Solr-NightlyTests-5.x/solr/core/src/test-files/solr/collection1/conf/stopwords.txt to /configs/conf1/stopwords.txt
   [junit4]   2> 1299263 T3630 oascc.SolrZkClient.makePath makePath: /configs/conf1/stopwords.txt
   [junit4]   2> 1299264 T3630 oasc.AbstractZkTestCase.putConfig put /usr/home/jenkins/jenkins-slave/workspace/Lucene-Solr-NightlyTests-5.x/solr/core/src/test-files/solr/collection1/conf/protwords.txt to /configs/conf1/protwords.txt
   [junit4]   2> 1299265 T3630 oascc.SolrZkClient.makePath makePath: /configs/conf1/protwords.txt
   [junit4]   2> 1299266 T3630 oasc.AbstractZkTestCase.putConfig put /usr/home/jenkins/jenkins-slave/workspace/Lucene-Solr-NightlyTests-5.x/solr/core/src/test-files/solr/collection1/conf/currency.xml to /configs/conf1/currency.xml
   [junit4]   2> 1299266 T3630 oascc.SolrZkClient.makePath makePath: /configs/conf1/currency.xml
   [junit4]   2> 1299268 T3630 oasc.AbstractZkTestCase.putConfig put /usr/home/jenkins/jenkins-slave/workspace/Lucene-Solr-NightlyTests-5.x/solr/core/src/test-files/solr/collection1/conf/enumsConfig.xml to /configs/conf1/enumsConfig.xml
   [junit4]   2> 1299268 T3630 oascc.SolrZkClient.makePath makePath: /configs/conf1/enumsConfig.xml
   [junit4]   2> 1299270 T3630 oasc.AbstractZkTestCase.putConfig put /usr/home/jenkins/jenkins-slave/workspace/Lucene-Solr-NightlyTests-5.x/solr/core/src/test-files/solr/collection1/conf/open-exchange-rates.json to /configs/conf1/open-exchange-rates.json
   [junit4]   2> 1299270 T3630 oascc.SolrZkClient.makePath makePath: /configs/conf1/open-exchange-rates.json
   [junit4]   2> 1299271 T3630 oasc.AbstractZkTestCase.putConfig put /usr/home/jenkins/jenkins-slave/workspace/Lucene-Solr-NightlyTests-5.x/solr/core/src/test-files/solr/collection1/conf/mapping-ISOLatin1Accent.txt to /configs/conf1/mapping-ISOLatin1Accent.txt
   [junit4]   2> 1299272 T3630 oascc.SolrZkClient.makePath makePath: /configs/conf1/mapping-ISOLatin1Accent.txt
   [junit4]   2> 1299273 T3630 oasc.AbstractZkTestCase.putConfig put /usr/home/jenkins/jenkins-slave/workspace/Lucene-Solr-NightlyTests-5.x/solr/core/src/test-files/solr/collection1/conf/old_synonyms.txt to /configs/conf1/old_synonyms.txt
   [junit4]   2> 1299273 T3630 oascc.SolrZkClient.makePath makePath: /configs/conf1/old_synonyms.txt
   [junit4]   2> 1299275 T3630 oasc.AbstractZkTestCase.putConfig put /usr/home/jenkins/jenkins-slave/workspace/Lucene-Solr-NightlyTests-5.x/solr/core/src/test-files/solr/collection1/conf/synonyms.txt to /configs/conf1/synonyms.txt
   [junit4]   2> 1299275 T3630 oascc.SolrZkClient.makePath makePath: /configs/conf1/synonyms.txt
   [junit4]   2> 1300304 T3630 oas.SolrTestCaseJ4.writeCoreProperties Writing core.properties file to /usr/home/jenkins/jenkins-slave/workspace/Lucene-Solr-NightlyTests-5.x/solr/build/solr-core/test/J0/temp/solr.cloud.ReplicationFactorTest 8381C26FCFFDE0A1-001/control-001/cores/collection1
   [junit4]   2> 1300308 T3630 oejs.Server.doStart jetty-8.1.10.v20130312
   [junit4]   2> 1300313 T3630 oejs.AbstractConnector.doStart Started SocketConnector@127.0.0.1:18963
   [junit4]   2> 1300313 T3630 oascse.JettySolrRunner$1.lifeCycleStarted Jetty properties: {hostPort=18962, solr.data.dir=/usr/home/jenkins/jenkins-slave/workspace/Lucene-Solr-NightlyTests-5.x/solr/build/solr-core/test/J0/temp/solr.cloud.ReplicationFactorTest 8381C26FCFFDE0A1-001/tempDir-001/control/data, coreRootDirectory=/usr/home/jenkins/jenkins-slave/workspace/Lucene-Solr-NightlyTests-5.x/solr/build/solr-core/test/J0/temp/solr.cloud.ReplicationFactorTest 8381C26FCFFDE0A1-001/control-001/cores, hostContext=/c_/n}
   [junit4]   2> 1300314 T3630 oass.SolrDispatchFilter.init SolrDispatchFilter.init()sun.misc.Launcher$AppClassLoader@231bf785
   [junit4]   2> 1300314 T3630 oasc.SolrResourceLoader.<init> new SolrResourceLoader for directory: '/usr/home/jenkins/jenkins-slave/workspace/Lucene-Solr-NightlyTests-5.x/solr/build/solr-core/test/J0/temp/solr.cloud.ReplicationFactorTest 8381C26FCFFDE0A1-001/control-001/'
   [junit4]   2> 1300360 T3630 oasc.SolrXmlConfig.fromFile Loading container configuration from /usr/home/jenkins/jenkins-slave/workspace/Lucene-Solr-NightlyTests-5.x/solr/build/solr-core/test/J0/temp/solr.cloud.ReplicationFactorTest 8381C26FCFFDE0A1-001/control-001/solr.xml
   [junit4]   2> 1300416 T3630 oasc.CorePropertiesLocator.<init> Config-defined core root directory: /usr/home/jenkins/jenkins-slave/workspace/Lucene-Solr-NightlyTests-5.x/solr/build/solr-core/test/J0/temp/solr.cloud.ReplicationFactorTest 8381C26FCFFDE0A1-001/control-001/cores
   [junit4]   2> 1300416 T3630 oasc.CoreContainer.<init> New CoreContainer 625037247
   [junit4]   2> 1300417 T3630 oasc.CoreContainer.load Loading cores into CoreContainer [instanceDir=/usr/home/jenkins/jenkins-slave/workspace/Lucene-Solr-NightlyTests-5.x/solr/build/solr-core/test/J0/temp/solr.cloud.ReplicationFactorTest 8381C26FCFFDE0A1-001/control-001/]
   [junit4]   2> 1300417 T3630 oasc.CoreContainer.load loading shared library: /usr/home/jenkins/jenkins-slave/workspace/Lucene-Solr-NightlyTests-5.x/solr/build/solr-core/test/J0/temp/solr.cloud.ReplicationFactorTest 8381C26FCFFDE0A1-001/control-001/lib
   [junit4]   2> 1300418 T3630 oasc.SolrResourceLoader.addToClassLoader WARN Can't find (or read) directory to add to classloader: lib (resolved as: /usr/home/jenkins/jenkins-slave/workspace/Lucene-Solr-NightlyTests-5.x/solr/build/solr-core/test/J0/temp/solr.cloud.ReplicationFactorTest 8381C26FCFFDE0A1-001/control-001/lib).
   [junit4]   2> 1300431 T3630 oashc.HttpShardHandlerFactory.getParameter Setting socketTimeout to: 90000
   [junit4]   2> 1300432 T3630 oashc.HttpShardHandlerFactory.getParameter Setting urlScheme to: 
   [junit4]   2> 1300432 T3630 oashc.HttpShardHandlerFactory.getParameter Setting connTimeout to: 15000
   [junit4]   2> 1300432 T3630 oashc.HttpShardHandlerFactory.getParameter Setting maxConnectionsPerHost to: 20
   [junit4]   2> 1300433 T3630 oashc.HttpShardHandlerFactory.getParameter Setting maxConnections to: 10000
   [junit4]   2> 1300433 T3630 oashc.HttpShardHandlerFactory.getParameter Setting corePoolSize to: 0
   [junit4]   2> 1300434 T3630 oashc.HttpShardHandlerFactory.getParameter Setting maximumPoolSize to: 2147483647
   [junit4]   2> 1300434 T3630 oashc.HttpShardHandlerFactory.getParameter Setting maxThreadIdleTime to: 5
   [junit4]   2> 1300434 T3630 oashc.HttpShardHandlerFactory.getParameter Setting sizeOfQueue to: -1
   [junit4]   2> 1300434 T3630 oashc.HttpShardHandlerFactory.getParameter Setting fairnessPolicy to: false
   [junit4]   2> 1300435 T3630 oashc.HttpShardHandlerFactory.getParameter Setting useRetries to: false
   [junit4]   2> 1300435 T3630 oasu.UpdateShardHandler.<init> Creating UpdateShardHandler HTTP client with params: socketTimeout=340000&connTimeout=45000&retry=true
   [junit4]   2> 1300436 T3630 oasl.LogWatcher.createWatcher SLF4J impl is org.slf4j.impl.Log4jLoggerFactory
   [junit4]   2> 1300436 T3630 oasl.LogWatcher.newRegisteredLogWatcher Registering Log Listener [Log4j (org.slf4j.impl.Log4jLoggerFactory)]
   [junit4]   2> 1300436 T3630 oasc.CoreContainer.load Node Name: 127.0.0.1
   [junit4]   2> 1300437 T3630 oasc.ZkContainer.initZooKeeper Zookeeper client=127.0.0.1:18957/solr
   [junit4]   2> 1300437 T3630 oasc.ZkController.checkChrootPath zkHost includes chroot
   [junit4]   2> 1300437 T3630 oascc.SolrZkClient.createZkCredentialsToAddAutomatically Using default ZkCredentialsProvider
   [junit4]   2> 1300438 T3630 oascc.ConnectionManager.waitForConnected Waiting for client to connect to ZooKeeper
   [junit4]   2> 1300440 T3653 oascc.ConnectionManager.process Watcher org.apache.solr.common.cloud.ConnectionManager@16456cb7 name:ZooKeeperConnection Watcher:127.0.0.1:18957 got event WatchedEvent state:SyncConnected type:None path:null path:null type:None
   [junit4]   2> 1300441 T3630 oascc.ConnectionManager.waitForConnected Client is connected to ZooKeeper
   [junit4]   2> 1300441 T3630 oascc.SolrZkClient.createZkACLProvider Using default ZkACLProvider
   [junit4]   2> 1300443 T3630 oascc.ConnectionManager.waitForConnected Waiting for client to connect to ZooKeeper
   [junit4]   2> 1300444 T3656 oascc.ConnectionManager.process Watcher org.apache.solr.common.cloud.ConnectionManager@4743a2c9 name:ZooKeeperConnection Watcher:127.0.0.1:18957/solr got event WatchedEvent state:SyncConnected type:None path:null path:null type:None
   [junit4]   2> 1300445 T3630 oascc.ConnectionManager.waitForConnected Client is connected to ZooKeeper
   [junit4]   2> 1300446 T3630 oascc.SolrZkClient.makePath makePath: /overseer/queue
   [junit4]   2> 1300448 T3630 oascc.SolrZkClient.makePath makePath: /overseer/collection-queue-work
   [junit4]   2> 1300450 T3630 oascc.SolrZkClient.makePath makePath: /overseer/collection-map-running
   [junit4]   2> 1300452 T3630 oascc.SolrZkClient.makePath makePath: /overseer/collection-map-completed
   [junit4]   2> 1300454 T3630 oascc.SolrZkClient.makePath makePath: /overseer/collection-map-failure
   [junit4]   2> 1300456 T3630 oascc.SolrZkClient.makePath makePath: /live_nodes
   [junit4]   2> 1300457 T3630 oascc.SolrZkClient.makePath makePath: /aliases.json
   [junit4]   2> 1300459 T3630 oascc.SolrZkClient.makePath makePath: /clusterstate.json
   [junit4]   2> 1300460 T3630 oasc.ZkController.createEphemeralLiveNode Register node as live in ZooKeeper:/live_nodes/127.0.0.1:18962_c_%2Fn
   [junit4]   2> 1300460 T3630 oascc.SolrZkClient.makePath makePath: /live_nodes/127.0.0.1:18962_c_%2Fn
   [junit4]   2> 1300462 T3630 oascc.SolrZkClient.makePath makePath: /overseer_elect
   [junit4]   2> 1300463 T3630 oascc.SolrZkClient.makePath makePath: /overseer_elect/election
   [junit4]   2> 1300464 T3630 oasc.Overseer.close Overseer (id=null) closing
   [junit4]   2> 1300466 T3630 oasc.OverseerElectionContext.runLeaderProcess I am going to be the leader 127.0.0.1:18962_c_%2Fn
   [junit4]   2> 1300466 T3630 oascc.SolrZkClient.makePath makePath: /overseer_elect/leader
   [junit4]   2> 1300467 T3630 oasc.Overseer.start Overseer (id=93494158004649987-127.0.0.1:18962_c_%2Fn-n_0000000000) starting
   [junit4]   2> 1300469 T3630 oascc.SolrZkClient.makePath makePath: /overseer/queue-work
   [junit4]   2> 1300474 T3630 oasc.OverseerAutoReplicaFailoverThread.<init> Starting OverseerAutoReplicaFailoverThread autoReplicaFailoverWorkLoopDelay=10000 autoReplicaFailoverWaitAfterExpiration=30000 autoReplicaFailoverBadNodeExpiration=60000
   [junit4]   2> 1300475 T3658 oasc.OverseerCollectionProcessor.run Process current queue of collection creations
   [junit4]   2> 1300475 T3657 oasc.Overseer$ClusterStateUpdater.run Starting to work on the main queue
   [junit4]   2> 1300475 T3630 oascc.ZkStateReader.createClusterStateWatchersAndUpdate Updating cluster state from ZooKeeper... 
   [junit4]   2> 1300478 T3630 oasc.CorePropertiesLocator.discover Looking for core definitions underneath /usr/home/jenkins/jenkins-slave/workspace/Lucene-Solr-NightlyTests-5.x/solr/build/solr-core/test/J0/temp/solr.cloud.ReplicationFactorTest 8381C26FCFFDE0A1-001/control-001/cores
   [junit4]   1> CORE DESCRIPTOR: {instanceDir=/usr/home/jenkins/jenkins-slave/workspace/Lucene-Solr-NightlyTests-5.x/solr/build/solr-core/test/J0/temp/solr.cloud.ReplicationFactorTest 8381C26FCFFDE0A1-001/control-001/cores/collection1, dataDir=data/, collection=control_collection, shard=, absoluteInstDir=/usr/home/jenkins/jenkins-slave/workspace/Lucene-Solr-NightlyTests-5.x/solr/build/solr-core/test/J0/temp/solr.cloud.ReplicationFactorTest 8381C26FCFFDE0A1-001/control-001/cores/collection1/, schema=schema.xml, coreNodeName=, name=collection1, transient=false, config=solrconfig.xml, loadOnStartup=true}
   [junit4]   2> 1300479 T3630 oasc.CorePropertiesLocator.discoverUnder Found core collection1 in /usr/home/jenkins/jenkins-slave/workspace/Lucene-Solr-NightlyTests-5.x/solr/build/solr-core/test/J0/temp/solr.cloud.ReplicationFactorTest 8381C26FCFFDE0A1-001/control-001/cores/collection1/
   [junit4]   2> 1300480 T3630 oasc.CorePropertiesLocator.discover Found 1 core definitions
   [junit4]   2> 1300480 T3660 oasc.ZkController.publish publishing core=collection1 state=down collection=control_collection
   [junit4]   2> 1300480 T3660 oasc.ZkController.publish numShards not found on descriptor - reading it from system property
   [junit4]   2> 1300481 T3660 oasc.ZkController.waitForCoreNodeName look for our core node name
   [junit4]   2> 1300481 T3656 oasc.DistributedQueue$LatchWatcher.process NodeChildrenChanged fired on path /overseer/queue state SyncConnected
   [junit4]   2> 1300482 T3657 oasc.Overseer$ClusterStateUpdater.run processMessage: queueSize: 1, message = {
   [junit4]   2> 	  "roles":null,
   [junit4]   2> 	  "node_name":"127.0.0.1:18962_c_%2Fn",
   [junit4]   2> 	  "collection":"control_collection",
   [junit4]   2> 	  "numShards":"1",
   [junit4]   2> 	  "shard":null,
   [junit4]   2> 	  "base_url":"http://127.0.0.1:18962/c_/n",
   [junit4]   2> 	  "core":"collection1",
   [junit4]   2> 	  "operation":"state",
   [junit4]   2> 	  "state":"down"} current state version: 0
   [junit4]   2> 1300483 T3657 oasco.ReplicaMutator.updateState Update state numShards=1 message={
   [junit4]   2> 	  "roles":null,
   [junit4]   2> 	  "node_name":"127.0.0.1:18962_c_%2Fn",
   [junit4]   2> 	  "collection":"control_collection",
   [junit4]   2> 	  "numShards":"1",
   [junit4]   2> 	  "shard":null,
   [junit4]   2> 	  "base_url":"http://127.0.0.1:18962/c_/n",
   [junit4]   2> 	  "core":"collection1",
   [junit4]   2> 	  "operation":"state",
   [junit4]   2> 	  "state":"down"}
   [junit4]   2> 1300483 T3657 oasco.ClusterStateMutator.createCollection building a new cName: control_collection
   [junit4]   2> 1300483 T3657 oasco.ReplicaMutator.updateState Assigning new node to shard shard=shard1
   [junit4]   2> 1300484 T3656 oascc.ZkStateReader$2.process A cluster state change: WatchedEvent state:SyncConnected type:NodeDataChanged path:/clusterstate.json, has occurred - updating... (live nodes size: 1)
   [junit4]   2> 1301481 T3660 oasc.ZkController.waitForShardId waiting to find shard id in clusterstate for collection1
   [junit4]   2> 1301482 T3660 oasc.ZkController.createCollectionZkNode Check for collection zkNode:control_collection
   [junit4]   2> 1301483 T3660 oasc.ZkController.createCollectionZkNode Collection zkNode exists
   [junit4]   2> 1301483 T3660 oascc.ZkStateReader.readConfigName Load collection config from:/collections/control_collection
   [junit4]   2> 1301484 T3660 oascc.ZkStateReader.readConfigName path=/collections/control_collection configName=conf1 specified config exists in ZooKeeper
   [junit4]   2> 1301484 T3660 oasc.SolrResourceLoader.<init> new SolrResourceLoader for directory: '/usr/home/jenkins/jenkins-slave/workspace/Lucene-Solr-NightlyTests-5.x/solr/build/solr-core/test/J0/temp/solr.cloud.ReplicationFactorTest 8381C26FCFFDE0A1-001/control-001/cores/collection1/'
   [junit4]   2> 1301502 T3660 oasc.ZkController.watchZKConfDir watch zkdir /configs/conf1
   [junit4]   2> 1301505 T3660 oasc.Config.<init> loaded config solrconfig.xml with version 0 
   [junit4]   2> 1301516 T3660 oasc.SolrConfig.refreshRequestParams current version of requestparams : -1
   [junit4]   2> 1301543 T3660 oasc.SolrConfig.<init> Using Lucene MatchVersion: 5.1.0
   [junit4]   2> 1301608 T3660 oasc.SolrConfig.<init> Loaded SolrConfig: solrconfig.xml
   [junit4]   2> 1301709 T3660 oass.IndexSchema.readSchema Reading Solr Schema from /configs/conf1/schema.xml
   [junit4]   2> 1301721 T3660 oass.IndexSchema.readSchema [collection1] Schema name=test
   [junit4]   2> 1302143 T3660 oass.OpenExchangeRatesOrgProvider.init Initialized with rates=open-exchange-rates.json, refreshInterval=1440.
   [junit4]   2> 1302162 T3660 oass.IndexSchema.readSchema default search field in schema is text
   [junit4]   2> 1302165 T3660 oass.IndexSchema.readSchema unique key field: id
   [junit4]   2> 1302180 T3660 oass.FileExchangeRateProvider.reload Reloading exchange rates from file currency.xml
   [junit4]   2> 1302186 T3660 oass.FileExchangeRateProvider.reload Reloading exchange rates from file currency.xml
   [junit4]   2> 1302193 T3660 oass.OpenExchangeRatesOrgProvider.reload Reloading exchange rates from open-exchange-rates.json
   [junit4]   2> 1302194 T3660 oass.OpenExchangeRatesOrgProvider$OpenExchangeRates.<init> WARN Unknown key IMPORTANT NOTE
   [junit4]   2> 1302194 T3660 oass.OpenExchangeRatesOrgProvider$OpenExchangeRates.<init> WARN Expected key, got STRING
   [junit4]   2> 1302195 T3660 oass.OpenExchangeRatesOrgProvider.reload Reloading exchange rates from open-exchange-rates.json
   [junit4]   2> 1302196 T3660 oass.OpenExchangeRatesOrgProvider$OpenExchangeRates.<init> WARN Unknown key IMPORTANT NOTE
   [junit4]   2> 1302196 T3660 oass.OpenExchangeRatesOrgProvider$OpenExchangeRates.<init> WARN Expected key, got STRING
   [junit4]   2> 1302196 T3660 oasc.CoreContainer.create Creating SolrCore 'collection1' using configuration from collection control_collection
   [junit4]   2> 1302197 T3660 oasc.SolrCore.initDirectoryFactory org.apache.solr.core.MockDirectoryFactory
   [junit4]   2> 1302197 T3660 oasc.SolrCore.<init> [collection1] Opening new SolrCore at /usr/home/jenkins/jenkins-slave/workspace/Lucene-Solr-NightlyTests-5.x/solr/build/solr-core/test/J0/temp/solr.cloud.ReplicationFactorTest 8381C26FCFFDE0A1-001/control-001/cores/collection1/, dataDir=/usr/home/jenkins/jenkins-slave/workspace/Lucene-Solr-NightlyTests-5.x/solr/build/solr-core/test/J0/temp/solr.cloud.ReplicationFactorTest 8381C26FCFFDE0A1-001/control-001/cores/collection1/data/
   [junit4]   2> 1302197 T3660 oasc.JmxMonitoredMap.<init> JMX monitoring is enabled. Adding Solr mbeans to JMX Server: com.sun.jmx.mbeanserver.JmxMBeanServer@7280b7aa
   [junit4]   2> 1302198 T3660 oasc.CachingDirectoryFactory.get return new directory for /usr/home/jenkins/jenkins-slave/workspace/Lucene-Solr-NightlyTests-5.x/solr/build/solr-core/test/J0/temp/solr.cloud.ReplicationFactorTest 8381C26FCFFDE0A1-001/control-001/cores/collection1/data
   [junit4]   2> 1302198 T3660 oasc.SolrCore.getNewIndexDir New index directory detected: old=null new=/usr/home/jenkins/jenkins-slave/workspace/Lucene-Solr-NightlyTests-5.x/solr/build/solr-core/test/J0/temp/solr.cloud.ReplicationFactorTest 8381C26FCFFDE0A1-001/control-001/cores/collection1/data/index/
   [junit4]   2> 1302199 T3660 oasc.SolrCore.initIndex WARN [collection1] Solr index directory '/usr/home/jenkins/jenkins-slave/workspace/Lucene-Solr-NightlyTests-5.x/solr/build/solr-core/test/J0/temp/solr.cloud.ReplicationFactorTest 8381C26FCFFDE0A1-001/control-001/cores/collection1/data/index' doesn't exist. Creating new index...
   [junit4]   2> 1302199 T3660 oasc.CachingDirectoryFactory.get return new directory for /usr/home/jenkins/jenkins-slave/workspace/Lucene-Solr-NightlyTests-5.x/solr/build/solr-core/test/J0/temp/solr.cloud.ReplicationFactorTest 8381C26FCFFDE0A1-001/control-001/cores/collection1/data/index
   [junit4]   2> 1302200 T3660 oasu.RandomMergePolicy.<init> RandomMergePolicy wrapping class org.apache.lucene.index.TieredMergePolicy: [TieredMergePolicy: maxMergeAtOnce=17, maxMergeAtOnceExplicit=12, maxMergedSegmentMB=15.3505859375, floorSegmentMB=0.5556640625, forceMergeDeletesPctAllowed=27.798622184995335, segmentsPerTier=41.0, maxCFSSegmentSizeMB=8.796093022207999E12, noCFSRatio=0.3455216985199636
   [junit4]   2> 1302200 T3660 oasc.SolrDeletionPolicy.onCommit SolrDeletionPolicy.onCommit: commits: num=1
   [junit4]   2> 		commit{dir=MockDirectoryWrapper(NRTCachingDirectory(RAMDirectory@6cb48dfa lockFactory=org.apache.lucene.store.SingleInstanceLockFactory@41d54fd7; maxCacheMB=0.115234375 maxMergeSizeMB=0.8251953125)),segFN=segments_1,generation=1}
   [junit4]   2> 1302201 T3660 oasc.SolrDeletionPolicy.updateCommits newest commit generation = 1
   [junit4]   2> 1302206 T3660 oasup.UpdateRequestProcessorChain.init creating updateRequestProcessorChain "nodistrib"
   [junit4]   2> 1302206 T3660 oasup.UpdateRequestProcessorChain.init creating updateRequestProcessorChain "dedupe"
   [junit4]   2> 1302206 T3660 oasup.UpdateRequestProcessorChain.init inserting DistributedUpdateProcessorFactory into updateRequestProcessorChain "dedupe"
   [junit4]   2> 1302207 T3660 oasup.UpdateRequestProcessorChain.init creating updateRequestProcessorChain "stored_sig"
   [junit4]   2> 1302207 T3660 oasup.UpdateRequestProcessorChain.init inserting DistributedUpdateProcessorFactory into updateRequestProcessorChain "stored_sig"
   [junit4]   2> 1302207 T3660 oasup.UpdateRequestProcessorChain.init creating updateRequestProcessorChain "distrib-dup-test-chain-explicit"
   [junit4]   2> 1302208 T3660 oasup.UpdateRequestProcessorChain.init creating updateRequestProcessorChain "distrib-dup-test-chain-implicit"
   [junit4]   2> 1302208 T3660 oasup.UpdateRequestProcessorChain.init inserting DistributedUpdateProcessorFactory into updateRequestProcessorChain "distrib-dup-test-chain-implicit"
   [junit4]   2> 1302208 T3660 oasc.SolrCore.loadUpdateProcessorChains no updateRequestProcessorChain defined as default, creating implicit default
   [junit4]   2> 1302237 T3660 oashl.XMLLoader.init xsltCacheLifetimeSeconds=60
   [junit4]   2> 1302240 T3660 oashl.XMLLoader.init xsltCacheLifetimeSeconds=60
   [junit4]   2> 1302242 T3660 oashl.XMLLoader.init xsltCacheLifetimeSeconds=60
   [junit4]   2> 1302245 T3660 oashl.XMLLoader.init xsltCacheLifetimeSeconds=60
   [junit4]   2> 1302249 T3660 oasc.RequestHandlers.initHandlersFromConfig Registered paths: /replication,/admin/plugins,/admin/ping,/update/json/docs,/admin/mbeans,/schema,/update/json,/admin/system,/admin/logging,/update,/admin/threads,/admin/segments,standard,/admin/properties,/admin/luke,/get,/admin/file,/update/csv,/config
   [junit4]   2> 1302252 T3660 oasc.SolrCore.initStatsCache Using default statsCache cache: org.apache.solr.search.stats.LocalStatsCache
   [junit4]   2> 1302254 T3660 oasu.UpdateHandler.<init> Using UpdateLog implementation: org.apache.solr.update.UpdateLog
   [junit4]   2> 1302254 T3660 oasu.UpdateLog.init Initializing UpdateLog: dataDir= defaultSyncLevel=FLUSH numRecordsToKeep=100 maxNumLogsToKeep=10
   [junit4]   2> 1302256 T3660 oasu.CommitTracker.<init> Hard AutoCommit: disabled
   [junit4]   2> 1302256 T3660 oasu.CommitTracker.<init> Soft AutoCommit: disabled
   [junit4]   2> 1302257 T3660 oasu.RandomMergePolicy.<init> RandomMergePolicy wrapping class org.apache.lucene.index.AlcoholicMergePolicy: [AlcoholicMergePolicy: minMergeSize=0, mergeFactor=10, maxMergeSize=1205303418, maxMergeSizeForForcedMerge=9223372036854775807, calibrateSizeByDeletes=true, maxMergeDocs=2147483647, maxCFSSegmentSizeMB=8.796093022207999E12, noCFSRatio=0.1]
   [junit4]   2> 1302258 T3660 oasc.SolrDeletionPolicy.onInit SolrDeletionPolicy.onInit: commits: num=1
   [junit4]   2> 		commit{dir=MockDirectoryWrapper(NRTCachingDirectory(RAMDirectory@6cb48dfa lockFactory=org.apache.lucene.store.SingleInstanceLockFactory@41d54fd7; maxCacheMB=0.115234375 maxMergeSizeMB=0.8251953125)),segFN=segments_1,generation=1}
   [junit4]   2> 1302258 T3660 oasc.SolrDeletionPolicy.updateCommits newest commit generation = 1
   [junit4]   2> 1302259 T3660 oass.SolrIndexSearcher.<init> Opening Searcher@3faaff7b[collection1] main
   [junit4]   2> 1302259 T3660 oascc.ZkStateReader.readConfigName Load collection config from:/collections/control_collection
   [junit4]   2> 1302260 T3660 oascc.ZkStateReader.readConfigName path=/collections/control_collection configName=conf1 specified config exists in ZooKeeper
   [junit4]   2> 1302260 T3660 oasr.ManagedResourceStorage.newStorageIO Setting up ZooKeeper-based storage for the RestManager with znodeBase: /configs/conf1
   [junit4]   2> 1302261 T3660 oasr.ManagedResourceStorage$ZooKeeperStorageIO.configure Configured ZooKeeperStorageIO with znodeBase: /configs/conf1
   [junit4]   2> 1302261 T3660 oasr.RestManager.init Initializing RestManager with initArgs: {}
   [junit4]   2> 1302261 T3660 oasr.ManagedResourceStorage.load Reading _rest_managed.json using ZooKeeperStorageIO:path=/configs/conf1
   [junit4]   2> 1302262 T3660 oasr.ManagedResourceStorage$ZooKeeperStorageIO.openInputStream No data found for znode /configs/conf1/_rest_managed.json
   [junit4]   2> 1302262 T3660 oasr.ManagedResourceStorage.load Loaded null at path _rest_managed.json using ZooKeeperStorageIO:path=/configs/conf1
   [junit4]   2> 1302262 T3660 oasr.RestManager.init Initializing 0 registered ManagedResources
   [junit4]   2> 1302263 T3660 oash.ReplicationHandler.inform Commits will be reserved for  10000
   [junit4]   2> 1302263 T3661 oasc.SolrCore.registerSearcher [collection1] Registered new searcher Searcher@3faaff7b[collection1] main{ExitableDirectoryReader(UninvertingDirectoryReader())}
   [junit4]   2> 1302264 T3660 oasc.CoreContainer.registerCore registering core: collection1
   [junit4]   2> 1302265 T3664 oasc.ZkController.register Register replica - core:collection1 address:http://127.0.0.1:18962/c_/n collection:control_collection shard:shard1
   [junit4]   2> 1302265 T3630 oass.SolrDispatchFilter.init user.dir=/usr/home/jenkins/jenkins-slave/workspace/Lucene-Solr-NightlyTests-5.x/solr/build/solr-core/test/J0
   [junit4]   2> 1302265 T3630 oass.SolrDispatchFilter.init SolrDispatchFilter.init() done
   [junit4]   2> 1302266 T3664 oascc.SolrZkClient.makePath makePath: /collections/control_collection/leader_elect/shard1/election
   [junit4]   2> 1302267 T3630 oascc.SolrZkClient.createZkCredentialsToAddAutomatically Using default ZkCredentialsProvider
   [junit4]   2> 1302267 T3630 oascc.ConnectionManager.waitForConnected Waiting for client to connect to ZooKeeper
   [junit4]   2> 1302269 T3668 oascc.ConnectionManager.process Watcher org.apache.solr.common.cloud.ConnectionManager@3982846c name:ZooKeeperConnection Watcher:127.0.0.1:18957/solr got event WatchedEvent state:SyncConnected type:None path:null path:null type:None
   [junit4]   2> 1302270 T3630 oascc.ConnectionManager.waitForConnected Client is connected to ZooKeeper
   [junit4]   2> 1302270 T3630 oascc.SolrZkClient.createZkACLProvider Using default ZkACLProvider
   [junit4]   2> 1302271 T3630 oascc.ZkStateReader.createClusterStateWatchersAndUpdate Updating cluster state from ZooKeeper... 
   [junit4]   2> 1302271 T3664 oasc.ShardLeaderElectionContext.runLeaderProcess Running the leader process for shard shard1
   [junit4]   2> 1302273 T3656 oasc.DistributedQueue$LatchWatcher.process NodeChildrenChanged fired on path /overseer/queue state SyncConnected
   [junit4]   2> 1302273 T3664 oasc.ShardLeaderElectionContext.waitForReplicasToComeUp Enough replicas found to continue.
   [junit4]   2> 1302273 T3664 oasc.ShardLeaderElectionContext.runLeaderProcess I may be the new leader - try and sync
   [junit4]   2> 1302274 T3657 oasc.Overseer$ClusterStateUpdater.run processMessage: queueSize: 1, message = {
   [junit4]   2> 	  "operation":"leader",
   [junit4]   2> 	  "shard":"shard1",
   [junit4]   2> 	  "collection":"control_collection"} current state version: 1
   [junit4]   2> 1302274 T3630 oasc.ChaosMonkey.monkeyLog monkey: init - expire sessions:false cause connection loss:false
   [junit4]   2> ASYNC  NEW_CORE C515 name=collection1 org.apache.solr.core.SolrCore@3622d65f url=http://127.0.0.1:18962/c_/n/collection1 node=127.0.0.1:18962_c_%2Fn C515_STATE=coll:control_collection core:collection1 props:{node_name=127.0.0.1:18962_c_%2Fn, base_url=http://127.0.0.1:18962/c_/n, core=collection1, state=down}
   [junit4]   2> 1302274 T3664 C515 P18962 oasc.SyncStrategy.sync Sync replicas to http://127.0.0.1:18962/c_/n/collection1/
   [junit4]   2> 1302274 T3630 oasc.AbstractFullDistribZkTestBase.createJettys Creating collection1 with stateFormat=2
   [junit4]   2> 1302275 T3664 C515 P18962 oasc.SyncStrategy.syncReplicas Sync Success - now sync replicas to me
   [junit4]   2> 1302275 T3668 oascc.ZkStateReader$2.process A cluster state change: WatchedEvent state:SyncConnected type:NodeDataChanged path:/clusterstate.json, has occurred - updating... (live nodes size: 1)
   [junit4]   2> 1302275 T3664 C515 P18962 oasc.SyncStrategy.syncToMe http://127.0.0.1:18962/c_/n/collection1/ has no replicas
   [junit4]   2> 1302275 T3656 oascc.ZkStateReader$2.process A cluster state change: WatchedEvent state:SyncConnected type:NodeDataChanged path:/clusterstate.json, has occurred - updating... (live nodes size: 1)
   [junit4]   2> 1302275 T3630 oascc.SolrZkClient.createZkCredentialsToAddAutomatically Using default ZkCredentialsProvider
   [junit4]   2> 1302276 T3664 oasc.ShardLeaderElectionContext.runLeaderProcess I am the new leader: http://127.0.0.1:18962/c_/n/collection1/ shard1
   [junit4]   2> 1302277 T3664 oascc.SolrZkClient.makePath makePath: /collections/control_collection/leaders/shard1
   [junit4]   2> 1302277 T3630 oascc.ConnectionManager.waitForConnected Waiting for client to connect to ZooKeeper
   [junit4]   2> 1302279 T3671 oascc.ConnectionManager.process Watcher org.apache.solr.common.cloud.ConnectionManager@500b8d5c name:ZooKeeperConnection Watcher:127.0.0.1:18957/solr got event WatchedEvent state:SyncConnected type:None path:null path:null type:None
   [junit4]   2> 1302279 T3630 oascc.ConnectionManager.waitForConnected Client is connected to ZooKeeper
   [junit4]   2> 1302280 T3630 oascc.SolrZkClient.createZkACLProvider Using default ZkACLProvider
   [junit4]   2> 1302282 T3656 oasc.DistributedQueue$LatchWatcher.process NodeChildrenChanged fired on path /overseer/queue state SyncConnected
   [junit4]   2> 1302283 T3657 oasc.Overseer$ClusterStateUpdater.run processMessage: queueSize: 2, message = {
   [junit4]   2> 	  "operation":"create",
   [junit4]   2> 	  "name":"collection1",
   [junit4]   2> 	  "numShards":"3",
   [junit4]   2> 	  "stateFormat":"2"} current state version: 2
   [junit4]   2> 1302283 T3657 oasco.ClusterStateMutator.createCollection building a new cName: collection1
   [junit4]   2> 1302286 T3657 oasc.Overseer$ClusterStateUpdater.run processMessage: queueSize: 1, message = {
   [junit4]   2> 	  "operation":"leader",
   [junit4]   2> 	  "shard":"shard1",
   [junit4]   2> 	  "collection":"control_collection",
   [junit4]   2> 	  "base_url":"http://127.0.0.1:18962/c_/n",
   [junit4]   2> 	  "core":"collection1",
   [junit4]   2> 	  "state":"active"} current state version: 2
   [junit4]   2> 1302286 T3657 oasco.ZkStateWriter.writePendingUpdates going to create_collection /collections/collection1/state.json
   [junit4]   2> 1302288 T3656 oascc.ZkStateReader$2.process A cluster state change: WatchedEvent state:SyncConnected type:NodeDataChanged path:/clusterstate.json, has occurred - updating... (live nodes size: 1)
   [junit4]   2> 1302288 T3668 oascc.ZkStateReader$2.process A cluster state change: WatchedEvent state:SyncConnected type:NodeDataChanged path:/clusterstate.json, has occurred - updating... (live nodes size: 1)
   [junit4]   2> 1302290 T3656 oasc.DistributedQueue$LatchWatcher.process NodeChildrenChanged fired on path /overseer/queue state SyncConnected
   [junit4]   2> 1302291 T3668 oascc.ZkStateReader$2.process A cluster state change: WatchedEvent state:SyncConnected type:NodeDataChanged path:/clusterstate.json, has occurred - updating... (live nodes size: 1)
   [junit4]   2> 1302291 T3656 oascc.ZkStateReader$2.process A cluster state change: WatchedEvent state:SyncConnected type:NodeDataChanged path:/clusterstate.json, has occurred - updating... (live nodes size: 1)
   [junit4]   2> 1302333 T3664 oasc.ZkController.register We are http://127.0.0.1:18962/c_/n/collection1/ and leader is http://127.0.0.1:18962/c_/n/collection1/
   [junit4]   2> 1302334 T3664 oasc.ZkController.register No LogReplay needed for core=collection1 baseURL=http://127.0.0.1:18962/c_/n
   [junit4]   2> 1302334 T3664 oasc.ZkController.checkRecovery I am the leader, no recovery necessary
   [junit4]   2> 1302334 T3664 oasc.ZkController.publish publishing core=collection1 state=active collection=control_collection
   [junit4]   2> 1302334 T3664 oasc.ZkController.publish numShards not found on descriptor - reading it from system property
   [junit4]   2> 1302336 T3656 oasc.DistributedQueue$LatchWatcher.process NodeChildrenChanged fired on path /overseer/queue state SyncConnected
   [junit4]   2> 1302337 T3657 oasc.Overseer$ClusterStateUpdater.run processMessage: queueSize: 1, message = {
   [junit4]   2> 	  "roles":null,
   [junit4]   2> 	  "node_name":"127.0.0.1:18962_c_%2Fn",
   [junit4]   2> 	  "collection":"control_collection",
   [junit4]   2> 	  "numShards":"3",
   [junit4]   2> 	  "shard":"shard1",
   [junit4]   2> 	  "base_url":"http://127.0.0.1:18962/c_/n",
   [junit4]   2> 	  "core":"collection1",
   [junit4]   2> 	  "operation":"state",
   [junit4]   2> 	  "state":"active",
   [junit4]   2> 	  "core_node_name":"core_node1"} current state version: 4
   [junit4]   2> 1302337 T3657 oasco.ReplicaMutator.updateState Update state numShards=3 message={
   [junit4]   2> 	  "roles":null,
   [junit4]   2> 	  "node_name":"127.0.0.1:18962_c_%2Fn",
   [junit4]   2> 	  "collection":"control_collection",
   [junit4]   2> 	  "numShards":"3",
   [junit4]   2> 	  "shard":"shard1",
   [junit4]   2> 	  "base_url":"http://127.0.0.1:18962/c_/n",
   [junit4]   2> 	  "core":"collection1",
   [junit4]   2> 	  "operation":"state",
   [junit4]   2> 	  "state":"active",
   [junit4]   2> 	  "core_node_name":"core_node1"}
   [junit4]   2> 1302441 T3656 oascc.ZkStateReader$2.process A cluster state change: WatchedEvent state:SyncConnected type:NodeDataChanged path:/clusterstate.json, has occurred - updating... (live nodes size: 1)
   [junit4]   2> 1302441 T3668 oascc.ZkStateReader$2.process A cluster state change: WatchedEvent state:SyncConnected type:NodeDataChanged path:/clusterstate.json, has occurred - updating... (live nodes size: 1)
   [junit4]   2> 1304032 T3630 oas.SolrTestCaseJ4.writeCoreProperties Writing core.properties file to /usr/home/jenkins/jenkins-slave/workspace/Lucene-Solr-NightlyTests-5.x/solr/build/solr-core/test/J0/temp/solr.cloud.ReplicationFactorTest 8381C26FCFFDE0A1-001/shard-1-001/cores/collection1
   [junit4]   2> 1304035 T3630 oasc.AbstractFullDistribZkTestBase.createJettys create jetty 1 in directory /usr/home/jenkins/jenkins-slave/workspace/Lucene-Solr-NightlyTests-5.x/solr/build/solr-core/test/J0/temp/solr.cloud.ReplicationFactorTest 8381C26FCFFDE0A1-001/shard-1-001
   [junit4]   2> 1304036 T3630 oejs.Server.doStart jetty-8.1.10.v20130312
   [junit4]   2> 1304039 T3630 oejs.AbstractConnector.doStart Started SocketConnector@127.0.0.1:18972
   [junit4]   2> 1304039 T3630 oascse.JettySolrRunner$1.lifeCycleStarted Jetty properties: {coreRootDirectory=/usr/home/jenkins/jenkins-slave/workspace/Lucene-Solr-NightlyTests-5.x/solr/build/solr-core/test/J0/temp/solr.cloud.ReplicationFactorTest 8381C26FCFFDE0A1-001/shard-1-001/cores, hostContext=/c_/n, solr.data.dir=/usr/home/jenkins/jenkins-slave/workspace/Lucene-Solr-NightlyTests-5.x/solr/build/solr-core/test/J0/temp/solr.cloud.ReplicationFactorTest 8381C26FCFFDE0A1-001/tempDir-001/jetty1, hostPort=18971, solrconfig=solrconfig.xml}
   [junit4]   2> 1304040 T3630 oass.SolrDispatchFilter.init SolrDispatchFilter.init()sun.misc.Launcher$AppClassLoader@231bf785
   [junit4]   2> 1304040 T3630 oasc.SolrResourceLoader.<init> new SolrResourceLoader for directory: '/usr/home/jenkins/jenkins-slave/workspace/Lucene-Solr-NightlyTests-5.x/solr/build/solr-core/test/J0/temp/solr.cloud.ReplicationFactorTest 8381C26FCFFDE0A1-001/shard-1-001/'
   [junit4]   2> 1304087 T3630 oasc.SolrXmlConfig.fromFile Loading container configuration from /usr/home/jenkins/jenkins-slave/workspace/Lucene-Solr-NightlyTests-5.x/solr/build/solr-core/test/J0/temp/solr.cloud.ReplicationFactorTest 8381C26FCFFDE0A1-001/shard-1-001/solr.xml
   [junit4]   2> 1304141 T3630 oasc.CorePropertiesLocator.<init> Config-defined core root directory: /usr/home/jenkins/jenkins-slave/workspace/Lucene-Solr-NightlyTests-5.x/solr/build/solr-core/test/J0/temp/solr.cloud.ReplicationFactorTest 8381C26FCFFDE0A1-001/shard-1-001/cores
   [junit4]   2> 1304142 T3630 oasc.CoreContainer.<init> New CoreContainer 527992003
   [junit4]   2> 1304142 T3630 oasc.CoreContainer.load Loading cores into CoreContainer [instanceDir=/usr/home/jenkins/jenkins-slave/workspace/Lucene-Solr-NightlyTests-5.x/solr/build/solr-core/test/J0/temp/solr.cloud.ReplicationFactorTest 8381C26FCFFDE0A1-001/shard-1-001/]
   [junit4]   2> 1304143 T3630 oasc.CoreContainer.load loading shared library: /usr/home/jenkins/jenkins-slave/workspace/Lucene-Solr-NightlyTests-5.x/solr/build/solr-core/test/J0/temp/solr.cloud.ReplicationFactorTest 8381C26FCFFDE0A1-001/shard-1-001/lib
   [junit4]   2> 1304143 T3630 oasc.SolrResourceLoader.addToClassLoader WARN Can't find (or read) directory to add to classloader: lib (resolved as: /usr/home/jenkins/jenkins-slave/workspace/Lucene-Solr-NightlyTests-5.x/solr/build/solr-core/test/J0/temp/solr.cloud.ReplicationFactorTest 8381C26FCFFDE0A1-001/shard-1-001/lib).
   [junit4]   2> 1304157 T3630 oashc.HttpShardHandlerFactory.getParameter Setting socketTimeout to: 90000
   [junit4]   2> 1304157 T3630 oashc.HttpShardHandlerFactory.getParameter Setting urlScheme to: 
   [junit4]   2> 1304157 T3630 oashc.HttpShardHandlerFactory.getParameter Setting connTimeout to: 15000
   [junit4]   2> 1304158 T3630 oashc.HttpShardHandlerFactory.getParameter Setting maxConnectionsPerHost to: 20
   [junit4]   2> 1304158 T3630 oashc.HttpShardHandlerFactory.getParameter Setting maxConnections to: 10000
   [junit4]   2> 1304158 T3630 oashc.HttpShardHandlerFactory.getParameter Setting corePoolSize to: 0
   [junit4]   2> 1304159 T3630 oashc.HttpShardHandlerFactory.getParameter Setting maximumPoolSize to: 2147483647
   [junit4]   2> 1304159 T3630 oashc.HttpShardHandlerFactory.getParameter Setting maxThreadIdleTime to: 5
   [junit4]   2> 1304159 T3630 oashc.HttpShardHandlerFactory.getParameter Setting sizeOfQueue to: -1
   [junit4]   2> 1304160 T3630 oashc.HttpShardHandlerFactory.getParameter Setting fairnessPolicy to: false
   [junit4]   2> 1304160 T3630 oashc.HttpShardHandlerFactory.getParameter Setting useRetries to: false
   [junit4]   2> 1304160 T3630 oasu.UpdateShardHandler.<init> Creating UpdateShardHandler HTTP client with params: socketTimeout=340000&connTimeout=45000&retry=true
   [junit4]   2> 1304161 T3630 oasl.LogWatcher.createWatcher SLF4J impl is org.slf4j.impl.Log4jLoggerFactory
   [junit4]   2> 1304161 T3630 oasl.LogWatcher.newRegisteredLogWatcher Registering Log Listener [Log4j (org.slf4j.impl.Log4jLoggerFactory)]
   [junit4]   2> 1304162 T3630 oasc.CoreContainer.load Node Name: 127.0.0.1
   [junit4]   2> 1304162 T3630 oasc.ZkContainer.initZooKeeper Zookeeper client=127.0.0.1:18957/solr
   [junit4]   2> 1304162 T3630 oasc.ZkController.checkChrootPath zkHost includes chroot
   [junit4]   2> 1304163 T3630 oascc.SolrZkClient.createZkCredentialsToAddAutomatically Using default ZkCredentialsProvider
   [junit4]   2> 1304163 T3630 oascc.ConnectionManager.waitForConnected Waiting for client to connect to ZooKeeper
   [junit4]   2> 1304165 T3683 oascc.ConnectionManager.process Watcher org.apache.solr.common.cloud.ConnectionManager@76c4f53f name:ZooKeeperConnection Watcher:127.0.0.1:18957 got event WatchedEvent state:SyncConnected type:None path:null path:null type:None
   [junit4]   2> 1304166 T3630 oascc.ConnectionManager.waitForConnected Client is connected to ZooKeeper
   [junit4]   2> 1304167 T3630 oascc.SolrZkClient.createZkACLProvider Using default ZkACLProvider
   [junit4]   2> 1304169 T3630 oascc.ConnectionManager.waitForConnected Waiting for client to connect to ZooKeeper
   [junit4]   2> 1304170 T3686 oascc.ConnectionManager.process Watcher org.apache.solr.common.cloud.ConnectionManager@4e5c907d name:ZooKeeperConnection Watcher:127.0.0.1:18957/solr got event WatchedEvent state:SyncConnected type:None path:null path:null type:None
   [junit4]   2> 1304170 T3630 oascc.ConnectionManager.waitForConnected Client is connected to ZooKeeper
   [junit4]   2> 1304175 T3630 oascc.ZkStateReader.createClusterStateWatchersAndUpdate Updating cluster state from ZooKeeper... 
   [junit4]   2> 1305180 T3630 oasc.ZkController.createEphemeralLiveNode Register node as live in ZooKeeper:/live_nodes/127.0.0.1:18971_c_%2Fn
   [junit4]   2> 1305181 T3630 oascc.SolrZkClient.makePath makePath: /live_nodes/127.0.0.1:18971_c_%2Fn
   [junit4]   2> 1305184 T3630 oasc.Overseer.close Overseer (id=null) closing
   [junit4]   2> 1305186 T3630 oasc.CorePropertiesLocator.discover Looking for core definitions underneath /usr/home/jenkins/jenkins-slave/workspace/Lucene-Solr-NightlyTests-5.x/solr/build/solr-core/test/J0/temp/solr.cloud.ReplicationFactorTest 8381C26FCFFDE0A1-001/shard-1-001/cores
   [junit4]   1> CORE DESCRIPTOR: {collection=collection1, name=collection1, absoluteInstDir=/usr/home/jenkins/jenkins-slave/workspace/Lucene-Solr-NightlyTests-5.x/solr/build/solr-core/test/J0/temp/solr.cloud.ReplicationFactorTest 8381C26FCFFDE0A1-001/shard-1-001/cores/collection1/, dataDir=data/, schema=schema.xml, transient=false, coreNodeName=, loadOnStartup=true, config=solrconfig.xml, shard=, instanceDir=/usr/home/jenkins/jenkins-slave/workspace/Lucene-Solr-NightlyTests-5.x/solr/build/solr-core/test/J0/temp/solr.cloud.ReplicationFactorTest 8381C26FCFFDE0A1-001/shard-1-001/cores/collection1}
   [junit4]   2> 1305188 T3630 oasc.CorePropertiesLocator.discoverUnder Found core collection1 in /usr/home/jenkins/jenkins-slave/workspace/Lucene-Solr-NightlyTests-5.x/solr/build/solr-core/test/J0/temp/solr.cloud.ReplicationFactorTest 8381C26FCFFDE0A1-001/shard-1-001/cores/collection1/
   [junit4]   2> 1305188 T3630 oasc.CorePropertiesLocator.discover Found 1 core definitions
   [junit4]   2> 1305190 T3687 oasc.ZkController.publish publishing core=collection1 state=down collection=collection1
   [junit4]   2> 1305190 T3687 oasc.ZkController.publish numShards not found on descriptor - reading it from system property
   [junit4]   2> 1305191 T3656 oasc.DistributedQueue$LatchWatcher.process NodeChildrenChanged fired on path /overseer/queue state SyncConnected
   [junit4]   2> 1305192 T3687 oasc.ZkController.preRegister Registering watch for external collection collection1
   [junit4]   2> 1305192 T3657 oasc.Overseer$ClusterStateUpdater.run processMessage: queueSize: 1, message = {
   [junit4]   2> 	  "roles":null,
   [junit4]   2> 	  "node_name":"127.0.0.1:18971_c_%2Fn",
   [junit4]   2> 	  "collection":"collection1",
   [junit4]   2> 	  "numShards":"3",
   [junit4]   2> 	  "shard":null,
   [junit4]   2> 	  "base_url":"http://127.0.0.1:18971/c_/n",
   [junit4]   2> 	  "core":"collection1",
   [junit4]   2> 	  "operation":"state",
   [junit4]   2> 	  "state":"down"} current state version: 5
   [junit4]   2> 1305192 T3687 oascc.ZkStateReader.addZkWatch addZkWatch collection1
   [junit4]   2> 1305193 T3657 oasco.ReplicaMutator.updateState Update state numShards=3 message={
   [junit4]   2> 	  "roles":null,
   [junit4]   2> 	  "node_name":"127.0.0.1:18971_c_%2Fn",
   [junit4]   2> 	  "collection":"collection1",
   [junit4]   2> 	  "numShards":"3",
   [junit4]   2> 	  "shard":null,
   [junit4]   2> 	  "base_url":"http://127.0.0.1:18971/c_/n",
   [junit4]   2> 	  "core":"collection1",
   [junit4]   2> 	  "operation":"state",
   [junit4]   2> 	  "state":"down"}
   [junit4]   2> 1305193 T3687 oascc.ZkStateReader.addZkWatch Updating collection state at /collections/collection1/state.json from ZooKeeper... 
   [junit4]   2> 1305193 T3657 oasco.ReplicaMutator.updateState Collection already exists with numShards=3
   [junit4]   2> 1305193 T3657 oasco.ReplicaMutator.updateState Assigning new node to shard shard=shard3
   [junit4]   2> 1305194 T3687 oascc.ZkStateReader.updateWatchedCollection Updating data for collection1 to ver 0 
   [junit4]   2> 1305194 T3687 oasc.ZkController.waitForCoreNodeName look for our core node name
   [junit4]   2> 1305194 T3657 oasco.ZkStateWriter.writePendingUpdates going to update_collection /collections/collection1/state.json version: 0
   [junit4]   2> 1305195 T3686 oascc.ZkStateReader$7.process A cluster state change: WatchedEvent state:SyncConnected type:NodeDataChanged path:/collections/collection1/state.json for collection collection1 has occurred - updating... (live nodes size: 2)
   [junit4]   2> 1305195 T3686 oascc.ZkStateReader.updateWatchedCollection Updating data for collection1 to ver 1 
   [junit4]   2> 1306194 T3687 oasc.ZkController.waitForShardId waiting to find shard id in clusterstate for collection1
   [junit4]   2> 1306195 T3687 oasc.ZkController.createCollectionZkNode Check for collection zkNode:collection1
   [junit4]   2> 1306196 T3687 oasc.ZkController.createCollectionZkNode Collection zkNode exists
   [junit4]   2> 1306196 T3687 oascc.ZkStateReader.readConfigName Load collection config from:/collections/collection1
   [junit4]   2> 1306197 T3687 oascc.ZkStateReader.readConfigName path=/collections/collection1 configName=conf1 specified config exists in ZooKeeper
   [junit4]   2> 1306197 T3687 oasc.SolrResourceLoader.<init> new SolrResourceLoader for directory: '/usr/home/jenkins/jenkins-slave/workspace/Lucene-Solr-NightlyTests-5.x/solr/build/solr-core/test/J0/temp/solr.cloud.ReplicationFactorTest 8381C26FCFFDE0A1-001/shard-1-001/cores/collection1/'
   [junit4]   2> 1306216 T3687 oasc.ZkController.watchZKConfDir watch zkdir /configs/conf1
   [junit4]   2> 1306218 T3687 oasc.Config.<init> loaded config solrconfig.xml with version 0 
   [junit4]   2> 1306230 T3687 oasc.SolrConfig.refreshRequestParams current version of requestparams : -1
   [junit4]   2> 1306256 T3687 oasc.SolrConfig.<init> Using Lucene MatchVersion: 5.1.0
   [junit4]   2> 1306312 T3687 oasc.SolrConfig.<init> Loaded SolrConfig: solrconfig.xml
   [junit4]   2> 1306414 T3687 oass.IndexSchema.readSchema Reading Solr Schema from /configs/conf1/schema.xml
   [junit4]   2> 1306426 T3687 oass.IndexSchema.readSchema [collection1] Schema name=test
   [junit4]   2> 1306858 T3687 oass.OpenExchangeRatesOrgProvider.init Initialized with rates=open-exchange-rates.json, refreshInterval=1440.
   [junit4]   2> 1306877 T3687 oass.IndexSchema.readSchema default search field in schema is text
   [junit4]   2> 1306880 T3687 oass.IndexSchema.readSchema unique key field: id
   [junit4]   2> 1306892 T3687 oass.FileExchangeRateProvider.reload Reloading exchange rates from file currency.xml
   [junit4]   2> 1306897 T3687 oass.FileExchangeRateProvider.reload Reloading exchange rates from file currency.xml
   [junit4]   2> 1306902 T3687 oass.OpenExchangeRatesOrgProvider.reload Reloading exchange rates from open-exchange-rates.json
   [junit4]   2> 1306903 T3687 oass.OpenExchangeRatesOrgProvider$OpenExchangeRates.<init> WARN Unknown key IMPORTANT NOTE
   [junit4]   2> 1306903 T3687 oass.OpenExchangeRatesOrgProvider$OpenExchangeRates.<init> WARN Expected key, got STRING
   [junit4]   2> 1306903 T3687 oass.OpenExchangeRatesOrgProvider.reload Reloading exchange rates from open-exchange-rates.json
   [junit4]   2> 1306904 T3687 oass.OpenExchangeRatesOrgProvider$OpenExchangeRates.<init> WARN Unknown key IMPORTANT NOTE
   [junit4]   2> 1306904 T3687 oass.OpenExchangeRatesOrgProvider$OpenExchangeRates.<init> WARN Expected key, got STRING
   [junit4]   2> 1306905 T3687 oasc.CoreContainer.create Creating SolrCore 'collection1' using configuration from collection collection1
   [junit4]   2> 1306905 T3687 oasc.SolrCore.initDirectoryFactory org.apache.solr.core.MockDirectoryFactory
   [junit4]   2> 1306905 T3687 oasc.SolrCore.<init> [collection1] Opening new SolrCore at /usr/home/jenkins/jenkins-slave/workspace/Lucene-Solr-NightlyTests-5.x/solr/build/solr-core/test/J0/temp/solr.cloud.ReplicationFactorTest 8381C26FCFFDE0A1-001/shard-1-001/cores/collection1/, dataDir=/usr/home/jenkins/jenkins-slave/workspace/Lucene-Solr-NightlyTests-5.x/solr/build/solr-core/test/J0/temp/solr.cloud.ReplicationFactorTest 8381C26FCFFDE0A1-001/shard-1-001/cores/collection1/data/
   [junit4]   2> 1306906 T3687 oasc.JmxMonitoredMap.<init> JMX monitoring is enabled. Adding Solr mbeans to JMX Server: com.sun.jmx.mbeanserver.JmxMBeanServer@7280b7aa
   [junit4]   2> 1306908 T3687 oasc.CachingDirectoryFactory.get return new directory for /usr/home/jenkins/jenkins-slave/workspace/Lucene-Solr-NightlyTests-5.x/solr/build/solr-core/test/J0/temp/solr.cloud.ReplicationFactorTest 8381C26FCFFDE0A1-001/shard-1-001/cores/collection1/data
   [junit4]   2> 1306908 T3687 oasc.SolrCore.getNewIndexDir New index directory detected: old=null new=/usr/home/jenkins/jenkins-slave/workspace/Lucene-Solr-NightlyTests-5.x/solr/build/solr-core/test/J0/temp/solr.cloud.ReplicationFactorTest 8381C26FCFFDE0A1-001/shard-1-001/cores/collection1/data/index/
   [junit4]   2> 1306909 T3687 oasc.SolrCore.initIndex WARN [collection1] Solr index directory '/usr/home/jenkins/jenkins-slave/workspace/Lucene-Solr-NightlyTests-5.x/solr/build/solr-core/test/J0/temp/solr.cloud.ReplicationFactorTest 8381C26FCFFDE0A1-001/shard-1-001/cores/collection1/data/index' doesn't exist. Creating new index...
   [junit4]   2> 1306909 T3687 oasc.CachingDirectoryFactory.get return new directory for /usr/home/jenkins/jenkins-slave/workspace/Lucene-Solr-NightlyTests-5.x/solr/build/solr-core/test/J0/temp/solr.cloud.ReplicationFactorTest 8381C26FCFFDE0A1-001/shard-1-001/cores/collection1/data/index
   [junit4]   2> 1306909 T3687 oasu.RandomMergePolicy.<init> RandomMergePolicy wrapping class org.apache.lucene.index.TieredMergePolicy: [TieredMergePolicy: maxMergeAtOnce=17, maxMergeAtOnceExplicit=12, maxMergedSegmentMB=15.3505859375, floorSegmentMB=0.5556640625, forceMergeDeletesPctAllowed=27.798622184995335, segmentsPerTier=41.0, maxCFSSegmentSizeMB=8.796093022207999E12, noCFSRatio=0.3455216985199636
   [junit4]   2> 1306910 T3687 oasc.SolrDeletionPolicy.onCommit SolrDeletionPolicy.onCommit: commits: num=1
   [junit4]   2> 		commit{dir=MockDirectoryWrapper(NRTCachingDirectory(RAMDirectory@106f5f59 lockFactory=org.apache.lucene.store.SingleInstanceLockFactory@7fdcd47c; maxCacheMB=0.115234375 maxMergeSizeMB=0.8251953125)),segFN=segments_1,generation=1}
   [junit4]   2> 1306911 T3687 oasc.SolrDeletionPolicy.updateCommits newest commit generation = 1
   [junit4]   2> 1306917 T3687 oasup.UpdateRequestProcessorChain.init creating updateRequestProcessorChain "nodistrib"
   [junit4]   2> 1306917 T3687 oasup.UpdateRequestProcessorChain.init creating updateRequestProcessorChain "dedupe"
   [junit4]   2> 1306918 T3687 oasup.UpdateRequestProcessorChain.init inserting DistributedUpdateProcessorFactory into updateRequestProcessorChain "dedupe"
   [junit4]   2> 1306918 T3687 oasup.UpdateRequestProcessorChain.init creating updateRequestProcessorChain "stored_sig"
   [junit4]   2> 1306918 T3687 oasup.UpdateRequestProcessorChain.init inserting DistributedUpdateProcessorFactory into updateRequestProcessorChain "stored_sig"
   [junit4]   2> 1306918 T3687 oasup.UpdateRequestProcessorChain.init creating updateRequestProcessorChain "distrib-dup-test-chain-explicit"
   [junit4]   2> 1306919 T3687 oasup.UpdateRequestProcessorChain.init creating updateRequestProcessorChain "distrib-dup-test-chain-implicit"
   [junit4]   2> 1306919 T3687 oasup.UpdateRequestProcessorChain.init inserting DistributedUpdateProcessorFactory into updateRequestProcessorChain "distrib-dup-test-chain-implicit"
   [junit4]   2> 1306920 T3687 oasc.SolrCore.loadUpdateProcessorChains no updateRequestProcessorChain defined as default, creating implicit default
   [junit4]   2> 1306942 T3687 oashl.XMLLoader.init xsltCacheLifetimeSeconds=60
   [junit4]   2> 1306945 T3687 oashl.XMLLoader.init xsltCacheLifetimeSeconds=60
   [junit4]   2> 1306948 T3687 oashl.XMLLoader.init xsltCacheLifetimeSeconds=60
   [junit4]   2> 1306950 T3687 oashl.XMLLoader.init xsltCacheLifetimeSeconds=60
   [junit4]   2> 1306958 T3687 oasc.RequestHandlers.initHandlersFromConfig Registered paths: /replication,/admin/plugins,/admin/ping,/update/json/docs,/admin/mbeans,/schema,/update/json,/admin/system,/admin/logging,/update,/admin/threads,/admin/segments,standard,/admin/properties,/admin/luke,/get,/admin/file,/update/csv,/config
   [junit4]   2> 1306960 T3687 oasc.SolrCore.initStatsCache Using default statsCache cache: org.apache.solr.search.stats.LocalStatsCache
   [junit4]   2> 1306962 T3687 oasu.UpdateHandler.<init> Using UpdateLog implementation: org.apache.solr.update.UpdateLog
   [junit4]   2> 1306963 T3687 oasu.UpdateLog.init Initializing UpdateLog: dataDir= defaultSyncLevel=FLUSH numRecordsToKeep=100 maxNumLogsToKeep=10
   [junit4]   2> 1306964 T3687 oasu.CommitTracker.<init> Hard AutoCommit: disabled
   [junit4]   2> 1306964 T3687 oasu.CommitTracker.<init> Soft AutoCommit: disabled
   [junit4]   2> 1306966 T3687 oasu.RandomMergePolicy.<init> RandomMergePolicy wrapping class org.apache.lucene.index.AlcoholicMergePolicy: [AlcoholicMergePolicy: minMergeSize=0, mergeFactor=10, maxMergeSize=1205303418, maxMergeSizeForForcedMerge=9223372036854775807, calibrateSizeByDeletes=true, maxMergeDocs=2147483647, maxCFSSegmentSizeMB=8.796093022207999E12, noCFSRatio=0.1]
   [junit4]   2> 1306967 T3687 oasc.SolrDeletionPolicy.onInit SolrDeletionPolicy.onInit: commits: num=1
   [junit4]   2> 		commit{dir=MockDirectoryWrapper(NRTCachingDirectory(RAMDirectory@106f5f59 lockFactory=org.apache.lucene.store.SingleInstanceLockFactory@7fdcd47c; maxCacheMB=0.115234375 maxMergeSizeMB=0.8251953125)),segFN=segments_1,generation=1}
   [junit4]   2> 1306967 T3687 oasc.SolrDeletionPolicy.updateCommits newest commit generation = 1
   [junit4]   2> 1306968 T3687 oass.SolrIndexSearcher.<init> Opening Searcher@6d474c3e[collection1] main
   [junit4]   2> 1306968 T3687 oascc.ZkStateReader.readConfigName Load collection config from:/collections/collection1
   [junit4]   2> 1306969 T3687 oascc.ZkStateReader.readConfigName path=/collections/collection1 configName=conf1 specified config exists in ZooKeeper
   [junit4]   2> 1306969 T3687 oasr.ManagedResourceStorage.newStorageIO Setting up ZooKeeper-based storage for the RestManager with znodeBase: /configs/conf1
   [junit4]   2> 1306970 T3687 oasr.ManagedResourceStorage$ZooKeeperStorageIO.configure Configured ZooKeeperStorageIO with znodeBase: /configs/conf1
   [junit4]   2> 1306970 T3687 oasr.RestManager.init Initializing RestManager with initArgs: {}
   [junit4]   2> 1306970 T3687 oasr.ManagedResourceStorage.load Reading _rest_managed.json using ZooKeeperStorageIO:path=/configs/conf1
   [junit4]   2> 1306971 T3687 oasr.ManagedResourceStorage$ZooKeeperStorageIO.openInputStream No data found for znode /configs/conf1/_rest_managed.json
   [junit4]   2> 1306971 T3687 oasr.ManagedResourceStorage.load Loaded null at path _rest_managed.json using ZooKeeperStorageIO:path=/configs/conf1
   [junit4]   2> 1306972 T3687 oasr.RestManager.init Initializing 0 registered ManagedResources
   [junit4]   2> 1306972 T3687 oash.ReplicationHandler.inform Commits will be reserved for  10000
   [junit4]   2> 1306973 T3688 oasc.SolrCore.registerSearcher [collection1] Registered new searcher Searcher@6d474c3e[collection1] main{ExitableDirectoryReader(UninvertingDirectoryReader())}
   [junit4]   2> 1306973 T3687 oasc.CoreContainer.registerCore registering core: collection1
   [junit4]   2> 1306974 T3691 oasc.ZkController.register Register replica - core:collection1 address:http://127.0.0.1:18971/c_/n collection:collection1 shard:shard3
   [junit4]   2> 1306974 T3630 oass.SolrDispatchFilter.init user.dir=/usr/home/jenkins/jenkins-slave/workspace/Lucene-Solr-NightlyTests-5.x/solr/build/solr-core/test/J0
   [junit4]   2> 1306975 T3630 oass.SolrDispatchFilter.init SolrDispatchFilter.init() done
   [junit4]   2> 1306975 T3691 oascc.SolrZkClient.makePath makePath: /collections/collection1/leader_elect/shard3/election
   [junit4]   2> 1306980 T3691 oasc.ShardLeaderElectionContext.runLeaderProcess Running the leader process for shard shard3
   [junit4]   2> 1306982 T3656 oasc.DistributedQueue$LatchWatcher.process NodeChildrenChanged fired on path /overseer/queue state SyncConnected
   [junit4]   2> 1306982 T3691 oasc.ShardLeaderElectionContext.waitForReplicasToComeUp Enough replicas found to continue.
   [junit4]   2> 1306982 T3691 oasc.ShardLeaderElectionContext.runLeaderProcess I may be the new leader - try and sync
   [junit4]   2> ASYNC  NEW_CORE C516 name=collection1 org.apache.solr.core.SolrCore@56bd288a url=http://127.0.0.1:18971/c_/n/collection1 node=127.0.0.1:18971_c_%2Fn C516_STATE=coll:collection1 core:collection1 props:{node_name=127.0.0.1:18971_c_%2Fn, base_url=http://127.0.0.1:18971/c_/n, core=collection1, state=down}
   [junit4]   2> 1306982 T3691 C516 P18971 oasc.SyncStrategy.sync Sync replicas to http://127.0.0.1:18971/c_/n/collection1/
   [junit4]   2> 1306983 T3657 oasc.Overseer$ClusterStateUpdater.run processMessage: queueSize: 1, message = {
   [junit4]   2> 	  "operation":"leader",
   [junit4]   2> 	  "shard":"shard3",
   [junit4]   2> 	  "collection":"collection1"} current state version: 5
   [junit4]   2> 1306983 T3691 C516 P18971 oasc.SyncStrategy.syncReplicas Sync Success - now sync replicas to me
   [junit4]   2> 1306983 T3691 C516 P18971 oasc.SyncStrategy.syncToMe http://127.0.0.1:18971/c_/n/collection1/ has no replicas
   [junit4]   2> 1306983 T3691 oasc.ShardLeaderElectionContext.runLeaderProcess I am the new leader: http://127.0.0.1:18971/c_/n/collection1/ shard3
   [junit4]   2> 1306984 T3691 oascc.SolrZkClient.makePath makePath: /collections/collection1/leaders/shard3
   [junit4]   2> 1306984 T3657 oasco.ZkStateWriter.writePendingUpdates going to update_collection /collections/collection1/state.json version: 1
   [junit4]   2> 1306985 T3686 oascc.ZkStateReader$7.process A cluster state change: WatchedEvent state:SyncConnected type:NodeDataChanged path:/collections/collection1/state.json for collection collection1 has occurred - updating... (live nodes size: 2)
   [junit4]   2> 1306986 T3686 oascc.ZkStateReader.updateWatchedCollection Updating data for collection1 to ver 2 
   [junit4]   2> 1306988 T3657 oasc.Overseer$ClusterStateUpdater.run processMessage: queueSize: 1, message = {
   [junit4]   2> 	  "operation":"leader",
   [junit4]   2> 	  "shard":"shard3",
   [junit4]   2> 	  "collection":"collection1",
   [junit4]   2> 	  "base_url":"http://127.0.0.1:18971/c_/n",
   [junit4]   2> 	  "core":"collection1",
   [junit4]   2> 	  "state":"active"} current state version: 5
   [junit4]   2> 1306989 T3657 oasco.ZkStateWriter.writePendingUpdates going to update_collection /collections/collection1/state.json version: 2
   [junit4]   2> 1306990 T3686 oascc.ZkStateReader$7.process A cluster state change: WatchedEvent state:SyncConnected type:NodeDataChanged path:/collections/collection1/state.json for collection collection1 has occurred - updating... (live nodes size: 2)
   [junit4]   2> 1306991 T3686 oascc.ZkStateReader.updateWatchedCollection Updating data for collection1 to ver 3 
   [junit4]   2> 1306992 T3656 oasc.DistributedQueue$LatchWatcher.process NodeChildrenChanged fired on path /overseer/queue state SyncConnected
   [junit4]   2> 1307040 T3691 oasc.ZkController.register We are http://127.0.0.1:18971/c_/n/collection1/ and leader is http://127.0.0.1:18971/c_/n/collection1/
   [junit4]   2> 1307040 T3691 oasc.ZkController.register No LogReplay needed for core=collection1 baseURL=http://127.0.0.1:18971/c_/n
   [junit4]   2> 1307040 T3691 oasc.ZkController.checkRecovery I am the leader, no recovery necessary
   [junit4]   2> 1307040 T3691 oasc.ZkController.publish publishing core=collection1 state=active collection=collection1
   [junit4]   2> 1307040 T3691 oasc.ZkController.publish numShards not found on descriptor - reading it from system property
   [junit4]   2> 1307042 T3656 oasc.DistributedQueue$LatchWatcher.process NodeChildrenChanged fired on path /overseer/queue state SyncConnected
   [junit4]   2> 1307043 T3657 oasc.Overseer$ClusterStateUpdater.run processMessage: queueSize: 1, message = {
   [junit4]   2> 	  "roles":null,
   [junit4]   2> 	  "node_name":"127.0.0.1:18971_c_%2Fn",
   [junit4]   2> 	  "collection":"collection1",
   [junit4]   2> 	  "numShards":"3",
   [junit4]   2> 	  "shard":"shard3",
   [junit4]   2> 	  "base_url":"http://127.0.0.1:18971/c_/n",
   [junit4]   2> 	  "core":"collection1",
   [junit4]   2> 	  "operation":"state",
   [junit4]   2> 	  "state":"active",
   [junit4]   2> 	  "core_node_name":"core_node1"} current state version: 5
   [junit4]   2> 1307043 T3657 oasco.ReplicaMutator.updateState Update state numShards=3 message={
   [junit4]   2> 	  "roles":null,
   [junit4]   2> 	  "node_name":"127.0.0.1:18971_c_%2Fn",
   [junit4]   2> 	  "collection":"collection1",
   [junit4]   2> 	  "numShards":"3",
   [junit4]   2> 	  "shard":"shard3",
   [junit4]   2> 	  "base_url":"http://127.0.0.1:18971/c_/n",
   [junit4]   2> 	  "core":"collection1",
   [junit4]   2> 	  "operation":"state",
   [junit4]   2> 	  "state":"active",
   [junit4]   2> 	  "core_node_name":"core_node1"}
   [junit4]   2> 1307045 T3657 oasco.ZkStateWriter.writePendingUpdates going to update_collection /collections/collection1/state.json version: 3
   [junit4]   2> 1307045 T3691 oascc.ZkStateReader.updateWatchedCollection Updating data for collection1 to ver 3 
   [junit4]   2> 1307045 T3686 oascc.ZkStateReader$7.process A cluster state change: WatchedEvent state:SyncConnected type:NodeDataChanged path:/collections/collection1/state.json for collection collection1 has occurred - updating... (live nodes size: 2)
   [junit4]   2> 1307046 T3686 oascc.ZkStateReader.updateWatchedCollection Updating data for collection1 to ver 4 
   [junit4]   2> 1308602 T3630 oas.SolrTestCaseJ4.writeCoreProperties Writing core.properties file to /usr/home/jenkins/jenkins-slave/workspace/Lucene-Solr-NightlyTests-5.x/solr/build/solr-core/test/J0/temp/solr.cloud.ReplicationFactorTest 8381C26FCFFDE0A1-001/shard-2-001/cores/collection1
   [junit4]   2> 1308605 T3630 oasc.AbstractFullDistribZkTestBase.createJettys create jetty 2 in directory /usr/home/jenkins/jenkins-slave/workspace/Lucene-Solr-NightlyTests-5.x/solr/build/solr-core/test/J0/temp/solr.cloud.ReplicationFactorTest 8381C26FCFFDE0A1-001/shard-2-001
   [junit4]   2> 1308606 T3630 oejs.Server.doStart jetty-8.1.10.v20130312
   [junit4]   2> 1308609 T3630 oejs.AbstractConnector.doStart Started SocketConnector@127.0.0.1:18980
   [junit4]   2> 1308609 T3630 oascse.JettySolrRunner$1.lifeCycleStarted Jetty properties: {hostContext=/c_/n, hostPort=18979, coreRootDirectory=/usr/home/jenkins/jenkins-slave/workspace/Lucene-Solr-NightlyTests-5.x/solr/build/solr-core/test/J0/temp/solr.cloud.ReplicationFactorTest 8381C26FCFFDE0A1-001/shard-2-001/cores, solr.data.dir=/usr/home/jenkins/jenkins-slave/workspace/Lucene-Solr-NightlyTests-5.x/solr/build/solr-core/test/J0/temp/solr.cloud.ReplicationFactorTest 8381C26FCFFDE0A1-001/tempDir-001/jetty2, solrconfig=solrconfig.xml}
   [junit4]   2> 1308610 T3630 oass.SolrDispatchFilter.init SolrDispatchFilter.init()sun.misc.Launcher$AppClassLoader@231bf785
   [junit4]   2> 1308610 T3630 oasc.SolrResourceLoader.<init> new SolrResourceLoader for directory: '/usr/home/jenkins/jenkins-slave/workspace/Lucene-Solr-NightlyTests-5.x/solr/build/solr-core/test/J0/temp/solr.cloud.ReplicationFactorTest 8381C26FCFFDE0A1-001/shard-2-001/'
   [junit4]   2> 1308653 T3630 oasc.SolrXmlConfig.fromFile Loading container configuration from /usr/home/jenkins/jenkins-slave/workspace/Lucene-Solr-NightlyTests-5.x/solr/build/solr-core/test/J0/temp/solr.cloud.ReplicationFactorTest 8381C26FCFFDE0A1-001/shard-2-001/solr.xml
   [junit4]   2> 1308703 T3630 oasc.CorePropertiesLocator.<init> Config-defined core root directory: /usr/home/jenkins/jenkins-slave/workspace/Lucene-Solr-NightlyTests-5.x/solr/build/solr-core/test/J0/temp/solr.cloud.ReplicationFactorTest 8381C26FCFFDE0A1-001/shard-2-001/cores
   [junit4]   2> 1308704 T3630 oasc.CoreContainer.<init> New CoreContainer 1056895383
   [junit4]   2> 1308704 T3630 oasc.CoreContainer.load Loading cores into CoreContainer [instanceDir=/usr/home/jenkins/jenkins-slave/workspace/Lucene-Solr-NightlyTests-5.x/solr/build/solr-core/test/J0/temp/solr.cloud.ReplicationFactorTest 8381C26FCFFDE0A1-001/shard-2-001/]
   [junit4]   2> 1308704 T3630 oasc.CoreContainer.load loading shared library: /usr/home/jenkins/jenkins-slave/workspace/Lucene-Solr-NightlyTests-5.x/solr/build/solr-core/test/J0/temp/solr.cloud.ReplicationFactorTest 8381C26FCFFDE0A1-001/shard-2-001/lib
   [junit4]   2> 1308705 T3630 oasc.SolrResourceLoader.addToClassLoader WARN Can't find (or read) directory to add to classloader: lib (resolved as: /usr/home/jenkins/jenkins-slave/works

[...truncated too long message...]

rSoftCommitTest 8381C26FCFFDE0A1-001/shard-2-001/cores/collection1/data/index.20150317121107095
   [junit4]   2> 2378531 T38528 oejsh.ContextHandler.doStop stopped o.e.j.s.ServletContextHandler{/,null}
   [junit4]   2> 2378669 T38528 oasc.ZkTestServer.send4LetterWord connecting to 127.0.0.1:38866 38866
   [junit4]   2> 2379770 T38529 oasc.ZkTestServer.send4LetterWord connecting to 127.0.0.1:38866 38866
   [junit4]   2> 2379771 T38529 oasc.ZkTestServer$ZKServerMain.runFromConfig WARN Watch limit violations: 
   [junit4]   2> 	Maximum concurrent create/delete watches above limit:
   [junit4]   2> 	
   [junit4]   2> 		4	/solr/clusterstate.json
   [junit4]   2> 		4	/solr/aliases.json
   [junit4]   2> 		3	/solr/configs/conf1
   [junit4]   2> 		2	/solr/collections/collection1/state.json
   [junit4]   2> 	
   [junit4]   2> 	Maximum concurrent children watches above limit:
   [junit4]   2> 	
   [junit4]   2> 		4	/solr/live_nodes
   [junit4]   2> 		3	/solr/overseer/collection-queue-work
   [junit4]   2> 		3	/solr/overseer/queue
   [junit4]   2> 	
   [junit4]   2> 2379772 T38528 oasc.SocketProxy.close WARN Closing 5 connections to: http://127.0.0.1:38884/
   [junit4]   2> 2379772 T38528 oasc.SocketProxy.close WARN Closing 0 connections to: http://127.0.0.1:38872/
   [junit4]   2> 2379772 T38528 oasc.SocketProxy.close WARN Closing 0 connections to: http://127.0.0.1:38903/
   [junit4]   2> NOTE: download the large Jenkins line-docs file by running 'ant get-jenkins-line-docs' in the lucene directory.
   [junit4]   2> NOTE: reproduce with: ant test  -Dtestcase=RecoveryAfterSoftCommitTest -Dtests.method=test -Dtests.seed=8381C26FCFFDE0A1 -Dtests.multiplier=2 -Dtests.nightly=true -Dtests.slow=true -Dtests.linedocsfile=/home/jenkins/lucene-data/enwiki.random.lines.txt -Dtests.locale=lt -Dtests.timezone=America/Boa_Vista -Dtests.asserts=true -Dtests.file.encoding=ISO-8859-1
   [junit4] ERROR   63.7s J3 | RecoveryAfterSoftCommitTest.test <<<
   [junit4]    > Throwable #1: org.apache.solr.client.solrj.SolrServerException: org.apache.http.NoHttpResponseException: The target server failed to respond
   [junit4]    > 	at __randomizedtesting.SeedInfo.seed([8381C26FCFFDE0A1:BD5FDB561018D59]:0)
   [junit4]    > 	at org.apache.solr.client.solrj.impl.CloudSolrClient.requestWithRetryOnStaleState(CloudSolrClient.java:929)
   [junit4]    > 	at org.apache.solr.client.solrj.impl.CloudSolrClient.request(CloudSolrClient.java:782)
   [junit4]    > 	at org.apache.solr.client.solrj.SolrRequest.process(SolrRequest.java:135)
   [junit4]    > 	at org.apache.solr.client.solrj.SolrClient.add(SolrClient.java:174)
   [junit4]    > 	at org.apache.solr.client.solrj.SolrClient.add(SolrClient.java:139)
   [junit4]    > 	at org.apache.solr.client.solrj.SolrClient.add(SolrClient.java:153)
   [junit4]    > 	at org.apache.solr.cloud.RecoveryAfterSoftCommitTest.test(RecoveryAfterSoftCommitTest.java:88)
   [junit4]    > 	at org.apache.solr.BaseDistributedSearchTestCase$ShardsRepeatRule$ShardsFixedStatement.callStatement(BaseDistributedSearchTestCase.java:958)
   [junit4]    > 	at org.apache.solr.BaseDistributedSearchTestCase$ShardsRepeatRule$ShardsStatement.evaluate(BaseDistributedSearchTestCase.java:933)
   [junit4]    > 	at java.lang.Thread.run(Thread.java:745)
   [junit4]    > Caused by: org.apache.http.NoHttpResponseException: The target server failed to respond
   [junit4]    > 	at org.apache.http.impl.conn.DefaultHttpResponseParser.parseHead(DefaultHttpResponseParser.java:143)
   [junit4]    > 	at org.apache.http.impl.conn.DefaultHttpResponseParser.parseHead(DefaultHttpResponseParser.java:57)
   [junit4]    > 	at org.apache.http.impl.io.AbstractMessageParser.parse(AbstractMessageParser.java:260)
   [junit4]    > 	at org.apache.http.impl.AbstractHttpClientConnection.receiveResponseHeader(AbstractHttpClientConnection.java:283)
   [junit4]    > 	at org.apache.http.impl.conn.DefaultClientConnection.receiveResponseHeader(DefaultClientConnection.java:251)
   [junit4]    > 	at org.apache.http.impl.conn.ManagedClientConnectionImpl.receiveResponseHeader(ManagedClientConnectionImpl.java:197)
   [junit4]    > 	at org.apache.http.protocol.HttpRequestExecutor.doReceiveResponse(HttpRequestExecutor.java:271)
   [junit4]    > 	at org.apache.http.protocol.HttpRequestExecutor.execute(HttpRequestExecutor.java:123)
   [junit4]    > 	at org.apache.http.impl.client.DefaultRequestDirector.tryExecute(DefaultRequestDirector.java:682)
   [junit4]    > 	at org.apache.http.impl.client.DefaultRequestDirector.execute(DefaultRequestDirector.java:486)
   [junit4]    > 	at org.apache.http.impl.client.AbstractHttpClient.doExecute(AbstractHttpClient.java:863)
   [junit4]    > 	at org.apache.http.impl.client.CloseableHttpClient.execute(CloseableHttpClient.java:82)
   [junit4]    > 	at org.apache.http.impl.client.CloseableHttpClient.execute(CloseableHttpClient.java:106)
   [junit4]    > 	at org.apache.http.impl.client.CloseableHttpClient.execute(CloseableHttpClient.java:57)
   [junit4]    > 	at org.apache.solr.client.solrj.impl.HttpSolrClient.executeMethod(HttpSolrClient.java:490)
   [junit4]    > 	at org.apache.solr.client.solrj.impl.HttpSolrClient.request(HttpSolrClient.java:236)
   [junit4]    > 	at org.apache.solr.client.solrj.impl.HttpSolrClient.request(HttpSolrClient.java:228)
   [junit4]    > 	at org.apache.solr.client.solrj.impl.LBHttpSolrClient.doRequest(LBHttpSolrClient.java:370)
   [junit4]    > 	at org.apache.solr.client.solrj.impl.LBHttpSolrClient.request(LBHttpSolrClient.java:325)
   [junit4]    > 	at org.apache.solr.client.solrj.impl.CloudSolrClient$2.call(CloudSolrClient.java:596)
   [junit4]    > 	at org.apache.solr.client.solrj.impl.CloudSolrClient$2.call(CloudSolrClient.java:593)
   [junit4]    > 	at java.util.concurrent.FutureTask.run(FutureTask.java:262)
   [junit4]    > 	at java.util.concurrent.ThreadPoolExecutor.runWorker(ThreadPoolExecutor.java:1145)
   [junit4]    > 	at java.util.concurrent.ThreadPoolExecutor$Worker.run(ThreadPoolExecutor.java:615)
   [junit4]    > 	... 1 more
   [junit4]   2> 2379801 T38528 oas.SolrTestCaseJ4.deleteCore ###deleteCore
   [junit4]   2> NOTE: leaving temporary files on disk at: /usr/home/jenkins/jenkins-slave/workspace/Lucene-Solr-NightlyTests-5.x/solr/build/solr-core/test/J3/temp/solr.cloud.RecoveryAfterSoftCommitTest 8381C26FCFFDE0A1-001
   [junit4]   2> NOTE: test params are: codec=Lucene50, sim=RandomSimilarityProvider(queryNorm=false,coord=no): {}, locale=lt, timezone=America/Boa_Vista
   [junit4]   2> NOTE: FreeBSD 9.1-RELEASE-p3 amd64/Oracle Corporation 1.7.0_65 (64-bit)/cpus=16,threads=1,free=157499272,total=382205952
   [junit4]   2> NOTE: All tests run in this JVM: [TestBulkSchemaAPI, TestUtils, TestDynamicFieldResource, ClusterStateUpdateTest, IgnoreCommitOptimizeUpdateProcessorFactoryTest, RequestLoggingTest, DistributedMLTComponentTest, SharedFSAutoReplicaFailoverTest, CurrencyFieldXmlFileTest, TestDistributedGrouping, UUIDUpdateProcessorFallbackTest, TestIndexSearcher, AsyncMigrateRouteKeyTest, DistribDocExpirationUpdateProcessorTest, TestJmxMonitoredMap, TestPostingsSolrHighlighter, DocValuesMultiTest, SuggesterWFSTTest, TestStressUserVersions, TestFiltering, DeleteShardTest, TestPseudoReturnFields, QueryResultKeyTest, TestSolrConfigHandlerConcurrent, DocValuesTest, UpdateRequestProcessorFactoryTest, DistributedFacetPivotLargeTest, TestWordDelimiterFilterFactory, TestDefaultSimilarityFactory, CSVRequestHandlerTest, TestSchemaManager, TestIntervalFaceting, HdfsUnloadDistributedZkTest, DefaultValueUpdateProcessorTest, FacetPivotSmallTest, ExternalCollectionsTest, MultiThreadedOCPTest, AnalysisAfterCoreReloadTest, TestValueSourceCache, TestArbitraryIndexDir, DistributedQueryComponentOptimizationTest, TestLRUStatsCache, JsonLoaderTest, TestClassNameShortening, TestManagedSchema, TestSystemIdResolver, TestPivotHelperCode, UnloadDistributedZkTest, LeaderElectionTest, DateMathParserTest, TestSolrQueryParserDefaultOperatorResource, TestDefaultSearchFieldResource, MultiTermTest, TestCloudManagedSchema, OutOfBoxZkACLAndCredentialsProvidersTest, AlternateDirectoryTest, SyncSliceTest, LeaderElectionIntegrationTest, ShardRoutingTest, ZkSolrClientTest, TestZkChroot, TestRandomDVFaceting, ZkCLITest, TestDistributedSearch, RecoveryAfterSoftCommitTest]
   [junit4] Completed on J3 in 63.76s, 1 test, 1 error <<< FAILURES!

[...truncated 285 lines...]
BUILD FAILED
/usr/home/jenkins/jenkins-slave/workspace/Lucene-Solr-NightlyTests-5.x/build.xml:536: The following error occurred while executing this line:
/usr/home/jenkins/jenkins-slave/workspace/Lucene-Solr-NightlyTests-5.x/build.xml:477: The following error occurred while executing this line:
/usr/home/jenkins/jenkins-slave/workspace/Lucene-Solr-NightlyTests-5.x/build.xml:61: The following error occurred while executing this line:
/usr/home/jenkins/jenkins-slave/workspace/Lucene-Solr-NightlyTests-5.x/extra-targets.xml:39: The following error occurred while executing this line:
/usr/home/jenkins/jenkins-slave/workspace/Lucene-Solr-NightlyTests-5.x/solr/build.xml:191: The following error occurred while executing this line:
/usr/home/jenkins/jenkins-slave/workspace/Lucene-Solr-NightlyTests-5.x/solr/common-build.xml:509: The following error occurred while executing this line:
/usr/home/jenkins/jenkins-slave/workspace/Lucene-Solr-NightlyTests-5.x/lucene/common-build.xml:1370: The following error occurred while executing this line:
/usr/home/jenkins/jenkins-slave/workspace/Lucene-Solr-NightlyTests-5.x/lucene/common-build.xml:976: There were test failures: 474 suites, 1889 tests, 3 errors, 58 ignored (9 assumptions)

Total time: 161 minutes 48 seconds
Build step 'Invoke Ant' marked build as failure
Archiving artifacts
Sending artifact delta relative to Lucene-Solr-NightlyTests-5.x #716
Archived 5 artifacts
Archive block size is 32768
Received 0 blocks and 751655395 bytes
Compression is 0.0%
Took 2 min 15 sec
Recording test results
Email was triggered for: Failure
Sending email for trigger: Failure



Mime
View raw message