lucene-dev mailing list archives

Site index · List index
Message view « Date » · « Thread »
Top « Date » · « Thread »
From Anshum Gupta <ans...@anshumgupta.net>
Subject Re: [JENKINS] Lucene-Solr-5.x-Windows (32bit/jdk1.7.0_76) - Build # 4389 - Still Failing!
Date Wed, 18 Feb 2015 03:44:40 GMT
Yes, this was caused by commits in SOLR-6956. I've committed a fix to both
trunk and 5x.

On Tue, Feb 17, 2015 at 4:50 PM, Chris Hostetter <hossman_lucene@fucit.org>
wrote:

>
> I think anshum already fixed tihs this?
>
> was caused by commits in SOLR-6956.
>
>
>
> : Date: Wed, 18 Feb 2015 00:43:26 +0000 (UTC)
> : From: Policeman Jenkins Server <jenkins@thetaphi.de>
> : Reply-To: dev@lucene.apache.org
> : To: shalin@apache.org, jpountz@apache.org, rmuir@apache.org,
> :     dev@lucene.apache.org
> : Subject: [JENKINS] Lucene-Solr-5.x-Windows (32bit/jdk1.7.0_76) - Build #
> 4389
> :     - Still Failing!
> :
> : Build: http://jenkins.thetaphi.de/job/Lucene-Solr-5.x-Windows/4389/
> : Java: 32bit/jdk1.7.0_76 -client -XX:+UseParallelGC
> :
> : 17 tests failed.
> : FAILED:
> org.apache.solr.cloud.OverseerCollectionProcessorTest.testReplicationEqualNumberOfSlicesPerNodeSendNullCreateNodes
> :
> : Error Message:
> : Captured an uncaught exception in thread: Thread[id=15602,
> name=OverseerThreadFactory-8184-thread-1, state=RUNNABLE,
> group=TGRP-OverseerCollectionProcessorTest]
> :
> : Stack Trace:
> : com.carrotsearch.randomizedtesting.UncaughtExceptionError: Captured an
> uncaught exception in thread: Thread[id=15602,
> name=OverseerThreadFactory-8184-thread-1, state=RUNNABLE,
> group=TGRP-OverseerCollectionProcessorTest]
> : Caused by: java.lang.AssertionError:
> :   Unexpected method call updateClusterState(true):
> :     getClusterProps(): expected: 1, actual: 0
> :       at __randomizedtesting.SeedInfo.seed([847BA5C67BD44D56]:0)
> :       at
> org.easymock.internal.MockInvocationHandler.invoke(MockInvocationHandler.java:45)
> :       at
> org.easymock.internal.ObjectMethodsFilter.invoke(ObjectMethodsFilter.java:73)
> :       at
> org.easymock.internal.ClassProxyFactory$MockMethodInterceptor.intercept(ClassProxyFactory.java:92)
> :       at
> org.apache.solr.common.cloud.ZkStateReader$$EnhancerByCGLIB$$2e4978aa.updateClusterState(<generated>)
> :       at
> org.apache.solr.cloud.OverseerCollectionProcessor.processMessage(OverseerCollectionProcessor.java:583)
> :       at
> org.apache.solr.cloud.OverseerCollectionProcessor$Runner.run(OverseerCollectionProcessor.java:2863)
> :       at
> java.util.concurrent.ThreadPoolExecutor.runWorker(ThreadPoolExecutor.java:1145)
> :       at
> java.util.concurrent.ThreadPoolExecutor$Worker.run(ThreadPoolExecutor.java:615)
> :       at java.lang.Thread.run(Thread.java:745)
> :
> :
> : FAILED:
> org.apache.solr.cloud.OverseerCollectionProcessorTest.testNoReplicationEqualNumberOfSlicesPerNodeSendNullCreateNodes
> :
> : Error Message:
> : Captured an uncaught exception in thread: Thread[id=15605,
> name=OverseerThreadFactory-8185-thread-1, state=RUNNABLE,
> group=TGRP-OverseerCollectionProcessorTest]
> :
> : Stack Trace:
> : com.carrotsearch.randomizedtesting.UncaughtExceptionError: Captured an
> uncaught exception in thread: Thread[id=15605,
> name=OverseerThreadFactory-8185-thread-1, state=RUNNABLE,
> group=TGRP-OverseerCollectionProcessorTest]
> : Caused by: java.lang.AssertionError:
> :   Unexpected method call updateClusterState(true):
> :     getClusterProps(): expected: 1, actual: 0
> :       at __randomizedtesting.SeedInfo.seed([847BA5C67BD44D56]:0)
> :       at
> org.easymock.internal.MockInvocationHandler.invoke(MockInvocationHandler.java:45)
> :       at
> org.easymock.internal.ObjectMethodsFilter.invoke(ObjectMethodsFilter.java:73)
> :       at
> org.easymock.internal.ClassProxyFactory$MockMethodInterceptor.intercept(ClassProxyFactory.java:92)
> :       at
> org.apache.solr.common.cloud.ZkStateReader$$EnhancerByCGLIB$$2e4978aa.updateClusterState(<generated>)
> :       at
> org.apache.solr.cloud.OverseerCollectionProcessor.processMessage(OverseerCollectionProcessor.java:583)
> :       at
> org.apache.solr.cloud.OverseerCollectionProcessor$Runner.run(OverseerCollectionProcessor.java:2863)
> :       at
> java.util.concurrent.ThreadPoolExecutor.runWorker(ThreadPoolExecutor.java:1145)
> :       at
> java.util.concurrent.ThreadPoolExecutor$Worker.run(ThreadPoolExecutor.java:615)
> :       at java.lang.Thread.run(Thread.java:745)
> :
> :
> : FAILED:
> org.apache.solr.cloud.OverseerCollectionProcessorTest.testReplicationEqualNumberOfSlicesPerNode
> :
> : Error Message:
> : Captured an uncaught exception in thread: Thread[id=15608,
> name=OverseerThreadFactory-8186-thread-1, state=RUNNABLE,
> group=TGRP-OverseerCollectionProcessorTest]
> :
> : Stack Trace:
> : com.carrotsearch.randomizedtesting.UncaughtExceptionError: Captured an
> uncaught exception in thread: Thread[id=15608,
> name=OverseerThreadFactory-8186-thread-1, state=RUNNABLE,
> group=TGRP-OverseerCollectionProcessorTest]
> : Caused by: java.lang.AssertionError:
> :   Unexpected method call updateClusterState(true):
> :     getClusterProps(): expected: 1, actual: 0
> :       at __randomizedtesting.SeedInfo.seed([847BA5C67BD44D56]:0)
> :       at
> org.easymock.internal.MockInvocationHandler.invoke(MockInvocationHandler.java:45)
> :       at
> org.easymock.internal.ObjectMethodsFilter.invoke(ObjectMethodsFilter.java:73)
> :       at
> org.easymock.internal.ClassProxyFactory$MockMethodInterceptor.intercept(ClassProxyFactory.java:92)
> :       at
> org.apache.solr.common.cloud.ZkStateReader$$EnhancerByCGLIB$$2e4978aa.updateClusterState(<generated>)
> :       at
> org.apache.solr.cloud.OverseerCollectionProcessor.processMessage(OverseerCollectionProcessor.java:583)
> :       at
> org.apache.solr.cloud.OverseerCollectionProcessor$Runner.run(OverseerCollectionProcessor.java:2863)
> :       at
> java.util.concurrent.ThreadPoolExecutor.runWorker(ThreadPoolExecutor.java:1145)
> :       at
> java.util.concurrent.ThreadPoolExecutor$Worker.run(ThreadPoolExecutor.java:615)
> :       at java.lang.Thread.run(Thread.java:745)
> :
> :
> : FAILED:
> org.apache.solr.cloud.OverseerCollectionProcessorTest.testNoReplicationLimitedNodesToCreateOn
> :
> : Error Message:
> : Captured an uncaught exception in thread: Thread[id=15611,
> name=OverseerThreadFactory-8187-thread-1, state=RUNNABLE,
> group=TGRP-OverseerCollectionProcessorTest]
> :
> : Stack Trace:
> : com.carrotsearch.randomizedtesting.UncaughtExceptionError: Captured an
> uncaught exception in thread: Thread[id=15611,
> name=OverseerThreadFactory-8187-thread-1, state=RUNNABLE,
> group=TGRP-OverseerCollectionProcessorTest]
> : Caused by: java.lang.AssertionError:
> :   Unexpected method call updateClusterState(true):
> :     getClusterProps(): expected: 1, actual: 0
> :       at __randomizedtesting.SeedInfo.seed([847BA5C67BD44D56]:0)
> :       at
> org.easymock.internal.MockInvocationHandler.invoke(MockInvocationHandler.java:45)
> :       at
> org.easymock.internal.ObjectMethodsFilter.invoke(ObjectMethodsFilter.java:73)
> :       at
> org.easymock.internal.ClassProxyFactory$MockMethodInterceptor.intercept(ClassProxyFactory.java:92)
> :       at
> org.apache.solr.common.cloud.ZkStateReader$$EnhancerByCGLIB$$2e4978aa.updateClusterState(<generated>)
> :       at
> org.apache.solr.cloud.OverseerCollectionProcessor.processMessage(OverseerCollectionProcessor.java:583)
> :       at
> org.apache.solr.cloud.OverseerCollectionProcessor$Runner.run(OverseerCollectionProcessor.java:2863)
> :       at
> java.util.concurrent.ThreadPoolExecutor.runWorker(ThreadPoolExecutor.java:1145)
> :       at
> java.util.concurrent.ThreadPoolExecutor$Worker.run(ThreadPoolExecutor.java:615)
> :       at java.lang.Thread.run(Thread.java:745)
> :
> :
> : FAILED:
> org.apache.solr.cloud.OverseerCollectionProcessorTest.testReplicationCollectionNotCreatedDueToMaxShardsPerNodeAndNodesToCreateOnLimits
> :
> : Error Message:
> : Captured an uncaught exception in thread: Thread[id=15614,
> name=OverseerThreadFactory-8188-thread-1, state=RUNNABLE,
> group=TGRP-OverseerCollectionProcessorTest]
> :
> : Stack Trace:
> : com.carrotsearch.randomizedtesting.UncaughtExceptionError: Captured an
> uncaught exception in thread: Thread[id=15614,
> name=OverseerThreadFactory-8188-thread-1, state=RUNNABLE,
> group=TGRP-OverseerCollectionProcessorTest]
> : Caused by: java.lang.AssertionError:
> :   Unexpected method call updateClusterState(true):
> :     getClusterProps(): expected: 1, actual: 0
> :       at __randomizedtesting.SeedInfo.seed([847BA5C67BD44D56]:0)
> :       at
> org.easymock.internal.MockInvocationHandler.invoke(MockInvocationHandler.java:45)
> :       at
> org.easymock.internal.ObjectMethodsFilter.invoke(ObjectMethodsFilter.java:73)
> :       at
> org.easymock.internal.ClassProxyFactory$MockMethodInterceptor.intercept(ClassProxyFactory.java:92)
> :       at
> org.apache.solr.common.cloud.ZkStateReader$$EnhancerByCGLIB$$2e4978aa.updateClusterState(<generated>)
> :       at
> org.apache.solr.cloud.OverseerCollectionProcessor.processMessage(OverseerCollectionProcessor.java:583)
> :       at
> org.apache.solr.cloud.OverseerCollectionProcessor$Runner.run(OverseerCollectionProcessor.java:2863)
> :       at
> java.util.concurrent.ThreadPoolExecutor.runWorker(ThreadPoolExecutor.java:1145)
> :       at
> java.util.concurrent.ThreadPoolExecutor$Worker.run(ThreadPoolExecutor.java:615)
> :       at java.lang.Thread.run(Thread.java:745)
> :
> :
> : FAILED:
> org.apache.solr.cloud.OverseerCollectionProcessorTest.testReplicationCollectionNotCreatedDueToMaxShardsPerNodeLimit
> :
> : Error Message:
> : Captured an uncaught exception in thread: Thread[id=15617,
> name=OverseerThreadFactory-8189-thread-1, state=RUNNABLE,
> group=TGRP-OverseerCollectionProcessorTest]
> :
> : Stack Trace:
> : com.carrotsearch.randomizedtesting.UncaughtExceptionError: Captured an
> uncaught exception in thread: Thread[id=15617,
> name=OverseerThreadFactory-8189-thread-1, state=RUNNABLE,
> group=TGRP-OverseerCollectionProcessorTest]
> : Caused by: java.lang.AssertionError:
> :   Unexpected method call updateClusterState(true):
> :     getClusterProps(): expected: 1, actual: 0
> :       at __randomizedtesting.SeedInfo.seed([847BA5C67BD44D56]:0)
> :       at
> org.easymock.internal.MockInvocationHandler.invoke(MockInvocationHandler.java:45)
> :       at
> org.easymock.internal.ObjectMethodsFilter.invoke(ObjectMethodsFilter.java:73)
> :       at
> org.easymock.internal.ClassProxyFactory$MockMethodInterceptor.intercept(ClassProxyFactory.java:92)
> :       at
> org.apache.solr.common.cloud.ZkStateReader$$EnhancerByCGLIB$$2e4978aa.updateClusterState(<generated>)
> :       at
> org.apache.solr.cloud.OverseerCollectionProcessor.processMessage(OverseerCollectionProcessor.java:583)
> :       at
> org.apache.solr.cloud.OverseerCollectionProcessor$Runner.run(OverseerCollectionProcessor.java:2863)
> :       at
> java.util.concurrent.ThreadPoolExecutor.runWorker(ThreadPoolExecutor.java:1145)
> :       at
> java.util.concurrent.ThreadPoolExecutor$Worker.run(ThreadPoolExecutor.java:615)
> :       at java.lang.Thread.run(Thread.java:745)
> :
> :
> : FAILED:
> org.apache.solr.cloud.OverseerCollectionProcessorTest.testNoReplicationUnequalNumberOfSlicesPerNode
> :
> : Error Message:
> : Captured an uncaught exception in thread: Thread[id=15620,
> name=OverseerThreadFactory-8190-thread-1, state=RUNNABLE,
> group=TGRP-OverseerCollectionProcessorTest]
> :
> : Stack Trace:
> : com.carrotsearch.randomizedtesting.UncaughtExceptionError: Captured an
> uncaught exception in thread: Thread[id=15620,
> name=OverseerThreadFactory-8190-thread-1, state=RUNNABLE,
> group=TGRP-OverseerCollectionProcessorTest]
> : Caused by: java.lang.AssertionError:
> :   Unexpected method call updateClusterState(true):
> :     getClusterProps(): expected: 1, actual: 0
> :       at __randomizedtesting.SeedInfo.seed([847BA5C67BD44D56]:0)
> :       at
> org.easymock.internal.MockInvocationHandler.invoke(MockInvocationHandler.java:45)
> :       at
> org.easymock.internal.ObjectMethodsFilter.invoke(ObjectMethodsFilter.java:73)
> :       at
> org.easymock.internal.ClassProxyFactory$MockMethodInterceptor.intercept(ClassProxyFactory.java:92)
> :       at
> org.apache.solr.common.cloud.ZkStateReader$$EnhancerByCGLIB$$2e4978aa.updateClusterState(<generated>)
> :       at
> org.apache.solr.cloud.OverseerCollectionProcessor.processMessage(OverseerCollectionProcessor.java:583)
> :       at
> org.apache.solr.cloud.OverseerCollectionProcessor$Runner.run(OverseerCollectionProcessor.java:2863)
> :       at
> java.util.concurrent.ThreadPoolExecutor.runWorker(ThreadPoolExecutor.java:1145)
> :       at
> java.util.concurrent.ThreadPoolExecutor$Worker.run(ThreadPoolExecutor.java:615)
> :       at java.lang.Thread.run(Thread.java:745)
> :
> :
> : FAILED:
> org.apache.solr.cloud.OverseerCollectionProcessorTest.testNoReplicationEqualNumberOfSlicesPerNode
> :
> : Error Message:
> : Captured an uncaught exception in thread: Thread[id=15623,
> name=OverseerThreadFactory-8191-thread-1, state=RUNNABLE,
> group=TGRP-OverseerCollectionProcessorTest]
> :
> : Stack Trace:
> : com.carrotsearch.randomizedtesting.UncaughtExceptionError: Captured an
> uncaught exception in thread: Thread[id=15623,
> name=OverseerThreadFactory-8191-thread-1, state=RUNNABLE,
> group=TGRP-OverseerCollectionProcessorTest]
> : Caused by: java.lang.AssertionError:
> :   Unexpected method call updateClusterState(true):
> :     getClusterProps(): expected: 1, actual: 0
> :       at __randomizedtesting.SeedInfo.seed([847BA5C67BD44D56]:0)
> :       at
> org.easymock.internal.MockInvocationHandler.invoke(MockInvocationHandler.java:45)
> :       at
> org.easymock.internal.ObjectMethodsFilter.invoke(ObjectMethodsFilter.java:73)
> :       at
> org.easymock.internal.ClassProxyFactory$MockMethodInterceptor.intercept(ClassProxyFactory.java:92)
> :       at
> org.apache.solr.common.cloud.ZkStateReader$$EnhancerByCGLIB$$2e4978aa.updateClusterState(<generated>)
> :       at
> org.apache.solr.cloud.OverseerCollectionProcessor.processMessage(OverseerCollectionProcessor.java:583)
> :       at
> org.apache.solr.cloud.OverseerCollectionProcessor$Runner.run(OverseerCollectionProcessor.java:2863)
> :       at
> java.util.concurrent.ThreadPoolExecutor.runWorker(ThreadPoolExecutor.java:1145)
> :       at
> java.util.concurrent.ThreadPoolExecutor$Worker.run(ThreadPoolExecutor.java:615)
> :       at java.lang.Thread.run(Thread.java:745)
> :
> :
> : FAILED:
> org.apache.solr.cloud.OverseerCollectionProcessorTest.testNoReplicationCollectionNotCreatedDueToMaxShardsPerNodeLimit
> :
> : Error Message:
> : Captured an uncaught exception in thread: Thread[id=15626,
> name=OverseerThreadFactory-8192-thread-1, state=RUNNABLE,
> group=TGRP-OverseerCollectionProcessorTest]
> :
> : Stack Trace:
> : com.carrotsearch.randomizedtesting.UncaughtExceptionError: Captured an
> uncaught exception in thread: Thread[id=15626,
> name=OverseerThreadFactory-8192-thread-1, state=RUNNABLE,
> group=TGRP-OverseerCollectionProcessorTest]
> : Caused by: java.lang.AssertionError:
> :   Unexpected method call updateClusterState(true):
> :     getClusterProps(): expected: 1, actual: 0
> :       at __randomizedtesting.SeedInfo.seed([847BA5C67BD44D56]:0)
> :       at
> org.easymock.internal.MockInvocationHandler.invoke(MockInvocationHandler.java:45)
> :       at
> org.easymock.internal.ObjectMethodsFilter.invoke(ObjectMethodsFilter.java:73)
> :       at
> org.easymock.internal.ClassProxyFactory$MockMethodInterceptor.intercept(ClassProxyFactory.java:92)
> :       at
> org.apache.solr.common.cloud.ZkStateReader$$EnhancerByCGLIB$$2e4978aa.updateClusterState(<generated>)
> :       at
> org.apache.solr.cloud.OverseerCollectionProcessor.processMessage(OverseerCollectionProcessor.java:583)
> :       at
> org.apache.solr.cloud.OverseerCollectionProcessor$Runner.run(OverseerCollectionProcessor.java:2863)
> :       at
> java.util.concurrent.ThreadPoolExecutor.runWorker(ThreadPoolExecutor.java:1145)
> :       at
> java.util.concurrent.ThreadPoolExecutor$Worker.run(ThreadPoolExecutor.java:615)
> :       at java.lang.Thread.run(Thread.java:745)
> :
> :
> : FAILED:
> org.apache.solr.cloud.OverseerCollectionProcessorTest.testNoReplicationCollectionNotCreatedDueToMaxShardsPerNodeAndNodesToCreateOnLimits
> :
> : Error Message:
> : Captured an uncaught exception in thread: Thread[id=15629,
> name=OverseerThreadFactory-8193-thread-1, state=RUNNABLE,
> group=TGRP-OverseerCollectionProcessorTest]
> :
> : Stack Trace:
> : com.carrotsearch.randomizedtesting.UncaughtExceptionError: Captured an
> uncaught exception in thread: Thread[id=15629,
> name=OverseerThreadFactory-8193-thread-1, state=RUNNABLE,
> group=TGRP-OverseerCollectionProcessorTest]
> : Caused by: java.lang.AssertionError:
> :   Unexpected method call updateClusterState(true):
> :     getClusterProps(): expected: 1, actual: 0
> :       at __randomizedtesting.SeedInfo.seed([847BA5C67BD44D56]:0)
> :       at
> org.easymock.internal.MockInvocationHandler.invoke(MockInvocationHandler.java:45)
> :       at
> org.easymock.internal.ObjectMethodsFilter.invoke(ObjectMethodsFilter.java:73)
> :       at
> org.easymock.internal.ClassProxyFactory$MockMethodInterceptor.intercept(ClassProxyFactory.java:92)
> :       at
> org.apache.solr.common.cloud.ZkStateReader$$EnhancerByCGLIB$$2e4978aa.updateClusterState(<generated>)
> :       at
> org.apache.solr.cloud.OverseerCollectionProcessor.processMessage(OverseerCollectionProcessor.java:583)
> :       at
> org.apache.solr.cloud.OverseerCollectionProcessor$Runner.run(OverseerCollectionProcessor.java:2863)
> :       at
> java.util.concurrent.ThreadPoolExecutor.runWorker(ThreadPoolExecutor.java:1145)
> :       at
> java.util.concurrent.ThreadPoolExecutor$Worker.run(ThreadPoolExecutor.java:615)
> :       at java.lang.Thread.run(Thread.java:745)
> :
> :
> : FAILED:
> org.apache.solr.cloud.OverseerCollectionProcessorTest.testReplicationEqualNumberOfSlicesPerNodeSendCreateNodesEqualToLiveNodes
> :
> : Error Message:
> : Captured an uncaught exception in thread: Thread[id=15632,
> name=OverseerThreadFactory-8194-thread-1, state=RUNNABLE,
> group=TGRP-OverseerCollectionProcessorTest]
> :
> : Stack Trace:
> : com.carrotsearch.randomizedtesting.UncaughtExceptionError: Captured an
> uncaught exception in thread: Thread[id=15632,
> name=OverseerThreadFactory-8194-thread-1, state=RUNNABLE,
> group=TGRP-OverseerCollectionProcessorTest]
> : Caused by: java.lang.AssertionError:
> :   Unexpected method call updateClusterState(true):
> :     getClusterProps(): expected: 1, actual: 0
> :       at __randomizedtesting.SeedInfo.seed([847BA5C67BD44D56]:0)
> :       at
> org.easymock.internal.MockInvocationHandler.invoke(MockInvocationHandler.java:45)
> :       at
> org.easymock.internal.ObjectMethodsFilter.invoke(ObjectMethodsFilter.java:73)
> :       at
> org.easymock.internal.ClassProxyFactory$MockMethodInterceptor.intercept(ClassProxyFactory.java:92)
> :       at
> org.apache.solr.common.cloud.ZkStateReader$$EnhancerByCGLIB$$2e4978aa.updateClusterState(<generated>)
> :       at
> org.apache.solr.cloud.OverseerCollectionProcessor.processMessage(OverseerCollectionProcessor.java:583)
> :       at
> org.apache.solr.cloud.OverseerCollectionProcessor$Runner.run(OverseerCollectionProcessor.java:2863)
> :       at
> java.util.concurrent.ThreadPoolExecutor.runWorker(ThreadPoolExecutor.java:1145)
> :       at
> java.util.concurrent.ThreadPoolExecutor$Worker.run(ThreadPoolExecutor.java:615)
> :       at java.lang.Thread.run(Thread.java:745)
> :
> :
> : FAILED:
> org.apache.solr.cloud.OverseerCollectionProcessorTest.testReplicationLimitedNodesToCreateOn
> :
> : Error Message:
> : Captured an uncaught exception in thread: Thread[id=15635,
> name=OverseerThreadFactory-8195-thread-1, state=RUNNABLE,
> group=TGRP-OverseerCollectionProcessorTest]
> :
> : Stack Trace:
> : com.carrotsearch.randomizedtesting.UncaughtExceptionError: Captured an
> uncaught exception in thread: Thread[id=15635,
> name=OverseerThreadFactory-8195-thread-1, state=RUNNABLE,
> group=TGRP-OverseerCollectionProcessorTest]
> : Caused by: java.lang.AssertionError:
> :   Unexpected method call updateClusterState(true):
> :     getClusterProps(): expected: 1, actual: 0
> :       at __randomizedtesting.SeedInfo.seed([847BA5C67BD44D56]:0)
> :       at
> org.easymock.internal.MockInvocationHandler.invoke(MockInvocationHandler.java:45)
> :       at
> org.easymock.internal.ObjectMethodsFilter.invoke(ObjectMethodsFilter.java:73)
> :       at
> org.easymock.internal.ClassProxyFactory$MockMethodInterceptor.intercept(ClassProxyFactory.java:92)
> :       at
> org.apache.solr.common.cloud.ZkStateReader$$EnhancerByCGLIB$$2e4978aa.updateClusterState(<generated>)
> :       at
> org.apache.solr.cloud.OverseerCollectionProcessor.processMessage(OverseerCollectionProcessor.java:583)
> :       at
> org.apache.solr.cloud.OverseerCollectionProcessor$Runner.run(OverseerCollectionProcessor.java:2863)
> :       at
> java.util.concurrent.ThreadPoolExecutor.runWorker(ThreadPoolExecutor.java:1145)
> :       at
> java.util.concurrent.ThreadPoolExecutor$Worker.run(ThreadPoolExecutor.java:615)
> :       at java.lang.Thread.run(Thread.java:745)
> :
> :
> : FAILED:
> org.apache.solr.cloud.OverseerCollectionProcessorTest.testNoReplicationEqualNumberOfSlicesPerNodeSendCreateNodesEqualToLiveNodes
> :
> : Error Message:
> : Captured an uncaught exception in thread: Thread[id=15638,
> name=OverseerThreadFactory-8196-thread-1, state=RUNNABLE,
> group=TGRP-OverseerCollectionProcessorTest]
> :
> : Stack Trace:
> : com.carrotsearch.randomizedtesting.UncaughtExceptionError: Captured an
> uncaught exception in thread: Thread[id=15638,
> name=OverseerThreadFactory-8196-thread-1, state=RUNNABLE,
> group=TGRP-OverseerCollectionProcessorTest]
> : Caused by: java.lang.AssertionError:
> :   Unexpected method call updateClusterState(true):
> :     getClusterProps(): expected: 1, actual: 0
> :       at __randomizedtesting.SeedInfo.seed([847BA5C67BD44D56]:0)
> :       at
> org.easymock.internal.MockInvocationHandler.invoke(MockInvocationHandler.java:45)
> :       at
> org.easymock.internal.ObjectMethodsFilter.invoke(ObjectMethodsFilter.java:73)
> :       at
> org.easymock.internal.ClassProxyFactory$MockMethodInterceptor.intercept(ClassProxyFactory.java:92)
> :       at
> org.apache.solr.common.cloud.ZkStateReader$$EnhancerByCGLIB$$2e4978aa.updateClusterState(<generated>)
> :       at
> org.apache.solr.cloud.OverseerCollectionProcessor.processMessage(OverseerCollectionProcessor.java:583)
> :       at
> org.apache.solr.cloud.OverseerCollectionProcessor$Runner.run(OverseerCollectionProcessor.java:2863)
> :       at
> java.util.concurrent.ThreadPoolExecutor.runWorker(ThreadPoolExecutor.java:1145)
> :       at
> java.util.concurrent.ThreadPoolExecutor$Worker.run(ThreadPoolExecutor.java:615)
> :       at java.lang.Thread.run(Thread.java:745)
> :
> :
> : FAILED:
> org.apache.solr.cloud.OverseerCollectionProcessorTest.testReplicationUnequalNumberOfSlicesPerNode
> :
> : Error Message:
> : Captured an uncaught exception in thread: Thread[id=15641,
> name=OverseerThreadFactory-8197-thread-1, state=RUNNABLE,
> group=TGRP-OverseerCollectionProcessorTest]
> :
> : Stack Trace:
> : com.carrotsearch.randomizedtesting.UncaughtExceptionError: Captured an
> uncaught exception in thread: Thread[id=15641,
> name=OverseerThreadFactory-8197-thread-1, state=RUNNABLE,
> group=TGRP-OverseerCollectionProcessorTest]
> : Caused by: java.lang.AssertionError:
> :   Unexpected method call updateClusterState(true):
> :     getClusterProps(): expected: 1, actual: 0
> :       at __randomizedtesting.SeedInfo.seed([847BA5C67BD44D56]:0)
> :       at
> org.easymock.internal.MockInvocationHandler.invoke(MockInvocationHandler.java:45)
> :       at
> org.easymock.internal.ObjectMethodsFilter.invoke(ObjectMethodsFilter.java:73)
> :       at
> org.easymock.internal.ClassProxyFactory$MockMethodInterceptor.intercept(ClassProxyFactory.java:92)
> :       at
> org.apache.solr.common.cloud.ZkStateReader$$EnhancerByCGLIB$$2e4978aa.updateClusterState(<generated>)
> :       at
> org.apache.solr.cloud.OverseerCollectionProcessor.processMessage(OverseerCollectionProcessor.java:583)
> :       at
> org.apache.solr.cloud.OverseerCollectionProcessor$Runner.run(OverseerCollectionProcessor.java:2863)
> :       at
> java.util.concurrent.ThreadPoolExecutor.runWorker(ThreadPoolExecutor.java:1145)
> :       at
> java.util.concurrent.ThreadPoolExecutor$Worker.run(ThreadPoolExecutor.java:615)
> :       at java.lang.Thread.run(Thread.java:745)
> :
> :
> : FAILED:
> junit.framework.TestSuite.org.apache.solr.cloud.BasicDistributedZk2Test
> :
> : Error Message:
> : Could not remove the following files (in the order of attempts):
> C:\Users\JenkinsSlave\workspace\Lucene-Solr-5.x-Windows\solr\build\solr-core\test\J0\temp\solr.cloud.BasicDistributedZk2Test
> 847BA5C67BD44D56-001\tempDir-002: java.nio.file.AccessDeniedException:
> C:\Users\JenkinsSlave\workspace\Lucene-Solr-5.x-Windows\solr\build\solr-core\test\J0\temp\solr.cloud.BasicDistributedZk2Test
> 847BA5C67BD44D56-001\tempDir-002
> C:\Users\JenkinsSlave\workspace\Lucene-Solr-5.x-Windows\solr\build\solr-core\test\J0\temp\solr.cloud.BasicDistributedZk2Test
> 847BA5C67BD44D56-001: java.nio.file.DirectoryNotEmptyException:
> C:\Users\JenkinsSlave\workspace\Lucene-Solr-5.x-Windows\solr\build\solr-core\test\J0\temp\solr.cloud.BasicDistributedZk2Test
> 847BA5C67BD44D56-001
> :
> : Stack Trace:
> : java.io.IOException: Could not remove the following files (in the order
> of attempts):
> :
> C:\Users\JenkinsSlave\workspace\Lucene-Solr-5.x-Windows\solr\build\solr-core\test\J0\temp\solr.cloud.BasicDistributedZk2Test
> 847BA5C67BD44D56-001\tempDir-002: java.nio.file.AccessDeniedException:
> C:\Users\JenkinsSlave\workspace\Lucene-Solr-5.x-Windows\solr\build\solr-core\test\J0\temp\solr.cloud.BasicDistributedZk2Test
> 847BA5C67BD44D56-001\tempDir-002
> :
> C:\Users\JenkinsSlave\workspace\Lucene-Solr-5.x-Windows\solr\build\solr-core\test\J0\temp\solr.cloud.BasicDistributedZk2Test
> 847BA5C67BD44D56-001: java.nio.file.DirectoryNotEmptyException:
> C:\Users\JenkinsSlave\workspace\Lucene-Solr-5.x-Windows\solr\build\solr-core\test\J0\temp\solr.cloud.BasicDistributedZk2Test
> 847BA5C67BD44D56-001
> :
> :       at __randomizedtesting.SeedInfo.seed([847BA5C67BD44D56]:0)
> :       at org.apache.lucene.util.IOUtils.rm(IOUtils.java:294)
> :       at
> org.apache.lucene.util.TestRuleTemporaryFilesCleanup.afterAlways(TestRuleTemporaryFilesCleanup.java:170)
> :       at
> com.carrotsearch.randomizedtesting.rules.TestRuleAdapter$1.afterAlways(TestRuleAdapter.java:31)
> :       at
> com.carrotsearch.randomizedtesting.rules.StatementAdapter.evaluate(StatementAdapter.java:43)
> :       at
> com.carrotsearch.randomizedtesting.rules.StatementAdapter.evaluate(StatementAdapter.java:36)
> :       at
> org.apache.lucene.util.TestRuleAssertionsRequired$1.evaluate(TestRuleAssertionsRequired.java:54)
> :       at
> org.apache.lucene.util.TestRuleMarkFailure$1.evaluate(TestRuleMarkFailure.java:48)
> :       at
> org.apache.lucene.util.TestRuleIgnoreAfterMaxFailures$1.evaluate(TestRuleIgnoreAfterMaxFailures.java:65)
> :       at
> org.apache.lucene.util.TestRuleIgnoreTestSuites$1.evaluate(TestRuleIgnoreTestSuites.java:55)
> :       at
> com.carrotsearch.randomizedtesting.rules.StatementAdapter.evaluate(StatementAdapter.java:36)
> :       at
> com.carrotsearch.randomizedtesting.ThreadLeakControl$StatementRunner.run(ThreadLeakControl.java:365)
> :       at java.lang.Thread.run(Thread.java:745)
> :
> :
> : FAILED:  org.apache.solr.cloud.ReplicationFactorTest.test
> :
> : Error Message:
> : org.apache.http.NoHttpResponseException: The target server failed to
> respond
> :
> : Stack Trace:
> : org.apache.solr.client.solrj.SolrServerException:
> org.apache.http.NoHttpResponseException: The target server failed to respond
> :       at
> org.apache.solr.client.solrj.impl.CloudSolrClient.requestWithRetryOnStaleState(CloudSolrClient.java:865)
> :       at
> org.apache.solr.client.solrj.impl.CloudSolrClient.request(CloudSolrClient.java:730)
> :       at
> org.apache.solr.cloud.ReplicationFactorTest.testRf3(ReplicationFactorTest.java:283)
> :       at
> org.apache.solr.cloud.ReplicationFactorTest.test(ReplicationFactorTest.java:112)
> :       at sun.reflect.NativeMethodAccessorImpl.invoke0(Native Method)
> :       at
> sun.reflect.NativeMethodAccessorImpl.invoke(NativeMethodAccessorImpl.java:57)
> :       at
> sun.reflect.DelegatingMethodAccessorImpl.invoke(DelegatingMethodAccessorImpl.java:43)
> :       at java.lang.reflect.Method.invoke(Method.java:606)
> :       at
> com.carrotsearch.randomizedtesting.RandomizedRunner.invoke(RandomizedRunner.java:1618)
> :       at
> com.carrotsearch.randomizedtesting.RandomizedRunner$6.evaluate(RandomizedRunner.java:827)
> :       at
> com.carrotsearch.randomizedtesting.RandomizedRunner$7.evaluate(RandomizedRunner.java:863)
> :       at
> com.carrotsearch.randomizedtesting.RandomizedRunner$8.evaluate(RandomizedRunner.java:877)
> :       at
> org.apache.solr.BaseDistributedSearchTestCase$ShardsRepeatRule$ShardsFixedStatement.callStatement(BaseDistributedSearchTestCase.java:940)
> :       at
> org.apache.solr.BaseDistributedSearchTestCase$ShardsRepeatRule$ShardsStatement.evaluate(BaseDistributedSearchTestCase.java:915)
> :       at
> com.carrotsearch.randomizedtesting.rules.SystemPropertiesRestoreRule$1.evaluate(SystemPropertiesRestoreRule.java:53)
> :       at
> org.apache.lucene.util.TestRuleSetupTeardownChained$1.evaluate(TestRuleSetupTeardownChained.java:50)
> :       at
> org.apache.lucene.util.AbstractBeforeAfterRule$1.evaluate(AbstractBeforeAfterRule.java:46)
> :       at
> com.carrotsearch.randomizedtesting.rules.SystemPropertiesInvariantRule$1.evaluate(SystemPropertiesInvariantRule.java:55)
> :       at
> org.apache.lucene.util.TestRuleThreadAndTestName$1.evaluate(TestRuleThreadAndTestName.java:49)
> :       at
> org.apache.lucene.util.TestRuleIgnoreAfterMaxFailures$1.evaluate(TestRuleIgnoreAfterMaxFailures.java:65)
> :       at
> org.apache.lucene.util.TestRuleMarkFailure$1.evaluate(TestRuleMarkFailure.java:48)
> :       at
> com.carrotsearch.randomizedtesting.rules.StatementAdapter.evaluate(StatementAdapter.java:36)
> :       at
> com.carrotsearch.randomizedtesting.ThreadLeakControl$StatementRunner.run(ThreadLeakControl.java:365)
> :       at
> com.carrotsearch.randomizedtesting.ThreadLeakControl.forkTimeoutingTask(ThreadLeakControl.java:798)
> :       at
> com.carrotsearch.randomizedtesting.ThreadLeakControl$3.evaluate(ThreadLeakControl.java:458)
> :       at
> com.carrotsearch.randomizedtesting.RandomizedRunner.runSingleTest(RandomizedRunner.java:836)
> :       at
> com.carrotsearch.randomizedtesting.RandomizedRunner$3.evaluate(RandomizedRunner.java:738)
> :       at
> com.carrotsearch.randomizedtesting.RandomizedRunner$4.evaluate(RandomizedRunner.java:772)
> :       at
> com.carrotsearch.randomizedtesting.RandomizedRunner$5.evaluate(RandomizedRunner.java:783)
> :       at
> com.carrotsearch.randomizedtesting.rules.StatementAdapter.evaluate(StatementAdapter.java:36)
> :       at
> com.carrotsearch.randomizedtesting.rules.SystemPropertiesRestoreRule$1.evaluate(SystemPropertiesRestoreRule.java:53)
> :       at
> org.apache.lucene.util.AbstractBeforeAfterRule$1.evaluate(AbstractBeforeAfterRule.java:46)
> :       at
> org.apache.lucene.util.TestRuleStoreClassName$1.evaluate(TestRuleStoreClassName.java:42)
> :       at
> com.carrotsearch.randomizedtesting.rules.SystemPropertiesInvariantRule$1.evaluate(SystemPropertiesInvariantRule.java:55)
> :       at
> com.carrotsearch.randomizedtesting.rules.NoShadowingOrOverridesOnMethodsRule$1.evaluate(NoShadowingOrOverridesOnMethodsRule.java:39)
> :       at
> com.carrotsearch.randomizedtesting.rules.NoShadowingOrOverridesOnMethodsRule$1.evaluate(NoShadowingOrOverridesOnMethodsRule.java:39)
> :       at
> com.carrotsearch.randomizedtesting.rules.StatementAdapter.evaluate(StatementAdapter.java:36)
> :       at
> com.carrotsearch.randomizedtesting.rules.StatementAdapter.evaluate(StatementAdapter.java:36)
> :       at
> com.carrotsearch.randomizedtesting.rules.StatementAdapter.evaluate(StatementAdapter.java:36)
> :       at
> org.apache.lucene.util.TestRuleAssertionsRequired$1.evaluate(TestRuleAssertionsRequired.java:54)
> :       at
> org.apache.lucene.util.TestRuleMarkFailure$1.evaluate(TestRuleMarkFailure.java:48)
> :       at
> org.apache.lucene.util.TestRuleIgnoreAfterMaxFailures$1.evaluate(TestRuleIgnoreAfterMaxFailures.java:65)
> :       at
> org.apache.lucene.util.TestRuleIgnoreTestSuites$1.evaluate(TestRuleIgnoreTestSuites.java:55)
> :       at
> com.carrotsearch.randomizedtesting.rules.StatementAdapter.evaluate(StatementAdapter.java:36)
> :       at
> com.carrotsearch.randomizedtesting.ThreadLeakControl$StatementRunner.run(ThreadLeakControl.java:365)
> :       at java.lang.Thread.run(Thread.java:745)
> : Caused by: org.apache.http.NoHttpResponseException: The target server
> failed to respond
> :       at
> org.apache.http.impl.conn.DefaultHttpResponseParser.parseHead(DefaultHttpResponseParser.java:143)
> :       at
> org.apache.http.impl.conn.DefaultHttpResponseParser.parseHead(DefaultHttpResponseParser.java:57)
> :       at
> org.apache.http.impl.io.AbstractMessageParser.parse(AbstractMessageParser.java:260)
> :       at
> org.apache.http.impl.AbstractHttpClientConnection.receiveResponseHeader(AbstractHttpClientConnection.java:283)
> :       at
> org.apache.http.impl.conn.DefaultClientConnection.receiveResponseHeader(DefaultClientConnection.java:251)
> :       at
> org.apache.http.impl.conn.ManagedClientConnectionImpl.receiveResponseHeader(ManagedClientConnectionImpl.java:197)
> :       at
> org.apache.http.protocol.HttpRequestExecutor.doReceiveResponse(HttpRequestExecutor.java:271)
> :       at
> org.apache.http.protocol.HttpRequestExecutor.execute(HttpRequestExecutor.java:123)
> :       at
> org.apache.http.impl.client.DefaultRequestDirector.tryExecute(DefaultRequestDirector.java:682)
> :       at
> org.apache.http.impl.client.DefaultRequestDirector.execute(DefaultRequestDirector.java:486)
> :       at
> org.apache.http.impl.client.AbstractHttpClient.doExecute(AbstractHttpClient.java:863)
> :       at
> org.apache.http.impl.client.CloseableHttpClient.execute(CloseableHttpClient.java:82)
> :       at
> org.apache.http.impl.client.CloseableHttpClient.execute(CloseableHttpClient.java:106)
> :       at
> org.apache.http.impl.client.CloseableHttpClient.execute(CloseableHttpClient.java:57)
> :       at
> org.apache.solr.client.solrj.impl.HttpSolrClient.executeMethod(HttpSolrClient.java:464)
> :       at
> org.apache.solr.client.solrj.impl.HttpSolrClient.request(HttpSolrClient.java:214)
> :       at
> org.apache.solr.client.solrj.impl.HttpSolrClient.request(HttpSolrClient.java:210)
> :       at
> org.apache.solr.client.solrj.impl.LBHttpSolrClient.doRequest(LBHttpSolrClient.java:370)
> :       at
> org.apache.solr.client.solrj.impl.LBHttpSolrClient.request(LBHttpSolrClient.java:325)
> :       at
> org.apache.solr.client.solrj.impl.CloudSolrClient$2.call(CloudSolrClient.java:546)
> :       at
> org.apache.solr.client.solrj.impl.CloudSolrClient$2.call(CloudSolrClient.java:543)
> :       at java.util.concurrent.FutureTask.run(FutureTask.java:262)
> :       at
> java.util.concurrent.ThreadPoolExecutor.runWorker(ThreadPoolExecutor.java:1145)
> :       at
> java.util.concurrent.ThreadPoolExecutor$Worker.run(ThreadPoolExecutor.java:615)
> :       ... 1 more
> :
> :
> : FAILED:
> junit.framework.TestSuite.org.apache.solr.handler.TestReplicationHandlerBackup
> :
> : Error Message:
> : Could not remove the following files (in the order of attempts):
> C:\Users\JenkinsSlave\workspace\Lucene-Solr-5.x-Windows\solr\build\solr-core\test\J0\temp\solr.handler.TestReplicationHandlerBackup
> 847BA5C67BD44D56-001\solr-instance-002\collection1:
> java.nio.file.DirectoryNotEmptyException:
> C:\Users\JenkinsSlave\workspace\Lucene-Solr-5.x-Windows\solr\build\solr-core\test\J0\temp\solr.handler.TestReplicationHandlerBackup
> 847BA5C67BD44D56-001\solr-instance-002\collection1
> C:\Users\JenkinsSlave\workspace\Lucene-Solr-5.x-Windows\solr\build\solr-core\test\J0\temp\solr.handler.TestReplicationHandlerBackup
> 847BA5C67BD44D56-001\solr-instance-002:
> java.nio.file.DirectoryNotEmptyException:
> C:\Users\JenkinsSlave\workspace\Lucene-Solr-5.x-Windows\solr\build\solr-core\test\J0\temp\solr.handler.TestReplicationHandlerBackup
> 847BA5C67BD44D56-001\solr-instance-002
> C:\Users\JenkinsSlave\workspace\Lucene-Solr-5.x-Windows\solr\build\solr-core\test\J0\temp\solr.handler.TestReplicationHandlerBac
>  kup 847BA5C67BD44D56-001\solr-instance-001\collection1:
> java.nio.file.DirectoryNotEmptyException:
> C:\Users\JenkinsSlave\workspace\Lucene-Solr-5.x-Windows\solr\build\solr-core\test\J0\temp\solr.handler.TestReplicationHandlerBackup
> 847BA5C67BD44D56-001\solr-instance-001\collection1
> C:\Users\JenkinsSlave\workspace\Lucene-Solr-5.x-Windows\solr\build\solr-core\test\J0\temp\solr.handler.TestReplicationHandlerBackup
> 847BA5C67BD44D56-001\solr-instance-001:
> java.nio.file.DirectoryNotEmptyException:
> C:\Users\JenkinsSlave\workspace\Lucene-Solr-5.x-Windows\solr\build\solr-core\test\J0\temp\solr.handler.TestReplicationHandlerBackup
> 847BA5C67BD44D56-001\solr-instance-001
> C:\Users\JenkinsSlave\workspace\Lucene-Solr-5.x-Windows\solr\build\solr-core\test\J0\temp\solr.handler.TestReplicationHandlerBackup
> 847BA5C67BD44D56-001\solr-instance-001\collection1\data:
> java.nio.file.AccessDeniedException:
> C:\Users\JenkinsSlave\workspace\Lucene-Solr-5.x-Windows\solr\build\solr-core\test\J0\temp\solr.hand
>  ler.TestReplicationHandlerBackup
> 847BA5C67BD44D56-001\solr-instance-001\collection1\data
> C:\Users\JenkinsSlave\workspace\Lucene-Solr-5.x-Windows\solr\build\solr-core\test\J0\temp\solr.handler.TestReplicationHandlerBackup
> 847BA5C67BD44D56-001\solr-instance-001:
> java.nio.file.DirectoryNotEmptyException:
> C:\Users\JenkinsSlave\workspace\Lucene-Solr-5.x-Windows\solr\build\solr-core\test\J0\temp\solr.handler.TestReplicationHandlerBackup
> 847BA5C67BD44D56-001\solr-instance-001
> C:\Users\JenkinsSlave\workspace\Lucene-Solr-5.x-Windows\solr\build\solr-core\test\J0\temp\solr.handler.TestReplicationHandlerBackup
> 847BA5C67BD44D56-001\solr-instance-002\collection1\data:
> java.nio.file.AccessDeniedException:
> C:\Users\JenkinsSlave\workspace\Lucene-Solr-5.x-Windows\solr\build\solr-core\test\J0\temp\solr.handler.TestReplicationHandlerBackup
> 847BA5C67BD44D56-001\solr-instance-002\collection1\data
> C:\Users\JenkinsSlave\workspace\Lucene-Solr-5.x-Windows\solr\build\solr-core\test\J0\temp\solr.handl
>  er.TestReplicationHandlerBackup 847BA5C67BD44D56-001\solr-instance-002:
> java.nio..file.DirectoryNotEmptyException:
> C:\Users\JenkinsSlave\workspace\Lucene-Solr-5.x-Windows\solr\build\solr-core\test\J0\temp\solr.handler.TestReplicationHandlerBackup
> 847BA5C67BD44D56-001\solr-instance-002
> C:\Users\JenkinsSlave\workspace\Lucene-Solr-5.x-Windows\solr\build\solr-core\test\J0\temp\solr.handler.TestReplicationHandlerBackup
> 847BA5C67BD44D56-001: java.nio.file.DirectoryNotEmptyException:
> C:\Users\JenkinsSlave\workspace\Lucene-Solr-5.x-Windows\solr\build\solr-core\test\J0\temp\solr.handler.TestReplicationHandlerBackup
> 847BA5C67BD44D56-001
> :
> : Stack Trace:
> : java.io.IOException: Could not remove the following files (in the order
> of attempts):
> :
> C:\Users\JenkinsSlave\workspace\Lucene-Solr-5.x-Windows\solr\build\solr-core\test\J0\temp\solr.handler.TestReplicationHandlerBackup
> 847BA5C67BD44D56-001\solr-instance-002\collection1:
> java.nio.file.DirectoryNotEmptyException:
> C:\Users\JenkinsSlave\workspace\Lucene-Solr-5.x-Windows\solr\build\solr-core\test\J0\temp\solr.handler.TestReplicationHandlerBackup
> 847BA5C67BD44D56-001\solr-instance-002\collection1
> :
> C:\Users\JenkinsSlave\workspace\Lucene-Solr-5.x-Windows\solr\build\solr-core\test\J0\temp\solr.handler.TestReplicationHandlerBackup
> 847BA5C67BD44D56-001\solr-instance-002:
> java.nio.file.DirectoryNotEmptyException:
> C:\Users\JenkinsSlave\workspace\Lucene-Solr-5.x-Windows\solr\build\solr-core\test\J0\temp\solr.handler.TestReplicationHandlerBackup
> 847BA5C67BD44D56-001\solr-instance-002
> :
> C:\Users\JenkinsSlave\workspace\Lucene-Solr-5.x-Windows\solr\build\solr-core\test\J0\temp\solr.handler.TestReplicationHandlerBackup
> 847BA5C67BD44D56-001\solr-instance-001\collection1:
> java.nio.file.DirectoryNotEmptyException:
> C:\Users\JenkinsSlave\workspace\Lucene-Solr-5.x-Windows\solr\build\solr-core\test\J0\temp\solr.handler.TestReplicationHandlerBackup
> 847BA5C67BD44D56-001\solr-instance-001\collection1
> :
> C:\Users\JenkinsSlave\workspace\Lucene-Solr-5.x-Windows\solr\build\solr-core\test\J0\temp\solr.handler.TestReplicationHandlerBackup
> 847BA5C67BD44D56-001\solr-instance-001:
> java.nio.file.DirectoryNotEmptyException:
> C:\Users\JenkinsSlave\workspace\Lucene-Solr-5.x-Windows\solr\build\solr-core\test\J0\temp\solr.handler.TestReplicationHandlerBackup
> 847BA5C67BD44D56-001\solr-instance-001
> :
> C:\Users\JenkinsSlave\workspace\Lucene-Solr-5.x-Windows\solr\build\solr-core\test\J0\temp\solr.handler.TestReplicationHandlerBackup
> 847BA5C67BD44D56-001\solr-instance-001\collection1\data:
> java.nio.file.AccessDeniedException:
> C:\Users\JenkinsSlave\workspace\Lucene-Solr-5.x-Windows\solr\build\solr-core\test\J0\temp\solr.handler.TestReplicationHandlerBackup
> 847BA5C67BD44D56-001\solr-instance-001\collection1\data
> :
> C:\Users\JenkinsSlave\workspace\Lucene-Solr-5.x-Windows\solr\build\solr-core\test\J0\temp\solr.handler.TestReplicationHandlerBackup
> 847BA5C67BD44D56-001\solr-instance-001:
> java.nio.file.DirectoryNotEmptyException:
> C:\Users\JenkinsSlave\workspace\Lucene-Solr-5.x-Windows\solr\build\solr-core\test\J0\temp\solr.handler.TestReplicationHandlerBackup
> 847BA5C67BD44D56-001\solr-instance-001
> :
> C:\Users\JenkinsSlave\workspace\Lucene-Solr-5.x-Windows\solr\build\solr-core\test\J0\temp\solr.handler.TestReplicationHandlerBackup
> 847BA5C67BD44D56-001\solr-instance-002\collection1\data:
> java.nio.file.AccessDeniedException:
> C:\Users\JenkinsSlave\workspace\Lucene-Solr-5.x-Windows\solr\build\solr-core\test\J0\temp\solr.handler.TestReplicationHandlerBackup
> 847BA5C67BD44D56-001\solr-instance-002\collection1\data
> :
> C:\Users\JenkinsSlave\workspace\Lucene-Solr-5.x-Windows\solr\build\solr-core\test\J0\temp\solr.handler.TestReplicationHandlerBackup
> 847BA5C67BD44D56-001\solr-instance-002:
> java.nio.file.DirectoryNotEmptyException:
> C:\Users\JenkinsSlave\workspace\Lucene-Solr-5.x-Windows\solr\build\solr-core\test\J0\temp\solr.handler.TestReplicationHandlerBackup
> 847BA5C67BD44D56-001\solr-instance-002
> :
> C:\Users\JenkinsSlave\workspace\Lucene-Solr-5.x-Windows\solr\build\solr-core\test\J0\temp\solr.handler.TestReplicationHandlerBackup
> 847BA5C67BD44D56-001: java.nio.file.DirectoryNotEmptyException:
> C:\Users\JenkinsSlave\workspace\Lucene-Solr-5.x-Windows\solr\build\solr-core\test\J0\temp\solr.handler.TestReplicationHandlerBackup
> 847BA5C67BD44D56-001
> :
> :       at __randomizedtesting.SeedInfo.seed([847BA5C67BD44D56]:0)
> :       at org.apache.lucene.util.IOUtils.rm(IOUtils.java:294)
> :       at
> org.apache.lucene.util.TestRuleTemporaryFilesCleanup.afterAlways(TestRuleTemporaryFilesCleanup.java:170)
> :       at
> com.carrotsearch.randomizedtesting.rules.TestRuleAdapter$1.afterAlways(TestRuleAdapter.java:31)
> :       at
> com.carrotsearch.randomizedtesting.rules.StatementAdapter.evaluate(StatementAdapter.java:43)
> :       at
> com.carrotsearch.randomizedtesting.rules.StatementAdapter.evaluate(StatementAdapter.java:36)
> :       at
> org.apache.lucene.util.TestRuleAssertionsRequired$1.evaluate(TestRuleAssertionsRequired.java:54)
> :       at
> org.apache.lucene.util.TestRuleMarkFailure$1.evaluate(TestRuleMarkFailure.java:48)
> :       at
> org.apache.lucene.util.TestRuleIgnoreAfterMaxFailures$1.evaluate(TestRuleIgnoreAfterMaxFailures.java:65)
> :       at
> org.apache.lucene.util.TestRuleIgnoreTestSuites$1.evaluate(TestRuleIgnoreTestSuites.java:55)
> :       at
> com.carrotsearch.randomizedtesting.rules.StatementAdapter.evaluate(StatementAdapter.java:36)
> :       at
> com.carrotsearch.randomizedtesting.ThreadLeakControl$StatementRunner.run(ThreadLeakControl.java:365)
> :       at java.lang.Thread.run(Thread.java:745)
> :
> :
> :
> :
> : Build Log:
> : [...truncated 9404 lines...]
> :    [junit4] Suite: org.apache.solr.cloud.ReplicationFactorTest
> :    [junit4]   2> Creating dataDir:
> C:\Users\JenkinsSlave\workspace\Lucene-Solr-5.x-Windows\solr\build\solr-core\test\J0\temp\solr.cloud.ReplicationFactorTest
> 847BA5C67BD44D56-001\init-core-data-001
> :    [junit4]   2> 470526 T1792
> oas.BaseDistributedSearchTestCase.initHostContext Setting hostContext
> system property: /
> :    [junit4]   2> 470532 T1792 oasc.ZkTestServer.run STARTING ZK TEST
> SERVER
> :    [junit4]   1> client port:0.0.0.0/0.0.0.0:0
> :    [junit4]   2> 470533 T1793
> oasc.ZkTestServer$ZKServerMain.runFromConfig Starting server
> :    [junit4]   2> 470657 T1792 oasc.ZkTestServer.run start zk server on
> port:51825
> :    [junit4]   2> 470657 T1792
> oascc.SolrZkClient.createZkCredentialsToAddAutomatically Using default
> ZkCredentialsProvider
> :    [junit4]   2> 470660 T1792 oascc.ConnectionManager.waitForConnected
> Waiting for client to connect to ZooKeeper
> :    [junit4]   2> 470663 T1800 oascc.ConnectionManager.process Watcher
> org.apache.solr.common.cloud.ConnectionManager@b3e322
> name:ZooKeeperConnection Watcher:127.0.0.1:51825 got event WatchedEvent
> state:SyncConnected type:None path:null path:null type:None
> :    [junit4]   2> 470665 T1792 oascc.ConnectionManager.waitForConnected
> Client is connected to ZooKeeper
> :    [junit4]   2> 470665 T1792 oascc.SolrZkClient.createZkACLProvider
> Using default ZkACLProvider
> :    [junit4]   2> 470665 T1792 oascc.SolrZkClient.makePath makePath: /solr
> :    [junit4]   2> 470672 T1792
> oascc.SolrZkClient.createZkCredentialsToAddAutomatically Using default
> ZkCredentialsProvider
> :    [junit4]   2> 470674 T1792 oascc.ConnectionManager.waitForConnected
> Waiting for client to connect to ZooKeeper
> :    [junit4]   2> 470676 T1803 oascc.ConnectionManager.process Watcher
> org.apache.solr.common.cloud.ConnectionManager@e43f50
> name:ZooKeeperConnection Watcher:127.0.0.1:51825/solr got event
> WatchedEvent state:SyncConnected type:None path:null path:null type:None
> :    [junit4]   2> 470677 T1792 oascc.ConnectionManager.waitForConnected
> Client is connected to ZooKeeper
> :    [junit4]   2> 470677 T1792 oascc.SolrZkClient.createZkACLProvider
> Using default ZkACLProvider
> :    [junit4]   2> 470677 T1792 oascc.SolrZkClient.makePath makePath:
> /collections/collection1
> :    [junit4]   2> 470682 T1792 oascc.SolrZkClient.makePath makePath:
> /collections/collection1/shards
> :    [junit4]   2> 470685 T1792 oascc.SolrZkClient.makePath makePath:
> /collections/control_collection
> :    [junit4]   2> 470689 T1792 oascc.SolrZkClient.makePath makePath:
> /collections/control_collection/shards
> :    [junit4]   2> 470691 T1792 oasc.AbstractZkTestCase.putConfig put
> C:\Users\JenkinsSlave\workspace\Lucene-Solr-5.x-Windows\solr\core\src\test-files\solr\collection1\conf\solrconfig-tlog.xml
> to /configs/conf1/solrconfig.xml
> :    [junit4]   2> 470691 T1792 oascc.SolrZkClient.makePath makePath:
> /configs/conf1/solrconfig.xml
> :    [junit4]   2> 470699 T1792 oasc.AbstractZkTestCase.putConfig put
> C:\Users\JenkinsSlave\workspace\Lucene-Solr-5.x-Windows\solr\core\src\test-files\solr\collection1\conf\schema.xml
> to /configs/conf1/schema.xml
> :    [junit4]   2> 470699 T1792 oascc.SolrZkClient.makePath makePath:
> /configs/conf1/schema.xml
> :    [junit4]   2> 470704 T1792 oasc.AbstractZkTestCase.putConfig put
> C:\Users\JenkinsSlave\workspace\Lucene-Solr-5.x-Windows\solr\core\src\test-files\solr\collection1\conf\solrconfig.snippet.randomindexconfig.xml
> to /configs/conf1/solrconfig.snippet.randomindexconfig.xml
> :    [junit4]   2> 470704 T1792 oascc.SolrZkClient.makePath makePath:
> /configs/conf1/solrconfig.snippet.randomindexconfig.xml
> :    [junit4]   2> 470708 T1792 oasc.AbstractZkTestCase.putConfig put
> C:\Users\JenkinsSlave\workspace\Lucene-Solr-5.x-Windows\solr\core\src\test-files\solr\collection1\conf\stopwords.txt
> to /configs/conf1/stopwords.txt
> :    [junit4]   2> 470708 T1792 oascc.SolrZkClient.makePath makePath:
> /configs/conf1/stopwords.txt
> :    [junit4]   2> 470714 T1792 oasc.AbstractZkTestCase.putConfig put
> C:\Users\JenkinsSlave\workspace\Lucene-Solr-5.x-Windows\solr\core\src\test-files\solr\collection1\conf\protwords.txt
> to /configs/conf1/protwords.txt
> :    [junit4]   2> 470714 T1792 oascc.SolrZkClient.makePath makePath:
> /configs/conf1/protwords.txt
> :    [junit4]   2> 470718 T1792 oasc.AbstractZkTestCase.putConfig put
> C:\Users\JenkinsSlave\workspace\Lucene-Solr-5.x-Windows\solr\core\src\test-files\solr\collection1\conf\currency.xml
> to /configs/conf1/currency.xml
> :    [junit4]   2> 470718 T1792 oascc.SolrZkClient.makePath makePath:
> /configs/conf1/currency.xml
> :    [junit4]   2> 470723 T1792 oasc.AbstractZkTestCase.putConfig put
> C:\Users\JenkinsSlave\workspace\Lucene-Solr-5.x-Windows\solr\core\src\test-files\solr\collection1\conf\enumsConfig.xml
> to /configs/conf1/enumsConfig.xml
> :    [junit4]   2> 470723 T1792 oascc.SolrZkClient.makePath makePath:
> /configs/conf1/enumsConfig.xml
> :    [junit4]   2> 470729 T1792 oasc.AbstractZkTestCase.putConfig put
> C:\Users\JenkinsSlave\workspace\Lucene-Solr-5.x-Windows\solr\core\src\test-files\solr\collection1\conf\open-exchange-rates.json
> to /configs/conf1/open-exchange-rates.json
> :    [junit4]   2> 470729 T1792 oascc.SolrZkClient.makePath makePath:
> /configs/conf1/open-exchange-rates.json
> :    [junit4]   2> 470733 T1792 oasc.AbstractZkTestCase.putConfig put
> C:\Users\JenkinsSlave\workspace\Lucene-Solr-5.x-Windows\solr\core\src\test-files\solr\collection1\conf\mapping-ISOLatin1Accent.txt
> to /configs/conf1/mapping-ISOLatin1Accent.txt
> :    [junit4]   2> 470733 T1792 oascc.SolrZkClient.makePath makePath:
> /configs/conf1/mapping-ISOLatin1Accent.txt
> :    [junit4]   2> 470738 T1792 oasc.AbstractZkTestCase.putConfig put
> C:\Users\JenkinsSlave\workspace\Lucene-Solr-5.x-Windows\solr\core\src\test-files\solr\collection1\conf\old_synonyms.txt
> to /configs/conf1/old_synonyms.txt
> :    [junit4]   2> 470738 T1792 oascc.SolrZkClient.makePath makePath:
> /configs/conf1/old_synonyms.txt
> :    [junit4]   2> 470742 T1792 oasc.AbstractZkTestCase.putConfig put
> C:\Users\JenkinsSlave\workspace\Lucene-Solr-5.x-Windows\solr\core\src\test-files\solr\collection1\conf\synonyms.txt
> to /configs/conf1/synonyms.txt
> :    [junit4]   2> 470742 T1792 oascc.SolrZkClient.makePath makePath:
> /configs/conf1/synonyms.txt
> :    [junit4]   2> 472384 T1792 oas.SolrTestCaseJ4.writeCoreProperties
> Writing core.properties file to
> C:\Users\JenkinsSlave\workspace\Lucene-Solr-5.x-Windows\solr\build\solr-core\test\J0\temp\solr.cloud.ReplicationFactorTest
> 847BA5C67BD44D56-001\control-001\cores\collection1
> :    [junit4]   2> 472388 T1792 oejs.Server.doStart jetty-8.1.10.v20130312
> :    [junit4]   2> 472395 T1792 oejs.AbstractConnector.doStart Started
> SelectChannelConnector@127.0.0.1:51833
> :    [junit4]   2> 472395 T1792 oass.SolrDispatchFilter.init
> SolrDispatchFilter.init()sun.misc.Launcher$AppClassLoader@1b8737f
> :    [junit4]   2> 472396 T1792 oasc.SolrResourceLoader.locateSolrHome
> JNDI not configured for solr (NoInitialContextEx)
> :    [junit4]   2> 472396 T1792 oasc.SolrResourceLoader.locateSolrHome
> using system property solr.solr.home:
> C:\Users\JenkinsSlave\workspace\Lucene-Solr-5.x-Windows\solr\build\solr-core\test\J0\temp\solr.cloud.ReplicationFactorTest
> 847BA5C67BD44D56-001\control-001
> :    [junit4]   2> 472396 T1792 oasc.SolrResourceLoader.<init> new
> SolrResourceLoader for directory:
> 'C:\Users\JenkinsSlave\workspace\Lucene-Solr-5.x-Windows\solr\build\solr-core\test\J0\temp\solr.cloud.ReplicationFactorTest
> 847BA5C67BD44D56-001\control-001\'
> :    [junit4]   2> 472432 T1792 oasc.ConfigSolr.fromFile Loading container
> configuration from
> C:\Users\JenkinsSlave\workspace\Lucene-Solr-5.x-Windows\solr\build\solr-core\test\J0\temp\solr.cloud.ReplicationFactorTest
> 847BA5C67BD44D56-001\control-001\solr.xml
> :    [junit4]   2> 472462 T1792 oasc.CorePropertiesLocator.<init>
> Config-defined core root directory:
> C:\Users\JenkinsSlave\workspace\Lucene-Solr-5.x-Windows\solr\build\solr-core\test\J0\temp\solr.cloud.ReplicationFactorTest
> 847BA5C67BD44D56-001\control-001\cores
> :    [junit4]   2> 472462 T1792 oasc.CoreContainer.<init> New
> CoreContainer 25927851
> :    [junit4]   2> 472463 T1792 oasc.CoreContainer.load Loading cores into
> CoreContainer
> [instanceDir=C:\Users\JenkinsSlave\workspace\Lucene-Solr-5.x-Windows\solr\build\solr-core\test\J0\temp\solr.cloud.ReplicationFactorTest
> 847BA5C67BD44D56-001\control-001\]
> :    [junit4]   2> 472464 T1792 oashc.HttpShardHandlerFactory.getParameter
> Setting socketTimeout to: 90000
> :    [junit4]   2> 472464 T1792 oashc.HttpShardHandlerFactory.getParameter
> Setting urlScheme to:
> :    [junit4]   2> 472464 T1792 oashc.HttpShardHandlerFactory.getParameter
> Setting connTimeout to: 15000
> :    [junit4]   2> 472465 T1792 oashc.HttpShardHandlerFactory.getParameter
> Setting maxConnectionsPerHost to: 20
> :    [junit4]   2> 472465 T1792 oashc.HttpShardHandlerFactory.getParameter
> Setting maxConnections to: 10000
> :    [junit4]   2> 472465 T1792 oashc.HttpShardHandlerFactory.getParameter
> Setting corePoolSize to: 0
> :    [junit4]   2> 472465 T1792 oashc.HttpShardHandlerFactory.getParameter
> Setting maximumPoolSize to: 2147483647
> :    [junit4]   2> 472465 T1792 oashc.HttpShardHandlerFactory.getParameter
> Setting maxThreadIdleTime to: 5
> :    [junit4]   2> 472465 T1792 oashc.HttpShardHandlerFactory.getParameter
> Setting sizeOfQueue to: -1
> :    [junit4]   2> 472465 T1792 oashc.HttpShardHandlerFactory.getParameter
> Setting fairnessPolicy to: false
> :    [junit4]   2> 472465 T1792 oashc.HttpShardHandlerFactory.getParameter
> Setting useRetries to: false
> :    [junit4]   2> 472465 T1792 oasu.UpdateShardHandler.<init> Creating
> UpdateShardHandler HTTP client with params:
> socketTimeout=340000&connTimeout=45000&retry=true
> :    [junit4]   2> 472466 T1792 oasl.LogWatcher.createWatcher SLF4J impl
> is org.slf4j.impl.Log4jLoggerFactory
> :    [junit4]   2> 472466 T1792 oasl.LogWatcher.newRegisteredLogWatcher
> Registering Log Listener [Log4j (org.slf4j.impl.Log4jLoggerFactory)]
> :    [junit4]   2> 472466 T1792 oasc.CoreContainer.load Host Name:
> 127.0.0.1
> :    [junit4]   2> 472466 T1792 oasc.ZkContainer.initZooKeeper Zookeeper
> client=127.0.0.1:51825/solr
> :    [junit4]   2> 472466 T1792 oasc.ZkController.checkChrootPath zkHost
> includes chroot
> :    [junit4]   2> 472466 T1792
> oascc.SolrZkClient.createZkCredentialsToAddAutomatically Using default
> ZkCredentialsProvider
> :    [junit4]   2> 472469 T1792 oascc.ConnectionManager.waitForConnected
> Waiting for client to connect to ZooKeeper
> :    [junit4]   2> 472472 T1815 oascc.ConnectionManager.process Watcher
> org.apache.solr.common.cloud.ConnectionManager@1679953
> name:ZooKeeperConnection Watcher:127.0.0.1:51825 got event WatchedEvent
> state:SyncConnected type:None path:null path:null type:None
> :    [junit4]   2> 472473 T1792 oascc.ConnectionManager.waitForConnected
> Client is connected to ZooKeeper
> :    [junit4]   2> 472474 T1792 oascc.SolrZkClient.createZkACLProvider
> Using default ZkACLProvider
> :    [junit4]   2> 472478 T1792 oascc.ConnectionManager.waitForConnected
> Waiting for client to connect to ZooKeeper
> :    [junit4]   2> 472482 T1818 oascc.ConnectionManager.process Watcher
> org.apache.solr.common.cloud.ConnectionManager@9b99ac
> name:ZooKeeperConnection Watcher:127.0.0.1:51825/solr got event
> WatchedEvent state:SyncConnected type:None path:null path:null type:None
> :    [junit4]   2> 472482 T1792 oascc.ConnectionManager.waitForConnected
> Client is connected to ZooKeeper
> :    [junit4]   2> 472484 T1792 oascc.SolrZkClient.makePath makePath:
> /overseer/queue
> :    [junit4]   2> 472488 T1792 oascc.SolrZkClient.makePath makePath:
> /overseer/collection-queue-work
> :    [junit4]   2> 472491 T1792 oascc.SolrZkClient.makePath makePath:
> /overseer/collection-map-running
> :    [junit4]   2> 472496 T1792 oascc.SolrZkClient.makePath makePath:
> /overseer/collection-map-completed
> :    [junit4]   2> 472500 T1792 oascc.SolrZkClient.makePath makePath:
> /overseer/collection-map-failure
> :    [junit4]   2> 472503 T1792 oascc.SolrZkClient.makePath makePath:
> /live_nodes
> :    [junit4]   2> 472506 T1792 oasc.ZkController.createEphemeralLiveNode
> Register node as live in ZooKeeper:/live_nodes/127.0.0.1:51832_
> :    [junit4]   2> 472507 T1792 oascc.SolrZkClient.makePath makePath:
> /live_nodes/127.0.0.1:51832_
> :    [junit4]   2> 472511 T1792 oascc.SolrZkClient.makePath makePath:
> /overseer_elect
> :    [junit4]   2> 472513 T1792 oascc.SolrZkClient.makePath makePath:
> /overseer_elect/election
> :    [junit4]   2> 472517 T1792 oasc.Overseer.close Overseer (id=null)
> closing
> :    [junit4]   2> 472519 T1792
> oasc.OverseerElectionContext.runLeaderProcess I am going to be the leader
> 127.0.0.1:51832_
> :    [junit4]   2> 472519 T1792 oascc.SolrZkClient.makePath makePath:
> /overseer_elect/leader
> :    [junit4]   2> 472522 T1792 oasc.Overseer.start Overseer
> (id=93337346405564419-127.0.0.1:51832_-n_0000000000) starting
> :    [junit4]   2> 472525 T1792 oascc.SolrZkClient.makePath makePath:
> /overseer/queue-work
> :    [junit4]   2> 472537 T1792
> oasc.OverseerAutoReplicaFailoverThread.<init> Starting
> OverseerAutoReplicaFailoverThread autoReplicaFailoverWorkLoopDelay=10000
> autoReplicaFailoverWaitAfterExpiration=30000
> autoReplicaFailoverBadNodeExpiration=60000
> :    [junit4]   2> 472538 T1820 oasc.OverseerCollectionProcessor.run
> Process current queue of collection creations
> :    [junit4]   2> 472538 T1792 oascc.SolrZkClient.makePath makePath:
> /clusterstate.json
> :    [junit4]   2> 472540 T1819 oasc.Overseer$ClusterStateUpdater.run
> Starting to work on the main queue
> :    [junit4]   2> 472543 T1792 oascc.SolrZkClient.makePath makePath:
> /aliases.json
> :    [junit4]   2> 472545 T1792
> oascc.ZkStateReader.createClusterStateWatchersAndUpdate Updating cluster
> state from ZooKeeper...
> :    [junit4]   2> 472551 T1792 oasc.CorePropertiesLocator.discover
> Looking for core definitions underneath
> C:\Users\JenkinsSlave\workspace\Lucene-Solr-5.x-Windows\solr\build\solr-core\test\J0\temp\solr.cloud.ReplicationFactorTest
> 847BA5C67BD44D56-001\control-001\cores
> :    [junit4]   2> 472553 T1792 oasc.CorePropertiesLocator.discoverUnder
> Found core collection1 in
> C:\Users\JenkinsSlave\workspace\Lucene-Solr-5.x-Windows\solr\build\solr-core\test\J0\temp\solr.cloud.ReplicationFactorTest
> 847BA5C67BD44D56-001\control-001\cores\collection1\
> :    [junit4]   2> 472553 T1792 oasc.CorePropertiesLocator.discover Found
> 1 core definitions
> :    [junit4]   2> 472555 T1822 oasc.ZkController.publish publishing
> core=collection1 state=down collection=control_collection
> :    [junit4]   2> 472555 T1822 oasc.ZkController.publish numShards not
> found on descriptor - reading it from system property
> :    [junit4]   2> 472556 T1818 oasc.DistributedQueue$LatchWatcher.process
> NodeChildrenChanged fired on path /overseer/queue state SyncConnected
> :    [junit4]   2> 472556 T1822 oasc.ZkController.waitForCoreNodeName look
> for our core node name
> :    [junit4]   2> 472557 T1819 oasc.Overseer$ClusterStateUpdater.run
> processMessage: queueSize: 1, message = {
> :    [junit4]   2>        "roles":null,
> :    [junit4]   2>        "numShards":"1",
> :    [junit4]   2>        "operation":"state",
> :    [junit4]   2>        "collection":"control_collection",
> :    [junit4]   2>        "core":"collection1",
> :    [junit4]   2>        "node_name":"127.0.0.1:51832_",
> :    [junit4]   2>        "base_url":"http://127.0.0.1:51832",
> :    [junit4]   2>        "shard":null,
> :    [junit4]   2>        "state":"down"} current state version: 0
> :    [junit4]   2> 472558 T1819 oasco.ReplicaMutator.updateState Update
> state numShards=1 message={
> :    [junit4]   2>        "roles":null,
> :    [junit4]   2>        "numShards":"1",
> :    [junit4]   2>        "operation":"state",
> :    [junit4]   2>        "collection":"control_collection",
> :    [junit4]   2>        "core":"collection1",
> :    [junit4]   2>        "node_name":"127.0.0.1:51832_",
> :    [junit4]   2>        "base_url":"http://127.0.0.1:51832",
> :    [junit4]   2>        "shard":null,
> :    [junit4]   2>        "state":"down"}
> :    [junit4]   2> 472558 T1819 oasco.ClusterStateMutator.createCollection
> building a new cName: control_collection
> :    [junit4]   2> 472558 T1819 oasco.ReplicaMutator.updateState Assigning
> new node to shard shard=shard1
> :    [junit4]   2> 472560 T1818 oascc.ZkStateReader$2.process A cluster
> state change: WatchedEvent state:SyncConnected type:NodeDataChanged
> path:/clusterstate.json, has occurred - updating... (live nodes size: 1)
> :    [junit4]   2> 473678 T1822 oasc.ZkController.waitForShardId waiting
> to find shard id in clusterstate for collection1
> :    [junit4]   2> 473678 T1822 oasc.ZkController.createCollectionZkNode
> Check for collection zkNode:control_collection
> :    [junit4]   2> 473679 T1822 oasc.ZkController.createCollectionZkNode
> Collection zkNode exists
> :    [junit4]   2> 473679 T1822 oascc.ZkStateReader.readConfigName Load
> collection config from:/collections/control_collection
> :    [junit4]   2> 473681 T1822 oascc.ZkStateReader.readConfigName
> path=/collections/control_collection configName=conf1 specified config
> exists in ZooKeeper
> :    [junit4]   2> 473681 T1822 oasc.SolrResourceLoader.<init> new
> SolrResourceLoader for directory:
> 'C:\Users\JenkinsSlave\workspace\Lucene-Solr-5.x-Windows\solr\build\solr-core\test\J0\temp\solr.cloud.ReplicationFactorTest
> 847BA5C67BD44D56-001\control-001\cores\collection1\'
> :    [junit4]   2> 473704 T1822 oasc.ZkController.watchZKConfDir watch
> zkdir /configs/conf1
> :    [junit4]   2> 473709 T1822 oasc.Config.<init> loaded config
> solrconfig.xml with version 0
> :    [junit4]   2> 473722 T1822 oasc.SolrConfig.refreshRequestParams
> current version of requestparams : -1
> :    [junit4]   2> 473751 T1822 oasc.SolrConfig.<init> Using Lucene
> MatchVersion: 5.1.0
> :    [junit4]   2> 473807 T1822 oasc.SolrConfig.<init> Loaded SolrConfig:
> solrconfig.xml
> :    [junit4]   2> 473828 T1822 oass.IndexSchema.readSchema Reading Solr
> Schema from /configs/conf1/schema.xml
> :    [junit4]   2> 473839 T1822 oass.IndexSchema.readSchema [collection1]
> Schema name=test
> :    [junit4]   2> 474289 T1822 oass.OpenExchangeRatesOrgProvider.init
> Initialized with rates=open-exchange-rates.json, refreshInterval=1440.
> :    [junit4]   2> 474298 T1822 oass.IndexSchema.readSchema default search
> field in schema is text
> :    [junit4]   2> 474301 T1822 oass.IndexSchema.readSchema unique key
> field: id
> :    [junit4]   2> 474319 T1822 oass.FileExchangeRateProvider.reload
> Reloading exchange rates from file currency.xml
> :    [junit4]   2> 474324 T1822 oass.FileExchangeRateProvider.reload
> Reloading exchange rates from file currency.xml
> :    [junit4]   2> 474330 T1822 oass.OpenExchangeRatesOrgProvider.reload
> Reloading exchange rates from open-exchange-rates.json
> :    [junit4]   2> 474331 T1822
> oass.OpenExchangeRatesOrgProvider$OpenExchangeRates.<init> WARN Unknown key
> IMPORTANT NOTE
> :    [junit4]   2> 474332 T1822
> oass.OpenExchangeRatesOrgProvider$OpenExchangeRates.<init> WARN Expected
> key, got STRING
> :    [junit4]   2> 474332 T1822 oass.OpenExchangeRatesOrgProvider.reload
> Reloading exchange rates from open-exchange-rates.json
> :    [junit4]   2> 474333 T1822
> oass.OpenExchangeRatesOrgProvider$OpenExchangeRates.<init> WARN Unknown key
> IMPORTANT NOTE
> :    [junit4]   2> 474333 T1822
> oass.OpenExchangeRatesOrgProvider$OpenExchangeRates.<init> WARN Expected
> key, got STRING
> :    [junit4]   2> 474333 T1822 oasc.CoreContainer.create Creating
> SolrCore 'collection1' using configuration from collection
> control_collection
> :    [junit4]   2> 474333 T1822 oasc.SolrCore.initDirectoryFactory
> org.apache.solr.core.MockDirectoryFactory
> :    [junit4]   2> 474334 T1822 oasc.SolrCore.<init> [collection1] Opening
> new SolrCore at
> C:\Users\JenkinsSlave\workspace\Lucene-Solr-5.x-Windows\solr\build\solr-core\test\J0\temp\solr.cloud.ReplicationFactorTest
> 847BA5C67BD44D56-001\control-001\cores\collection1\,
> dataDir=C:\Users\JenkinsSlave\workspace\Lucene-Solr-5.x-Windows\solr\build\solr-core\test\J0\temp\solr.cloud.ReplicationFactorTest
> 847BA5C67BD44D56-001\tempDir-001/control/data\
> :    [junit4]   2> 474335 T1822 oasc.JmxMonitoredMap.<init> JMX monitoring
> is enabled. Adding Solr mbeans to JMX Server:
> com.sun.jmx.mbeanserver.JmxMBeanServer@b1cfa4
> :    [junit4]   2> 474335 T1822 oasc.CachingDirectoryFactory.get return
> new directory for
> C:\Users\JenkinsSlave\workspace\Lucene-Solr-5.x-Windows\solr\build\solr-core\test\J0\temp\solr.cloud.ReplicationFactorTest
> 847BA5C67BD44D56-001\tempDir-001/control/data\
> :    [junit4]   2> 474335 T1822 oasc.SolrCore.getNewIndexDir New index
> directory detected: old=null
> new=C:\Users\JenkinsSlave\workspace\Lucene-Solr-5.x-Windows\solr\build\solr-core\test\J0\temp\solr.cloud.ReplicationFactorTest
> 847BA5C67BD44D56-001\tempDir-001/control/data\index/
> :    [junit4]   2> 474335 T1822 oasc.SolrCore.initIndex WARN [collection1]
> Solr index directory
> 'C:\Users\JenkinsSlave\workspace\Lucene-Solr-5.x-Windows\solr\build\solr-core\test\J0\temp\solr.cloud.ReplicationFactorTest
> 847BA5C67BD44D56-001\tempDir-001\control\data\index' doesn't exist.
> Creating new index...
> :    [junit4]   2> 474336 T1822 oasc.CachingDirectoryFactory.get return
> new directory for
> C:\Users\JenkinsSlave\workspace\Lucene-Solr-5.x-Windows\solr\build\solr-core\test\J0\temp\solr.cloud.ReplicationFactorTest
> 847BA5C67BD44D56-001\tempDir-001/control/data\index
> :    [junit4]   2> 474336 T1822 oasu.RandomMergePolicy.<init>
> RandomMergePolicy wrapping class
> org.apache.lucene.index.AlcoholicMergePolicy: [AlcoholicMergePolicy:
> minMergeSize=0, mergeFactor=10, maxMergeSize=39238125,
> maxMergeSizeForForcedMerge=9223372036854775807,
> calibrateSizeByDeletes=true, maxMergeDocs=2147483647,
> maxCFSSegmentSizeMB=8.796093022207999E12, noCFSRatio=0.1]
> :    [junit4]   2> 474337 T1822 oasc.SolrDeletionPolicy.onCommit
> SolrDeletionPolicy.onCommit: commits: num=1
> :    [junit4]   2>
> commit{dir=MockDirectoryWrapper(RAMDirectory@17c0d68
> lockFactory=org.apache.lucene.store.SingleInstanceLockFactory@1545bec
> ),segFN=segments_1,generation=1}
> :    [junit4]   2> 474337 T1822 oasc.SolrDeletionPolicy.updateCommits
> newest commit generation = 1
> :    [junit4]   2> 474341 T1822 oasup.UpdateRequestProcessorChain.init
> creating updateRequestProcessorChain "nodistrib"
> :    [junit4]   2> 474342 T1822 oasup.UpdateRequestProcessorChain.init
> creating updateRequestProcessorChain "dedupe"
> :    [junit4]   2> 474342 T1822 oasup.UpdateRequestProcessorChain.init
> inserting DistributedUpdateProcessorFactory into
> updateRequestProcessorChain "dedupe"
> :    [junit4]   2> 474342 T1822 oasup.UpdateRequestProcessorChain.init
> creating updateRequestProcessorChain "stored_sig"
> :    [junit4]   2> 474342 T1822 oasup.UpdateRequestProcessorChain.init
> inserting DistributedUpdateProcessorFactory into
> updateRequestProcessorChain "stored_sig"
> :    [junit4]   2> 474342 T1822 oasup.UpdateRequestProcessorChain.init
> creating updateRequestProcessorChain "distrib-dup-test-chain-explicit"
> :    [junit4]   2> 474343 T1822 oasup.UpdateRequestProcessorChain.init
> creating updateRequestProcessorChain "distrib-dup-test-chain-implicit"
> :    [junit4]   2> 474343 T1822 oasup.UpdateRequestProcessorChain.init
> inserting DistributedUpdateProcessorFactory into
> updateRequestProcessorChain "distrib-dup-test-chain-implicit"
> :    [junit4]   2> 474343 T1822 oasc.SolrCore.loadUpdateProcessorChains no
> updateRequestProcessorChain defined as default, creating implicit default
> :    [junit4]   2> 474344 T1822
> oasc.RequestHandlers.initHandlersFromConfig created /update:
> org.apache.solr.handler.UpdateRequestHandler
> :    [junit4]   2> 474344 T1822
> oasc.RequestHandlers.initHandlersFromConfig created /update/json:
> org.apache.solr.handler.UpdateRequestHandler
> :    [junit4]   2> 474345 T1822
> oasc.RequestHandlers.initHandlersFromConfig created /update/csv:
> org.apache.solr.handler.UpdateRequestHandler
> :    [junit4]   2> 474345 T1822
> oasc.RequestHandlers.initHandlersFromConfig created /update/json/docs:
> org.apache.solr.handler.UpdateRequestHandler
> :    [junit4]   2> 474345 T1822
> oasc.RequestHandlers.initHandlersFromConfig created /config:
> org.apache.solr.handler.SolrConfigHandler
> :    [junit4]   2> 474347 T1822
> oasc.RequestHandlers.initHandlersFromConfig created /schema:
> org.apache.solr.handler.SchemaHandler
> :    [junit4]   2> 474347 T1822
> oasc.RequestHandlers.initHandlersFromConfig created /replication:
> org.apache.solr.handler.ReplicationHandler
> :    [junit4]   2> 474347 T1822
> oasc.RequestHandlers.initHandlersFromConfig created /get:
> org.apache.solr.handler.RealTimeGetHandler
> :    [junit4]   2> 474348 T1822
> oasc.RequestHandlers.initHandlersFromConfig created /admin/luke:
> org.apache.solr.handler.admin.LukeRequestHandler
> :    [junit4]   2> 474351 T1822
> oasc.RequestHandlers.initHandlersFromConfig created /admin/system:
> org.apache.solr.handler.admin.SystemInfoHandler
> :    [junit4]   2> 474352 T1822
> oasc.RequestHandlers.initHandlersFromConfig created /admin/mbeans:
> org.apache.solr.handler.admin.SolrInfoMBeanHandler
> :    [junit4]   2> 474352 T1822
> oasc.RequestHandlers.initHandlersFromConfig created /admin/plugins:
> org.apache.solr.handler.admin.PluginInfoHandler
> :    [junit4]   2> 474353 T1822
> oasc.RequestHandlers.initHandlersFromConfig created /admin/threads:
> org.apache.solr.handler.admin.ThreadDumpHandler
> :    [junit4]   2> 474353 T1822
> oasc.RequestHandlers.initHandlersFromConfig created /admin/properties:
> org.apache.solr.handler.admin.PropertiesRequestHandler
> :    [junit4]   2> 474354 T1822
> oasc.RequestHandlers.initHandlersFromConfig created /admin/logging:
> org.apache.solr.handler.admin.LoggingHandler
> :    [junit4]   2> 474354 T1822
> oasc.RequestHandlers.initHandlersFromConfig created /admin/file:
> solr.admin.ShowFileRequestHandler
> :    [junit4]   2> 474355 T1822
> oasc.RequestHandlers.initHandlersFromConfig created /admin/ping:
> org.apache.solr.handler.PingRequestHandler
> :    [junit4]   2> 474355 T1822
> oasc.RequestHandlers.initHandlersFromConfig created standard:
> solr.StandardRequestHandler
> :    [junit4]   2> 474364 T1822 oashl.XMLLoader.init
> xsltCacheLifetimeSeconds=60
> :    [junit4]   2> 474366 T1822 oashl.XMLLoader.init
> xsltCacheLifetimeSeconds=60
> :    [junit4]   2> 474368 T1822 oashl.XMLLoader.init
> xsltCacheLifetimeSeconds=60
> :    [junit4]   2> 474369 T1822 oashl.XMLLoader.init
> xsltCacheLifetimeSeconds=60
> :    [junit4]   2> 474373 T1822 oasc.SolrCore.initStatsCache Using default
> statsCache cache: org.apache.solr.search.stats.LocalStatsCache
> :    [junit4]   2> 474376 T1822 oasu.CommitTracker.<init> Hard AutoCommit:
> disabled
> :    [junit4]   2> 474376 T1822 oasu.CommitTracker.<init> Soft AutoCommit:
> disabled
> :    [junit4]   2> 474377 T1822 oasu.RandomMergePolicy.<init>
> RandomMergePolicy wrapping class
> org.apache.lucene.index.AlcoholicMergePolicy: [AlcoholicMergePolicy:
> minMergeSize=0, mergeFactor=10, maxMergeSize=1610259160,
> maxMergeSizeForForcedMerge=9223372036854775807,
> calibrateSizeByDeletes=true, maxMergeDocs=2147483647,
> maxCFSSegmentSizeMB=8.796093022207999E12, noCFSRatio=0.1]
> :    [junit4]   2> 474377 T1822 oasc.SolrDeletionPolicy.onInit
> SolrDeletionPolicy.onInit: commits: num=1
> :    [junit4]   2>
> commit{dir=MockDirectoryWrapper(RAMDirectory@17c0d68
> lockFactory=org.apache.lucene.store.SingleInstanceLockFactory@1545bec
> ),segFN=segments_1,generation=1}
> :    [junit4]   2> 474377 T1822 oasc.SolrDeletionPolicy.updateCommits
> newest commit generation = 1
> :    [junit4]   2> 474378 T1822 oass.SolrIndexSearcher.<init> Opening
> Searcher@1aca407[collection1] main
> :    [junit4]   2> 474378 T1822 oascc.ZkStateReader.readConfigName Load
> collection config from:/collections/control_collection
> :    [junit4]   2> 474380 T1822 oascc.ZkStateReader.readConfigName
> path=/collections/control_collection configName=conf1 specified config
> exists in ZooKeeper
> :    [junit4]   2> 474380 T1822 oasr.ManagedResourceStorage.newStorageIO
> Setting up ZooKeeper-based storage for the RestManager with znodeBase:
> /configs/conf1
> :    [junit4]   2> 474381 T1822
> oasr.ManagedResourceStorage$ZooKeeperStorageIO.configure Configured
> ZooKeeperStorageIO with znodeBase: /configs/conf1
> :    [junit4]   2> 474381 T1822 oasr.RestManager.init Initializing
> RestManager with initArgs: {}
> :    [junit4]   2> 474381 T1822 oasr.ManagedResourceStorage.load Reading
> _rest_managed.json using ZooKeeperStorageIO:path=/configs/conf1
> :    [junit4]   2> 474382 T1822
> oasr.ManagedResourceStorage$ZooKeeperStorageIO.openInputStream No data
> found for znode /configs/conf1/_rest_managed.json
> :    [junit4]   2> 474382 T1822 oasr.ManagedResourceStorage.load Loaded
> null at path _rest_managed.json using ZooKeeperStorageIO:path=/configs/conf1
> :    [junit4]   2> 474382 T1822 oasr.RestManager.init Initializing 0
> registered ManagedResources
> :    [junit4]   2> 474382 T1822 oash.ReplicationHandler.inform Commits
> will be reserved for  10000
> :    [junit4]   2> 474383 T1822 oasc.CoreContainer.registerCore
> registering core: collection1
> :    [junit4]   2> 474383 T1823 oasc.SolrCore.registerSearcher
> [collection1] Registered new searcher Searcher@1aca407[collection1]
> main{ExitableDirectoryReader(UninvertingDirectoryReader())}
> :    [junit4]   2> 474385 T1826 oasc.ZkController.register Register
> replica - core:collection1 address:http://127.0.0.1:51832
> collection:control_collection shard:shard1
> :    [junit4]   2> 474386 T1792 oass.SolrDispatchFilter.init
> user.dir=C:\Users\JenkinsSlave\workspace\Lucene-Solr-5.x-Windows\solr\build\solr-core\test\J0
> :    [junit4]   2> 474386 T1792 oass.SolrDispatchFilter.init
> SolrDispatchFilter.init() done
> :    [junit4]   2> 474387 T1792
> oascc.SolrZkClient.createZkCredentialsToAddAutomatically Using default
> ZkCredentialsProvider
> :    [junit4]   2> 474387 T1826 oascc.SolrZkClient.makePath makePath:
> /collections/control_collection/leader_elect/shard1/election
> :    [junit4]   2> 474388 T1792 oascc.ConnectionManager.waitForConnected
> Waiting for client to connect to ZooKeeper
> :    [junit4]   2> 474391 T1830 oascc.ConnectionManager.process Watcher
> org.apache.solr.common.cloud.ConnectionManager@f18ce1
> name:ZooKeeperConnection Watcher:127.0.0.1:51825/solr got event
> WatchedEvent state:SyncConnected type:None path:null path:null type:None
> :    [junit4]   2> 474391 T1792 oascc.ConnectionManager.waitForConnected
> Client is connected to ZooKeeper
> :    [junit4]   2> 474391 T1792 oascc.SolrZkClient.createZkACLProvider
> Using default ZkACLProvider
> :    [junit4]   2> 474393 T1792
> oascc.ZkStateReader.createClusterStateWatchersAndUpdate Updating cluster
> state from ZooKeeper...
> :    [junit4]   2> 474397 T1826
> oasc.ShardLeaderElectionContext.runLeaderProcess Running the leader process
> for shard shard1
> :    [junit4]   2> 474399 T1792 oasc.ChaosMonkey.monkeyLog monkey: init -
> expire sessions:false cause connection loss:false
> :    [junit4]   2> 474400 T1818 oasc.DistributedQueue$LatchWatcher.process
> NodeChildrenChanged fired on path /overseer/queue state SyncConnected
> :    [junit4]   2> 474400 T1826
> oasc.ShardLeaderElectionContext.waitForReplicasToComeUp Enough replicas
> found to continue.
> :    [junit4]   2> 474400 T1826
> oasc.ShardLeaderElectionContext.runLeaderProcess I may be the new leader -
> try and sync
> :    [junit4]   2> ASYNC  NEW_CORE C340 name=collection1
> org.apache.solr.core.SolrCore@121ec0e url=
> http://127.0.0.1:51832/collection1 node=127.0.0.1:51832_
> C340_STATE=coll:control_collection core:collection1
> props:{core=collection1, node_name=127.0.0.1:51832_, base_url=
> http://127.0.0.1:51832, state=down}
> :    [junit4]   2> 474401 T1826 C340 P51832 oasc.SyncStrategy.sync Sync
> replicas to http://127.0.0.1:51832/collection1/
> :    [junit4]   2> 474401 T1826 C340 P51832 oasc.SyncStrategy.syncReplicas
> Sync Success - now sync replicas to me
> :    [junit4]   2> 474401 T1826 C340 P51832 oasc.SyncStrategy.syncToMe
> http://127.0.0.1:51832/collection1/ has no replicas
> :    [junit4]   2> 474401 T1826
> oasc.ShardLeaderElectionContext.runLeaderProcess I am the new leader:
> http://127.0.0.1:51832/collection1/ shard1
> :    [junit4]   2> 474402 T1826 oascc.SolrZkClient.makePath makePath:
> /collections/control_collection/leaders/shard1
> :    [junit4]   2> 474402 T1819 oasc.Overseer$ClusterStateUpdater.run
> processMessage: queueSize: 1, message = {
> :    [junit4]   2>        "operation":"leader",
> :    [junit4]   2>        "shard":"shard1",
> :    [junit4]   2>        "collection":"control_collection"} current state
> version: 1
> :    [junit4]   2> 474404 T1830 oascc.ZkStateReader$2.process A cluster
> state change: WatchedEvent state:SyncConnected type:NodeDataChanged
> path:/clusterstate.json, has occurred - updating... (live nodes size: 1)
> :    [junit4]   2> 474406 T1818 oascc.ZkStateReader$2.process A cluster
> state change: WatchedEvent state:SyncConnected type:NodeDataChanged
> path:/clusterstate.json, has occurred - updating... (live nodes size: 1)
> :    [junit4]   2> 474419 T1819 oasc.Overseer$ClusterStateUpdater.run
> processMessage: queueSize: 1, message = {
> :    [junit4]   2>        "operation":"leader",
> :    [junit4]   2>        "shard":"shard1",
> :    [junit4]   2>        "collection":"control_collection",
> :    [junit4]   2>        "base_url":"http://127.0.0.1:51832",
> :    [junit4]   2>        "core":"collection1",
> :    [junit4]   2>        "state":"active"} current state version: 2
> :    [junit4]   2> 474422 T1818 oasc.DistributedQueue$LatchWatcher.process
> NodeChildrenChanged fired on path /overseer/queue state SyncConnected
> :    [junit4]   2> 474424 T1818 oascc.ZkStateReader$2.process A cluster
> state change: WatchedEvent state:SyncConnected type:NodeDataChanged
> path:/clusterstate.json, has occurred - updating... (live nodes size: 1)
> :    [junit4]   2> 474425 T1830 oascc.ZkStateReader$2.process A cluster
> state change: WatchedEvent state:SyncConnected type:NodeDataChanged
> path:/clusterstate.json, has occurred - updating... (live nodes size: 1)
> :    [junit4]   2> 474476 T1826 oasc.ZkController.register We are
> http://127.0.0.1:51832/collection1/ and leader is
> http://127.0.0.1:51832/collection1/
> :    [junit4]   2> 474476 T1826 oasc.ZkController.register No LogReplay
> needed for core=collection1 baseURL=http://127.0.0.1:51832
> :    [junit4]   2> 474476 T1826 oasc.ZkController.checkRecovery I am the
> leader, no recovery necessary
> :    [junit4]   2> 474476 T1826 oasc.ZkController.publish publishing
> core=collection1 state=active collection=control_collection
> :    [junit4]   2> 474476 T1826 oasc.ZkController.publish numShards not
> found on descriptor - reading it from system property
> :    [junit4]   2> 474478 T1818 oasc.DistributedQueue$LatchWatcher.process
> NodeChildrenChanged fired on path /overseer/queue state SyncConnected
> :    [junit4]   2> 474480 T1819 oasc.Overseer$ClusterStateUpdater.run
> processMessage: queueSize: 1, message = {
> :    [junit4]   2>        "roles":null,
> :    [junit4]   2>        "numShards":"3",
> :    [junit4]   2>        "core_node_name":"core_node1",
> :    [junit4]   2>        "operation":"state",
> :    [junit4]   2>        "collection":"control_collection",
> :    [junit4]   2>        "core":"collection1",
> :    [junit4]   2>        "node_name":"127.0.0.1:51832_",
> :    [junit4]   2>        "base_url":"http://127.0.0.1:51832",
> :    [junit4]   2>        "shard":"shard1",
> :    [junit4]   2>        "state":"active"} current state version: 3
> :    [junit4]   2> 474480 T1819 oasco.ReplicaMutator.updateState Update
> state numShards=3 message={
> :    [junit4]   2>        "roles":null,
> :    [junit4]   2>        "numShards":"3",
> :    [junit4]   2>        "core_node_name":"core_node1",
> :    [junit4]   2>        "operation":"state",
> :    [junit4]   2>        "collection":"control_collection",
> :    [junit4]   2>        "core":"collection1",
> :    [junit4]   2>        "node_name":"127.0.0.1:51832_",
> :    [junit4]   2>        "base_url":"http://127.0.0.1:51832",
> :    [junit4]   2>        "shard":"shard1",
> :    [junit4]   2>        "state":"active"}
> :    [junit4]   2> 474597 T1830 oascc.ZkStateReader$2.process A cluster
> state change: WatchedEvent state:SyncConnected type:NodeDataChanged
> path:/clusterstate.json, has occurred - updating... (live nodes size: 1)
> :    [junit4]   2> 474597 T1818 oascc.ZkStateReader$2.process A cluster
> state change: WatchedEvent state:SyncConnected type:NodeDataChanged
> path:/clusterstate.json, has occurred - updating... (live nodes size: 1)
> :    [junit4]   2> 475886 T1792 oas.SolrTestCaseJ4.writeCoreProperties
> Writing core.properties file to
> C:\Users\JenkinsSlave\workspace\Lucene-Solr-5.x-Windows\solr\build\solr-core\test\J0\temp\solr.cloud.ReplicationFactorTest
> 847BA5C67BD44D56-001\shard-1-001\cores\collection1
> :    [junit4]   2> 475890 T1792
> oasc.AbstractFullDistribZkTestBase.createJettys create jetty 1
> :    [junit4]   2> 475890 T1792 oejs.Server.doStart jetty-8.1.10.v20130312
> :    [junit4]   2> 475895 T1792 oejs.AbstractConnector.doStart Started
> SelectChannelConnector@127.0.0.1:51846
> :    [junit4]   2> 475897 T1792 oass.SolrDispatchFilter.init
> SolrDispatchFilter.init()sun.misc.Launcher$AppClassLoader@1b8737f
> :    [junit4]   2> 475897 T1792 oasc.SolrResourceLoader.locateSolrHome
> JNDI not configured for solr (NoInitialContextEx)
> :    [junit4]   2> 475897 T1792 oasc.SolrResourceLoader.locateSolrHome
> using system property solr.solr.home:
> C:\Users\JenkinsSlave\workspace\Lucene-Solr-5.x-Windows\solr\build\solr-core\test\J0\temp\solr.cloud.ReplicationFactorTest
> 847BA5C67BD44D56-001\shard-1-001
> :    [junit4]   2> 475898 T1792 oasc.SolrResourceLoader.<init> new
> SolrResourceLoader for directory:
> 'C:\Users\JenkinsSlave\workspace\Lucene-Solr-5.x-Windows\solr\build\solr-core\test\J0\temp\solr.cloud.ReplicationFactorTest
> 847BA5C67BD44D56-001\shard-1-001\'
> :    [junit4]   2> 475936 T1792 oasc.ConfigSolr.fromFile Loading container
> configuration from
> C:\Users\JenkinsSlave\workspace\Lucene-Solr-5.x-Windows\solr\build\solr-core\test\J0\temp\solr.cloud.ReplicationFactorTest
> 847BA5C67BD44D56-001\shard-1-001\solr.xml
> :    [junit4]   2> 475971 T1792 oasc.CorePropertiesLocator.<init>
> Config-defined core root directory:
> C:\Users\JenkinsSlave\workspace\Lucene-Solr-5.x-Windows\solr\build\solr-core\test\J0\temp\solr.cloud.ReplicationFactorTest
> 847BA5C67BD44D56-001\shard-1-001\cores
> :    [junit4]   2> 475971 T1792 oasc.CoreContainer.<init> New
> CoreContainer 6041242
> :    [junit4]   2> 475971 T1792 oasc.CoreContainer.load Loading cores into
> CoreContainer
> [instanceDir=C:\Users\JenkinsSlave\workspace\Lucene-Solr-5.x-Windows\solr\build\solr-core\test\J0\temp\solr.cloud.ReplicationFactorTest
> 847BA5C67BD44D56-001\shard-1-001\]
> :    [junit4]   2> 475973 T1792 oashc.HttpShardHandlerFactory.getParameter
> Setting socketTimeout to: 90000
> :    [junit4]   2> 475973 T1792 oashc.HttpShardHandlerFactory.getParameter
> Setting urlScheme to:
> :    [junit4]   2> 475973 T1792 oashc.HttpShardHandlerFactory.getParameter
> Setting connTimeout to: 15000
> :    [junit4]   2> 475973 T1792 oashc.HttpShardHandlerFactory.getParameter
> Setting maxConnectionsPerHost to: 20
> :    [junit4]   2> 475973 T1792 oashc.HttpShardHandlerFactory.getParameter
> Setting maxConnections to: 10000
> :    [junit4]   2> 475973 T1792 oashc.HttpShardHandlerFactory.getParameter
> Setting corePoolSize to: 0
> :    [junit4]   2> 475973 T1792 oashc.HttpShardHandlerFactory.getParameter
> Setting maximumPoolSize to: 2147483647
> :    [junit4]   2> 475975 T1792 oashc.HttpShardHandlerFactory.getParameter
> Setting maxThreadIdleTime to: 5
> :    [junit4]   2> 475975 T1792 oashc.HttpShardHandlerFactory.getParameter
> Setting sizeOfQueue to: -1
> :    [junit4]   2> 475975 T1792 oashc.HttpShardHandlerFactory.getParameter
> Setting fairnessPolicy to: false
> :    [junit4]   2> 475976 T1792 oashc.HttpShardHandlerFactory.getParameter
> Setting useRetries to: false
> :    [junit4]   2> 475976 T1792 oasu.UpdateShardHandler.<init> Creating
> UpdateShardHandler HTTP client with params:
> socketTimeout=340000&connTimeout=45000&retry=true
> :    [junit4]   2> 475976 T1792 oasl.LogWatcher.createWatcher SLF4J impl
> is org.slf4j.impl.Log4jLoggerFactory
> :    [junit4]   2> 475976 T1792 oasl.LogWatcher.newRegisteredLogWatcher
> Registering Log Listener [Log4j (org.slf4j.impl.Log4jLoggerFactory)]
> :    [junit4]   2> 475976 T1792 oasc.CoreContainer.load Host Name:
> 127.0.0.1
> :    [junit4]   2> 475979 T1792 oasc.ZkContainer.initZooKeeper Zookeeper
> client=127.0.0.1:51825/solr
> :    [junit4]   2> 475979 T1792 oasc.ZkController.checkChrootPath zkHost
> includes chroot
> :    [junit4]   2> 475979 T1792
> oascc.SolrZkClient.createZkCredentialsToAddAutomatically Using default
> ZkCredentialsProvider
> :    [junit4]   2> 475981 T1792 oascc.ConnectionManager.waitForConnected
> Waiting for client to connect to ZooKeeper
> :    [junit4]   2> 475983 T1842 oascc.ConnectionManager.process Watcher
> org.apache.solr.common.cloud.ConnectionManager@1a8d188
> name:ZooKeeperConnection Watcher:127.0.0.1:51825 got event WatchedEvent
> state:SyncConnected type:None path:null path:null type:None
> :    [junit4]   2> 475984 T1792 oascc.ConnectionManager.waitForConnected
> Client is connected to ZooKeeper
> :    [junit4]   2> 475985 T1792 oascc.SolrZkClient.createZkACLProvider
> Using default ZkACLProvider
> :    [junit4]   2> 475989 T1792 oascc.ConnectionManager.waitForConnected
> Waiting for client to connect to ZooKeeper
> :    [junit4]   2> 475991 T1845 oascc.ConnectionManager.process Watcher
> org.apache.solr.common.cloud.ConnectionManager@1e07c3
> name:ZooKeeperConnection Watcher:127.0.0.1:51825/solr got event
> WatchedEvent state:SyncConnected type:None path:null path:null type:None
> :    [junit4]   2> 475991 T1792 oascc.ConnectionManager.waitForConnected
> Client is connected to ZooKeeper
> :    [junit4]   2> 476001 T1792
> oascc.ZkStateReader.createClusterStateWatchersAndUpdate Updating cluster
> state from ZooKeeper...
> :    [junit4]   2> 477128 T1792 oasc.ZkController.createEphemeralLiveNode
> Register node as live in ZooKeeper:/live_nodes/127.0.0.1:51845_
> :    [junit4]   2> 477130 T1792 oascc.SolrZkClient.makePath makePath:
> /live_nodes/127.0.0.1:51845_
> :    [junit4]   2> 477137 T1792 oasc.Overseer.close Overseer (id=null)
> closing
> :    [junit4]   2> 477140 T1792 oasc.CorePropertiesLocator.discover
> Looking for core definitions underneath
> C:\Users\JenkinsSlave\workspace\Lucene-Solr-5.x-Windows\solr\build\solr-core\test\J0\temp\solr.cloud.ReplicationFactorTest
> 847BA5C67BD44D56-001\shard-1-001\cores
> :    [junit4]   2> 477140 T1792 oasc.CorePropertiesLocator.discoverUnder
> Found core collection1 in
> C:\Users\JenkinsSlave\workspace\Lucene-Solr-5.x-Windows\solr\build\solr-core\test\J0\temp\solr.cloud.ReplicationFactorTest
> 847BA5C67BD44D56-001\shard-1-001\cores\collection1\
> :    [junit4]   2> 477142 T1792 oasc.CorePropertiesLocator.discover Found
> 1 core definitions
> :    [junit4]   2> 477144 T1846 oasc.ZkController.publish publishing
> core=collection1 state=down collection=collection1
> :    [junit4]   2> 477144 T1846 oasc.ZkController.publish numShards not
> found on descriptor - reading it from system property
> :    [junit4]   2> 477145 T1818 oasc.DistributedQueue$LatchWatcher.process
> NodeChildrenChanged fired on path /overseer/queue state SyncConnected
> :    [junit4]   2> 477145 T1846 oasc.ZkController.waitForCoreNodeName look
> for our core node name
> :    [junit4]   2> 477148 T1819 oasc.Overseer$ClusterStateUpdater.run
> processMessage: queueSize: 1, message = {
> :    [junit4]   2>        "roles":null,
> :    [junit4]   2>        "numShards":"3",
> :    [junit4]   2>        "operation":"state",
> :    [junit4]   2>        "collection":"collection1",
> :    [junit4]   2>        "core":"collection1",
> :    [junit4]   2>        "node_name":"127.0.0.1:51845_",
> :    [junit4]   2>        "base_url":"http://127.0.0.1:51845",
> :    [junit4]   2>        "shard":null,
> :    [junit4]   2>        "state":"down"} current state version: 4
> :    [junit4]   2> 477149 T1819 oasco.ReplicaMutator.updateState Update
> state numShards=3 message={
> :    [junit4]   2>        "roles":null,
> :    [junit4]   2>        "numShards":"3",
> :    [junit4]   2>        "operation":"state",
> :    [junit4]   2>        "collection":"collection1",
> :    [junit4]   2>        "core":"collection1",
> :    [junit4]   2>        "node_name":"127.0.0.1:51845_",
> :    [junit4]   2>        "base_url":"http://127.0.0.1:51845",
> :    [junit4]   2>        "shard":null,
> :    [junit4]   2>        "state":"down"}
> :    [junit4]   2> 477149 T1819 oasco.ClusterStateMutator.createCollection
> building a new cName: collection1
> :    [junit4]   2> 477149 T1819 oasco.ReplicaMutator.updateState Assigning
> new node to shard shard=shard2
> :    [junit4]   2> 477151 T1830 oascc.ZkStateReader$2.process A cluster
> state change: WatchedEvent state:SyncConnected type:NodeDataChanged
> path:/clusterstate.json, has occurred - updating... (live nodes size: 2)
> :    [junit4]   2> 477151 T1845 oascc.ZkStateReader$2.process A cluster
> state change: WatchedEvent state:SyncConnected type:NodeDataChanged
> path:/clusterstate.json, has occurred - updating... (live nodes size: 2)
> :    [junit4]   2> 477151 T1818 oascc.ZkStateReader$2.process A cluster
> state change: WatchedEvent state:SyncConnected type:NodeDataChanged
> path:/clusterstate.json, has occurred - updating... (live nodes size: 2)
> :    [junit4]   2> 478267 T1846 oasc.ZkController.waitForShardId waiting
> to find shard id in clusterstate for collection1
> :    [junit4]   2> 478267 T1846 oasc.ZkController.createCollectionZkNode
> Check for collection zkNode:collection1
> :    [junit4]   2> 478268 T1846 oasc.ZkController.createCollectionZkNode
> Collection zkNode exists
> :    [junit4]   2> 478268 T1846 oascc.ZkStateReader.readConfigName Load
> collection config from:/collections/collection1
> :    [junit4]   2> 478271 T1846 oascc.ZkStateReader.readConfigName
> path=/collections/collection1 configName=conf1 specified config exists in
> ZooKeeper
> :    [junit4]   2> 478271 T1846 oasc.SolrResourceLoader.<init> new
> SolrResourceLoader for directory:
> 'C:\Users\JenkinsSlave\workspace\Lucene-Solr-5.x-Windows\solr\build\solr-core\test\J0\temp\solr.cloud.ReplicationFactorTest
> 847BA5C67BD44D56-001\shard-1-001\cores\collection1\'
> :    [junit4]   2> 478295 T1846 oasc.ZkController.watchZKConfDir watch
> zkdir /configs/conf1
> :    [junit4]   2> 478299 T1846 oasc.Config.<init> loaded config
> solrconfig.xml with version 0
> :    [junit4]   2> 478311 T1846 oasc.SolrConfig.refreshRequestParams
> current version of requestparams : -1
> :    [junit4]   2> 478338 T1846 oasc.SolrConfig.<init> Using Lucene
> MatchVersion: 5.1.0
> :    [junit4]   2> 478393 T1846 oasc.SolrConfig.<init> Loaded SolrConfig:
> solrconfig.xml
> :    [junit4]   2> 478396 T1846 oass.IndexSchema.readSchema Reading Solr
> Schema from /configs/conf1/schema.xml
> :    [junit4]   2> 478408 T1846 oass.IndexSchema.readSchema [collection1]
> Schema name=test
> :    [junit4]   2> 478869 T1846 oass.OpenExchangeRatesOrgProvider.init
> Initialized with rates=open-exchange-rates.json, refreshInterval=1440.
> :    [junit4]   2> 478879 T1846 oass.IndexSchema.readSchema default search
> field in schema is text
> :    [junit4]   2> 478883 T1846 oass.IndexSchema.readSchema unique key
> field: id
> :    [junit4]   2> 478900 T1846 oass.FileExchangeRateProvider.reload
> Reloading exchange rates from file currency.xml
> :    [junit4]   2> 478904 T1846 oass.FileExchangeRateProvider.reload
> Reloading exchange rates from file currency.xml
> :    [junit4]   2> 478909 T1846 oass.OpenExchangeRatesOrgProvider.reload
> Reloading exchange rates from open-exchange-rates.json
> :    [junit4]   2> 478912 T1846
> oass.OpenExchangeRatesOrgProvider$OpenExchangeRates.<init> WARN Unknown key
> IMPORTANT NOTE
> :    [junit4]   2> 478913 T1846
> oass.OpenExchangeRatesOrgProvider$OpenExchangeRates.<init> WARN Expected
> key, got STRING
> :    [junit4]   2> 478913 T1846 oass.OpenExchangeRatesOrgProvider.reload
> Reloading exchange rates from open-exchange-rates.json
> :    [junit4]   2> 478914 T1846
> oass.OpenExchangeRatesOrgProvider$OpenExchangeRates.<init> WARN Unknown key
> IMPORTANT NOTE
> :    [junit4]   2> 478914 T1846
> oass.OpenExchangeRatesOrgProvider$OpenExchangeRates.<init> WARN Expected
> key, got STRING
> :    [junit4]   2> 478914 T1846 oasc.CoreContainer.create Creating
> SolrCore 'collection1' using configuration from collection collection1
> :    [junit4]   2> 478914 T1846 oasc.SolrCore.initDirectoryFactory
> org.apache.solr.core.MockDirectoryFactory
> :    [junit4]   2> 478915 T1846 oasc.SolrCore.<init> [collection1] Opening
> new SolrCore at
> C:\Users\JenkinsSlave\workspace\Lucene-Solr-5.x-Windows\solr\build\solr-core\test\J0\temp\solr.cloud.ReplicationFactorTest
> 847BA5C67BD44D56-001\shard-1-001\cores\collection1\,
> dataDir=C:\Users\JenkinsSlave\workspace\Lucene-Solr-5.x-Windows\solr\build\solr-core\test\J0\temp\solr.cloud.ReplicationFactorTest
> 847BA5C67BD44D56-001\tempDir-001/jetty1\
> :    [junit4]   2> 478915 T1846 oasc.JmxMonitoredMap.<init> JMX monitoring
> is enabled. Adding Solr mbeans to JMX Server:
> com.sun.jmx.mbeanserver.JmxMBeanServer@b1cfa4
> :    [junit4]   2> 478916 T1846 oasc.CachingDirectoryFactory.get return
> new directory for
> C:\Users\JenkinsSlave\workspace\Lucene-Solr-5.x-Windows\solr\build\solr-core\test\J0\temp\solr.cloud.ReplicationFactorTest
> 847BA5C67BD44D56-001\tempDir-001/jetty1\
> :    [junit4]   2> 478916 T1846 oasc.SolrCore.getNewIndexDir New index
> directory detected: old=null
> new=C:\Users\JenkinsSlave\workspace\Lucene-Solr-5.x-Windows\solr\build\solr-core\test\J0\temp\solr.cloud.ReplicationFactorTest
> 847BA5C67BD44D56-001\tempDir-001/jetty1\index/
> :    [junit4]   2> 478916 T1846 oasc.SolrCore.initIndex WARN [collection1]
> Solr index directory
> 'C:\Users\JenkinsSlave\workspace\Lucene-Solr-5.x-Windows\solr\build\solr-core\test\J0\temp\solr.cloud.ReplicationFactorTest
> 847BA5C67BD44D56-001\tempDir-001\jetty1\index' doesn't exist. Creating new
> index...
> :    [junit4]   2> 478917 T1846 oasc.CachingDirectoryFactory.get return
> new directory for
> C:\Users\JenkinsSlave\workspace\Lucene-Solr-5.x-Windows\solr\build\solr-core\test\J0\temp\solr.cloud.ReplicationFactorTest
> 847BA5C67BD44D56-001\tempDir-001/jetty1\index
> :    [junit4]   2> 478917 T1846 oasu.RandomMergePolicy.<init>
> RandomMergePolicy wrapping class
> org.apache.lucene.index.AlcoholicMergePolicy: [AlcoholicMergePolicy:
> minMergeSize=0, mergeFactor=10, maxMergeSize=39238125,
> maxMergeSizeForForcedMerge=9223372036854775807,
> calibrateSizeByDeletes=true, maxMergeDocs=2147483647,
> maxCFSSegmentSizeMB=8.796093022207999E12, noCFSRatio=0.1]
> :    [junit4]   2> 478918 T1846 oasc.SolrDeletionPolicy.onCommit
> SolrDeletionPolicy.onCommit: commits: num=1
> :    [junit4]   2>
> commit{dir=MockDirectoryWrapper(RAMDirectory@12308c9
> lockFactory=org.apache.lucene.store.SingleInstanceLockFactory@115f4ea
> ),segFN=segments_1,generation=1}
> :    [junit4]   2> 478918 T1846 oasc.SolrDeletionPolicy.updateCommits
> newest commit generation = 1
> :    [junit4]   2> 478923 T1846 oasup.UpdateRequestProcessorChain.init
> creating updateRequestProcessorChain "nodistrib"
> :    [junit4]   2> 478923 T1
> :
> : [...truncated too long message...]
> :
> : xBoostProcessorTest, TestDynamicFieldResource,
> LeaderFailoverAfterPartitionTest, SoftAutoCommitTest,
> ExitableDirectoryReaderTest, TestFunctionQuery, SolrXmlInZkTest,
> SuggestComponentTest, AsyncMigrateRouteKeyTest, SSLMigrationTest,
> ResponseLogComponentTest, CollectionsAPIDistributedZkTest,
> OpenCloseCoreStressTest, OverseerTest, LeaderElectionIntegrationTest,
> ShardRoutingTest, RecoveryZkTest, ClusterStateUpdateTest, TestZkChroot,
> TestRandomDVFaceting, ZkCLITest, TestDistributedGrouping, TestFaceting,
> TestRecovery, TestHashPartitioner, TermVectorComponentDistributedTest,
> ZkControllerTest, TestRealTimeGet, TestJoin, TestReload,
> HardAutoCommitTest, DistributedTermsComponentTest, TestRangeQuery,
> SpellCheckComponentTest, BadIndexSchemaTest, BasicFunctionalityTest,
> TestLazyCores, DirectUpdateHandlerTest, TestBadConfig,
> OverseerCollectionProcessorTest, TestIndexSearcher,
> CurrencyFieldOpenExchangeTest, DistributedQueryElevationComponentTest,
> CurrencyFieldXmlFileTest, TestExtendedDismaxParse
>  r, SuggesterFSTTest, TestFoldingMultitermQuery, DocValuesTest,
> SuggesterTest, TestStressLucene, SpatialFilterTest, PolyFieldTest,
> NoCacheHeaderTest, SchemaVersionSpecificBehaviorTest, TestUpdate,
> QueryEqualityTest, DirectUpdateHandlerOptimizeTest,
> DefaultValueUpdateProcessorTest, StatelessScriptUpdateProcessorFactoryTest,
> TestSolrDeletionPolicy1, DebugComponentTest, TestSurroundQueryParser,
> LukeRequestHandlerTest, DisMaxRequestHandlerTest, TestQueryUtils,
> TestWriterPerf, TestReversedWildcardFilterFactory,
> FileBasedSpellCheckerTest, TermsComponentTest, XmlUpdateRequestHandlerTest,
> TestValueSourceCache, PathHierarchyTokenizerFactoryTest,
> TermVectorComponentTest, MoreLikeThisHandlerTest, TestSolrQueryParser,
> TestArbitraryIndexDir, FastVectorHighlighterTest,
> IndexSchemaRuntimeFieldTest, SolrPluginUtilsTest, ReturnFieldsTest,
> UpdateRequestProcessorFactoryTest, TestCSVResponseWriter, QueryParsingTest,
> TestAnalyzedSuggestions, BinaryUpdateRequestHandlerTest,
> PingRequestHandlerTest, TestCom
>  ponentsName, HighlighterConfigTest, TestQuerySenderListener,
> TestQuerySenderNoQuery, SolrIndexConfigTest, BadComponentTest,
> TestStressRecovery, TestSolrDeletionPolicy2, MultiTermTest, SampleTest,
> MinimalSchemaTest, OutputWriterTest, NotRequiredUniqueKeyTest,
> TestLuceneMatchVersion, SpellPossibilityIteratorTest, TestCharFilters,
> TestCodecSupport, SynonymTokenizerTest, TestXIncludeConfig,
> TestSweetSpotSimilarityFactory, TestDFRSimilarityFactory,
> TestLMJelinekMercerSimilarityFactory, TestIBSimilarityFactory,
> TestBM25SimilarityFactory, TestDefaultSimilarityFactory, TestFastWriter,
> ResourceLoaderTest, ScriptEngineTest, OpenExchangeRatesOrgProviderTest,
> URLClassifyProcessorTest, PluginInfoTest, TestFastLRUCache,
> DateMathParserTest, PreAnalyzedFieldTest, TestSystemIdResolver,
> PrimUtilsTest, TestSuggestSpellingConverter, RAMDirectoryFactoryTest,
> TestLRUCache, ZkNodePropsTest, SliceStateTest, SystemInfoHandlerTest,
> UUIDFieldTest, DistributedMLTComponentTest, TestRTGBase, SolrTestCaseJ4Test,
>  TestHighlightDedupGrouping, AliasIntegrationTest,
> CloudExitableDirectoryReaderTest, ConnectionManagerTest, DeleteReplicaTest,
> DeleteShardTest, DistribCursorPagingTest,
> DistribDocExpirationUpdateProcessorTest, DistribJoinFromCollectionTest,
> DistributedQueueTest, ExternalCollectionsTest, MigrateRouteKeyTest,
> MultiThreadedOCPTest, OverseerRolesTest, OverseerStatusTest,
> RollingRestartTest, SaslZkACLProviderTest,
> SimpleCollectionCreateDeleteTest, TestCloudPivotFacet,
> TestDistribDocBasedVersion, TestMiniSolrCloudCluster,
> TestReplicaProperties, TestShortCircuitedRequests,
> TriLevelCompositeIdRoutingTest, VMParamsZkACLAndCredentialsProvidersTest,
> HdfsBasicDistributedZkTest, HdfsChaosMonkeySafeLeaderTest,
> HdfsSyncSliceTest, StressHdfsTest, TestClusterStateMutator,
> ZkStateWriterTest, CachingDirectoryFactoryTest, HdfsDirectoryFactoryTest,
> QueryResultKeyTest, TestConfigSets, TestImplicitCoreProperties,
> TestNRTOpen, TestReloadAndDeleteDocs, TestShardHandlerFactory,
> TestSolrConfigHandler, TestSolr
>  DynamicMBean, TestSolrXml, RequestLoggingTest, TestBlobHandler,
> TestConfigReload, TestReplicationHandlerBackup]
> :    [junit4]   2> NOTE: reproduce with: ant test
> -Dtestcase=TestReplicationHandlerBackup -Dtests.seed=847BA5C67BD44D56
> -Dtests.slow=true -Dtests.locale=sr_ME -Dtests.timezone=Canada/Yukon
> -Dtests.asserts=true -Dtests.file.encoding=Cp1252
> :    [junit4] ERROR   0.00s | TestReplicationHandlerBackup (suite) <<<
> :    [junit4]    > Throwable #1: java.io.IOException: Could not remove the
> following files (in the order of attempts):
> :    [junit4]    >
> C:\Users\JenkinsSlave\workspace\Lucene-Solr-5.x-Windows\solr\build\solr-core\test\J0\temp\solr.handler.TestReplicationHandlerBackup
> 847BA5C67BD44D56-001\solr-instance-002\collection1:
> java.nio.file.DirectoryNotEmptyException:
> C:\Users\JenkinsSlave\workspace\Lucene-Solr-5.x-Windows\solr\build\solr-core\test\J0\temp\solr.handler.TestReplicationHandlerBackup
> 847BA5C67BD44D56-001\solr-instance-002\collection1
> :    [junit4]    >
> C:\Users\JenkinsSlave\workspace\Lucene-Solr-5.x-Windows\solr\build\solr-core\test\J0\temp\solr.handler.TestReplicationHandlerBackup
> 847BA5C67BD44D56-001\solr-instance-002:
> java.nio.file.DirectoryNotEmptyException:
> C:\Users\JenkinsSlave\workspace\Lucene-Solr-5.x-Windows\solr\build\solr-core\test\J0\temp\solr.handler.TestReplicationHandlerBackup
> 847BA5C67BD44D56-001\solr-instance-002
> :    [junit4]    >
> C:\Users\JenkinsSlave\workspace\Lucene-Solr-5.x-Windows\solr\build\solr-core\test\J0\temp\solr.handler.TestReplicationHandlerBackup
> 847BA5C67BD44D56-001\solr-instance-001\collection1:
> java.nio.file.DirectoryNotEmptyException:
> C:\Users\JenkinsSlave\workspace\Lucene-Solr-5.x-Windows\solr\build\solr-core\test\J0\temp\solr.handler.TestReplicationHandlerBackup
> 847BA5C67BD44D56-001\solr-instance-001\collection1
> :    [junit4]    >
> C:\Users\JenkinsSlave\workspace\Lucene-Solr-5.x-Windows\solr\build\solr-core\test\J0\temp\solr.handler.TestReplicationHandlerBackup
> 847BA5C67BD44D56-001\solr-instance-001:
> java.nio.file.DirectoryNotEmptyException:
> C:\Users\JenkinsSlave\workspace\Lucene-Solr-5.x-Windows\solr\build\solr-core\test\J0\temp\solr.handler.TestReplicationHandlerBackup
> 847BA5C67BD44D56-001\solr-instance-001
> :    [junit4]    >
> C:\Users\JenkinsSlave\workspace\Lucene-Solr-5.x-Windows\solr\build\solr-core\test\J0\temp\solr.handler.TestReplicationHandlerBackup
> 847BA5C67BD44D56-001\solr-instance-001\collection1\data:
> java.nio.file.AccessDeniedException:
> C:\Users\JenkinsSlave\workspace\Lucene-Solr-5.x-Windows\solr\build\solr-core\test\J0\temp\solr.handler.TestReplicationHandlerBackup
> 847BA5C67BD44D56-001\solr-instance-001\collection1\data
> :    [junit4]    >
> C:\Users\JenkinsSlave\workspace\Lucene-Solr-5.x-Windows\solr\build\solr-core\test\J0\temp\solr.handler.TestReplicationHandlerBackup
> 847BA5C67BD44D56-001\solr-instance-001:
> java.nio.file.DirectoryNotEmptyException:
> C:\Users\JenkinsSlave\workspace\Lucene-Solr-5.x-Windows\solr\build\solr-core\test\J0\temp\solr.handler.TestReplicationHandlerBackup
> 847BA5C67BD44D56-001\solr-instance-001
> :    [junit4]    >
> C:\Users\JenkinsSlave\workspace\Lucene-Solr-5.x-Windows\solr\build\solr-core\test\J0\temp\solr.handler.TestReplicationHandlerBackup
> 847BA5C67BD44D56-001\solr-instance-002\collection1\data:
> java.nio.file.AccessDeniedException:
> C:\Users\JenkinsSlave\workspace\Lucene-Solr-5.x-Windows\solr\build\solr-core\test\J0\temp\solr.handler.TestReplicationHandlerBackup
> 847BA5C67BD44D56-001\solr-instance-002\collection1\data
> :    [junit4]    >
> C:\Users\JenkinsSlave\workspace\Lucene-Solr-5.x-Windows\solr\build\solr-core\test\J0\temp\solr.handler.TestReplicationHandlerBackup
> 847BA5C67BD44D56-001\solr-instance-002:
> java.nio.file.DirectoryNotEmptyException:
> C:\Users\JenkinsSlave\workspace\Lucene-Solr-5.x-Windows\solr\build\solr-core\test\J0\temp\solr.handler.TestReplicationHandlerBackup
> 847BA5C67BD44D56-001\solr-instance-002
> :    [junit4]    >
> C:\Users\JenkinsSlave\workspace\Lucene-Solr-5.x-Windows\solr\build\solr-core\test\J0\temp\solr.handler.TestReplicationHandlerBackup
> 847BA5C67BD44D56-001: java.nio.file.DirectoryNotEmptyException:
> C:\Users\JenkinsSlave\workspace\Lucene-Solr-5.x-Windows\solr\build\solr-core\test\J0\temp\solr.handler.TestReplicationHandlerBackup
> 847BA5C67BD44D56-001
> :    [junit4]    >      at
> __randomizedtesting.SeedInfo.seed([847BA5C67BD44D56]:0)
> :    [junit4]    >      at
> org.apache.lucene.util.IOUtils.rm(IOUtils.java:294)
> :    [junit4]    >      at java.lang.Thread.run(Thread.java:745)
> :    [junit4] Completed in 7.16s, 2 tests, 1 error <<< FAILURES!
> :
> : [...truncated 214 lines...]
> : BUILD FAILED
> : C:\Users\JenkinsSlave\workspace\Lucene-Solr-5.x-Windows\build.xml:529:
> The following error occurred while executing this line:
> : C:\Users\JenkinsSlave\workspace\Lucene-Solr-5.x-Windows\build.xml:477:
> The following error occurred while executing this line:
> : C:\Users\JenkinsSlave\workspace\Lucene-Solr-5.x-Windows\build.xml:61:
> The following error occurred while executing this line:
> :
> C:\Users\JenkinsSlave\workspace\Lucene-Solr-5.x-Windows\extra-targets.xml:39:
> The following error occurred while executing this line:
> :
> C:\Users\JenkinsSlave\workspace\Lucene-Solr-5.x-Windows\solr\build.xml:191:
> The following error occurred while executing this line:
> :
> C:\Users\JenkinsSlave\workspace\Lucene-Solr-5.x-Windows\solr\common-build.xml:508:
> The following error occurred while executing this line:
> :
> C:\Users\JenkinsSlave\workspace\Lucene-Solr-5.x-Windows\lucene\common-build.xml:1368:
> The following error occurred while executing this line:
> :
> C:\Users\JenkinsSlave\workspace\Lucene-Solr-5.x-Windows\lucene\common-build.xml:975:
> There were test failures: 466 suites, 1863 tests, 2 suite-level errors, 15
> errors, 55 ignored (30 assumptions)
> :
> : Total time: 128 minutes 45 seconds
> : Build step 'Invoke Ant' marked build as failure
> : [description-setter] Description set: Java: 32bit/jdk1.7.0_76 -client
> -XX:+UseParallelGC
> : Archiving artifacts
> : Recording test results
> : Email was triggered for: Failure - Any
> : Sending email for trigger: Failure - Any
> :
> :
> :
>
> -Hoss
> http://www.lucidworks.com/
>
>
> ---------------------------------------------------------------------
> To unsubscribe, e-mail: dev-unsubscribe@lucene.apache.org
> For additional commands, e-mail: dev-help@lucene.apache.org
>



-- 
Anshum Gupta
http://about.me/anshumgupta

Mime
View raw message