lucene-dev mailing list archives

Site index · List index
Message view « Date » · « Thread »
Top « Date » · « Thread »
From "david.w.smiley@gmail.com" <david.w.smi...@gmail.com>
Subject Re: [JENKINS] Lucene-Solr-trunk-Linux (32bit/jdk1.8.0_31) - Build # 11780 - Failure!
Date Wed, 11 Feb 2015 18:12:15 GMT
It reproduces; I’m on it.

~ David Smiley
Freelance Apache Lucene/Solr Search Consultant/Developer
http://www.linkedin.com/in/davidwsmiley

On Wed, Feb 11, 2015 at 12:30 PM, Policeman Jenkins Server <
jenkins@thetaphi.de> wrote:

> Build: http://jenkins.thetaphi.de/job/Lucene-Solr-trunk-Linux/11780/
> Java: 32bit/jdk1.8.0_31 -server -XX:+UseConcMarkSweepGC
>
> 1 tests failed.
> FAILED:
> org.apache.lucene.spatial.prefix.HeatmapFacetCounterTest.testRandom {#3
> seed=[6B7EE18F8044BF08:1263454538DCD1B5]}
>
> Error Message:
> expected:<1> but was:<0>
>
> Stack Trace:
> java.lang.AssertionError: expected:<1> but was:<0>
>         at
> __randomizedtesting.SeedInfo.seed([6B7EE18F8044BF08:1263454538DCD1B5]:0)
>         at org.junit.Assert.fail(Assert.java:93)
>         at org.junit.Assert.failNotEquals(Assert.java:647)
>         at org.junit.Assert.assertEquals(Assert.java:128)
>         at org.junit.Assert.assertEquals(Assert.java:472)
>         at org.junit.Assert.assertEquals(Assert.java:456)
>         at
> org.apache.lucene.spatial.prefix.HeatmapFacetCounterTest.validateHeatmapResult(HeatmapFacetCounterTest.java:221)
>         at
> org.apache.lucene.spatial.prefix.HeatmapFacetCounterTest.queryHeatmapRecursive(HeatmapFacetCounterTest.java:188)
>         at
> org.apache.lucene.spatial.prefix.HeatmapFacetCounterTest.queryHeatmapRecursive(HeatmapFacetCounterTest.java:201)
>         at
> org.apache.lucene.spatial.prefix.HeatmapFacetCounterTest.testRandom(HeatmapFacetCounterTest.java:172)
>         at sun.reflect.NativeMethodAccessorImpl.invoke0(Native Method)
>         at
> sun.reflect.NativeMethodAccessorImpl.invoke(NativeMethodAccessorImpl.java:62)
>         at
> sun.reflect.DelegatingMethodAccessorImpl.invoke(DelegatingMethodAccessorImpl.java:43)
>         at java.lang.reflect.Method.invoke(Method.java:483)
>         at
> com.carrotsearch.randomizedtesting.RandomizedRunner.invoke(RandomizedRunner.java:1618)
>         at
> com.carrotsearch.randomizedtesting.RandomizedRunner$6.evaluate(RandomizedRunner.java:827)
>         at
> com.carrotsearch.randomizedtesting.RandomizedRunner$7.evaluate(RandomizedRunner.java:863)
>         at
> com.carrotsearch.randomizedtesting.RandomizedRunner$8.evaluate(RandomizedRunner.java:877)
>         at
> org.apache.lucene.util.TestRuleSetupTeardownChained$1.evaluate(TestRuleSetupTeardownChained.java:50)
>         at
> org.apache.lucene.util.AbstractBeforeAfterRule$1.evaluate(AbstractBeforeAfterRule.java:46)
>         at
> com.carrotsearch.randomizedtesting.rules.SystemPropertiesInvariantRule$1.evaluate(SystemPropertiesInvariantRule.java:55)
>         at
> org.apache.lucene.util.TestRuleThreadAndTestName$1.evaluate(TestRuleThreadAndTestName.java:49)
>         at
> org.apache.lucene.util.TestRuleIgnoreAfterMaxFailures$1.evaluate(TestRuleIgnoreAfterMaxFailures.java:65)
>         at
> org.apache.lucene.util.TestRuleMarkFailure$1.evaluate(TestRuleMarkFailure.java:48)
>         at
> com.carrotsearch.randomizedtesting.rules.StatementAdapter.evaluate(StatementAdapter.java:36)
>         at
> com.carrotsearch.randomizedtesting.ThreadLeakControl$StatementRunner.run(ThreadLeakControl.java:365)
>         at
> com.carrotsearch.randomizedtesting.ThreadLeakControl.forkTimeoutingTask(ThreadLeakControl.java:798)
>         at
> com.carrotsearch.randomizedtesting.ThreadLeakControl$3.evaluate(ThreadLeakControl.java:458)
>         at
> com.carrotsearch.randomizedtesting.RandomizedRunner.runSingleTest(RandomizedRunner.java:836)
>         at
> com.carrotsearch.randomizedtesting.RandomizedRunner$3.evaluate(RandomizedRunner.java:738)
>         at
> com.carrotsearch.randomizedtesting.RandomizedRunner$4.evaluate(RandomizedRunner.java:772)
>         at
> com.carrotsearch.randomizedtesting.RandomizedRunner$5.evaluate(RandomizedRunner.java:783)
>         at
> org.apache.lucene.util.AbstractBeforeAfterRule$1.evaluate(AbstractBeforeAfterRule.java:46)
>         at
> org.apache.lucene.util.TestRuleStoreClassName$1.evaluate(TestRuleStoreClassName.java:42)
>         at
> com.carrotsearch.randomizedtesting.rules.SystemPropertiesInvariantRule$1.evaluate(SystemPropertiesInvariantRule.java:55)
>         at
> com.carrotsearch.randomizedtesting.rules.NoShadowingOrOverridesOnMethodsRule$1.evaluate(NoShadowingOrOverridesOnMethodsRule.java:39)
>         at
> com.carrotsearch.randomizedtesting.rules.NoShadowingOrOverridesOnMethodsRule$1.evaluate(NoShadowingOrOverridesOnMethodsRule.java:39)
>         at
> com.carrotsearch.randomizedtesting.rules.StatementAdapter.evaluate(StatementAdapter.java:36)
>         at
> com.carrotsearch.randomizedtesting.rules.StatementAdapter.evaluate(StatementAdapter.java:36)
>         at
> com.carrotsearch.randomizedtesting.rules.StatementAdapter.evaluate(StatementAdapter.java:36)
>         at
> org.apache.lucene.util.TestRuleAssertionsRequired$1.evaluate(TestRuleAssertionsRequired.java:54)
>         at
> org.apache.lucene.util.TestRuleMarkFailure$1.evaluate(TestRuleMarkFailure.java:48)
>         at
> org.apache.lucene.util.TestRuleIgnoreAfterMaxFailures$1.evaluate(TestRuleIgnoreAfterMaxFailures.java:65)
>         at
> org.apache.lucene.util.TestRuleIgnoreTestSuites$1.evaluate(TestRuleIgnoreTestSuites.java:55)
>         at
> com.carrotsearch.randomizedtesting.rules.StatementAdapter.evaluate(StatementAdapter.java:36)
>         at
> com.carrotsearch.randomizedtesting.ThreadLeakControl$StatementRunner.run(ThreadLeakControl.java:365)
>         at java.lang.Thread.run(Thread.java:745)
>
>
>
>
> Build Log:
> [...truncated 7914 lines...]
>    [junit4] Suite: org.apache.lucene.spatial.prefix.HeatmapFacetCounterTest
>    [junit4]   2> feb 11, 2015 7:30:33 AM
> org.apache.lucene.spatial.prefix.HeatmapFacetCounterTest after
>    [junit4]   2> INFORMACIÓN: Validated 0 cells, 0 non-zero
>    [junit4]   2> feb 11, 2015 7:30:33 AM
> org.apache.lucene.spatial.prefix.HeatmapFacetCounterTest after
>    [junit4]   2> INFORMACIÓN: Validated 15 cells, 1 non-zero
>    [junit4]   2> feb 11, 2015 7:30:33 AM
> org.apache.lucene.spatial.prefix.HeatmapFacetCounterTest after
>    [junit4]   2> INFORMACIÓN: Validated 20 cells, 2 non-zero
>    [junit4]   2> feb 11, 2015 7:30:33 AM
> org.apache.lucene.spatial.prefix.HeatmapFacetCounterTest after
>    [junit4]   2> INFORMACIÓN: Validated 11 cells, 2 non-zero
>    [junit4]   2> feb 11, 2015 7:30:34 AM
> org.apache.lucene.spatial.prefix.HeatmapFacetCounterTest after
>    [junit4]   2> INFORMACIÓN: Validated 15 cells, 7 non-zero
>    [junit4]   2> NOTE: reproduce with: ant test
> -Dtestcase=HeatmapFacetCounterTest -Dtests.method=testRandom
> -Dtests.seed=6B7EE18F8044BF08 -Dtests.multiplier=3 -Dtests.slow=true
> -Dtests.locale=es_UY -Dtests.timezone=Pacific/Johnston -Dtests.asserts=true
> -Dtests.file.encoding=ISO-8859-1
>    [junit4] FAILURE 0.06s J0 | HeatmapFacetCounterTest.testRandom {#3
> seed=[6B7EE18F8044BF08:1263454538DCD1B5]} <<<
>    [junit4]    > Throwable #1: java.lang.AssertionError: expected:<1> but
> was:<0>
>    [junit4]    >        at
> __randomizedtesting.SeedInfo.seed([6B7EE18F8044BF08:1263454538DCD1B5]:0)
>    [junit4]    >        at
> org.apache.lucene.spatial.prefix.HeatmapFacetCounterTest.validateHeatmapResult(HeatmapFacetCounterTest.java:221)
>    [junit4]    >        at
> org.apache.lucene.spatial.prefix.HeatmapFacetCounterTest.queryHeatmapRecursive(HeatmapFacetCounterTest.java:188)
>    [junit4]    >        at
> org.apache.lucene.spatial.prefix.HeatmapFacetCounterTest.queryHeatmapRecursive(HeatmapFacetCounterTest.java:201)
>    [junit4]    >        at
> org.apache.lucene.spatial.prefix.HeatmapFacetCounterTest.testRandom(HeatmapFacetCounterTest.java:172)
>    [junit4]    >        at java.lang.Thread.run(Thread.java:745)
>    [junit4]   2> feb 11, 2015 7:30:34 AM
> org.apache.lucene.spatial.prefix.HeatmapFacetCounterTest after
>    [junit4]   2> INFORMACIÓN: Validated 4 cells, 3 non-zero
>    [junit4]   2> feb 11, 2015 7:30:34 AM
> org.apache.lucene.spatial.prefix.HeatmapFacetCounterTest after
>    [junit4]   2> INFORMACIÓN: Validated 7 cells, 4 non-zero
>    [junit4]   2> feb 11, 2015 7:30:34 AM
> org.apache.lucene.spatial.prefix.HeatmapFacetCounterTest after
>    [junit4]   2> INFORMACIÓN: Validated 15 cells, 5 non-zero
>    [junit4]   2> feb 11, 2015 7:30:34 AM
> org.apache.lucene.spatial.prefix.HeatmapFacetCounterTest after
>    [junit4]   2> INFORMACIÓN: Validated 17 cells, 4 non-zero
>    [junit4]   2> feb 11, 2015 7:30:34 AM
> org.apache.lucene.spatial.prefix.HeatmapFacetCounterTest after
>    [junit4]   2> INFORMACIÓN: Validated 4 cells, 4 non-zero
>    [junit4]   2> feb 11, 2015 7:30:34 AM
> org.apache.lucene.spatial.prefix.HeatmapFacetCounterTest after
>    [junit4]   2> INFORMACIÓN: Validated 21 cells, 3 non-zero
>    [junit4]   2> feb 11, 2015 7:30:34 AM
> org.apache.lucene.spatial.prefix.HeatmapFacetCounterTest after
>    [junit4]   2> INFORMACIÓN: Validated 14 cells, 3 non-zero
>    [junit4]   2> feb 11, 2015 7:30:34 AM
> org.apache.lucene.spatial.prefix.HeatmapFacetCounterTest after
>    [junit4]   2> INFORMACIÓN: Validated 15 cells, 4 non-zero
>    [junit4]   2> feb 11, 2015 7:30:34 AM
> org.apache.lucene.spatial.prefix.HeatmapFacetCounterTest after
>    [junit4]   2> INFORMACIÓN: Validated 17 cells, 2 non-zero
>    [junit4]   2> feb 11, 2015 7:30:34 AM
> org.apache.lucene.spatial.prefix.HeatmapFacetCounterTest after
>    [junit4]   2> INFORMACIÓN: Validated 26 cells, 2 non-zero
>    [junit4]   2> feb 11, 2015 7:30:34 AM
> org.apache.lucene.spatial.prefix.HeatmapFacetCounterTest after
>    [junit4]   2> INFORMACIÓN: Validated 13 cells, 6 non-zero
>    [junit4]   2> feb 11, 2015 7:30:34 AM
> org.apache.lucene.spatial.prefix.HeatmapFacetCounterTest after
>    [junit4]   2> INFORMACIÓN: Validated 21 cells, 3 non-zero
>    [junit4]   2> feb 11, 2015 7:30:34 AM
> org.apache.lucene.spatial.prefix.HeatmapFacetCounterTest after
>    [junit4]   2> INFORMACIÓN: Validated 12 cells, 4 non-zero
>    [junit4]   2> feb 11, 2015 7:30:34 AM
> org.apache.lucene.spatial.prefix.HeatmapFacetCounterTest after
>    [junit4]   2> INFORMACIÓN: Validated 5 cells, 3 non-zero
>    [junit4]   2> feb 11, 2015 7:30:34 AM
> org.apache.lucene.spatial.prefix.HeatmapFacetCounterTest after
>    [junit4]   2> INFORMACIÓN: Validated 14 cells, 1 non-zero
>    [junit4]   2> feb 11, 2015 7:30:34 AM
> org.apache.lucene.spatial.prefix.HeatmapFacetCounterTest after
>    [junit4]   2> INFORMACIÓN: Validated 17 cells, 6 non-zero
>    [junit4]   2> feb 11, 2015 7:30:34 AM
> org.apache.lucene.spatial.prefix.HeatmapFacetCounterTest after
>    [junit4]   2> INFORMACIÓN: Validated 4 cells, 4 non-zero
>    [junit4]   2> NOTE: test params are: codec=Asserting(Lucene50):
> {HeatmapFacetCounterTest=FSTOrd50,
> id=TestBloomFilteredLucenePostings(BloomFilteringPostingsFormat(Lucene50(blocksize=128)))},
> docValues:{}, sim=RandomSimilarityProvider(queryNorm=true,coord=yes): {},
> locale=es_UY, timezone=Pacific/Johnston
>    [junit4]   2> NOTE: Linux 3.13.0-45-generic i386/Oracle Corporation
> 1.8.0_31 (32-bit)/cpus=8,threads=1,free=209467592,total=323534848
>    [junit4]   2> NOTE: All tests run in this JVM:
> [QueryEqualsHashCodeTest, TestTestFramework,
> RandomSpatialOpFuzzyPrefixTreeTest, PortedSolr3Test,
> TestRecursivePrefixTreeStrategy, TestBBoxStrategy, SpatialPrefixTreeTest,
> SpatialArgsParserTest, JtsPolygonTest, HeatmapFacetCounterTest]
>    [junit4] Completed on J0 in 0.63s, 22 tests, 1 failure <<< FAILURES!
>
> [...truncated 25 lines...]
> BUILD FAILED
> /mnt/ssd/jenkins/workspace/Lucene-Solr-trunk-Linux/build.xml:519: The
> following error occurred while executing this line:
> /mnt/ssd/jenkins/workspace/Lucene-Solr-trunk-Linux/build.xml:467: The
> following error occurred while executing this line:
> /mnt/ssd/jenkins/workspace/Lucene-Solr-trunk-Linux/build.xml:61: The
> following error occurred while executing this line:
> /mnt/ssd/jenkins/workspace/Lucene-Solr-trunk-Linux/extra-targets.xml:39:
> The following error occurred while executing this line:
> /mnt/ssd/jenkins/workspace/Lucene-Solr-trunk-Linux/lucene/build.xml:456:
> The following error occurred while executing this line:
> /mnt/ssd/jenkins/workspace/Lucene-Solr-trunk-Linux/lucene/common-build.xml:2078:
> The following error occurred while executing this line:
> /mnt/ssd/jenkins/workspace/Lucene-Solr-trunk-Linux/lucene/module-build.xml:58:
> The following error occurred while executing this line:
> /mnt/ssd/jenkins/workspace/Lucene-Solr-trunk-Linux/lucene/common-build.xml:1348:
> The following error occurred while executing this line:
> /mnt/ssd/jenkins/workspace/Lucene-Solr-trunk-Linux/lucene/common-build.xml:956:
> There were test failures: 18 suites, 256 tests, 1 failure, 3 ignored (2
> assumptions)
>
> Total time: 28 minutes 4 seconds
> Build step 'Invoke Ant' marked build as failure
> [description-setter] Description set: Java: 32bit/jdk1.8.0_31 -server
> -XX:+UseConcMarkSweepGC
> Archiving artifacts
> Recording test results
> Email was triggered for: Failure - Any
> Sending email for trigger: Failure - Any
>
>
>
>
> ---------------------------------------------------------------------
> To unsubscribe, e-mail: dev-unsubscribe@lucene.apache.org
> For additional commands, e-mail: dev-help@lucene.apache.org
>

Mime
View raw message