lucene-dev mailing list archives

Site index · List index
Message view « Date » · « Thread »
Top « Date » · « Thread »
From Policeman Jenkins Server <jenk...@thetaphi.de>
Subject [JENKINS] Lucene-Solr-trunk-Windows (32bit/jdk1.8.0_31) - Build # 4466 - Still Failing!
Date Fri, 06 Feb 2015 07:36:30 GMT
Build: http://jenkins.thetaphi.de/job/Lucene-Solr-trunk-Windows/4466/
Java: 32bit/jdk1.8.0_31 -server -XX:+UseConcMarkSweepGC

5 tests failed.
FAILED:  junit.framework.TestSuite.org.apache.solr.cloud.BasicDistributedZk2Test

Error Message:
Could not remove the following files (in the order of attempts):    C:\Users\JenkinsSlave\workspace\Lucene-Solr-trunk-Windows\solr\build\solr-core\test\J0\temp\solr.cloud.BasicDistributedZk2Test AD67B4CAAB2A4EBC-001\tempDir-002: java.nio.file.AccessDeniedException: C:\Users\JenkinsSlave\workspace\Lucene-Solr-trunk-Windows\solr\build\solr-core\test\J0\temp\solr.cloud.BasicDistributedZk2Test AD67B4CAAB2A4EBC-001\tempDir-002    C:\Users\JenkinsSlave\workspace\Lucene-Solr-trunk-Windows\solr\build\solr-core\test\J0\temp\solr.cloud.BasicDistributedZk2Test AD67B4CAAB2A4EBC-001: java.nio.file.DirectoryNotEmptyException: C:\Users\JenkinsSlave\workspace\Lucene-Solr-trunk-Windows\solr\build\solr-core\test\J0\temp\solr.cloud.BasicDistributedZk2Test AD67B4CAAB2A4EBC-001 

Stack Trace:
java.io.IOException: Could not remove the following files (in the order of attempts):
   C:\Users\JenkinsSlave\workspace\Lucene-Solr-trunk-Windows\solr\build\solr-core\test\J0\temp\solr.cloud.BasicDistributedZk2Test AD67B4CAAB2A4EBC-001\tempDir-002: java.nio.file.AccessDeniedException: C:\Users\JenkinsSlave\workspace\Lucene-Solr-trunk-Windows\solr\build\solr-core\test\J0\temp\solr.cloud.BasicDistributedZk2Test AD67B4CAAB2A4EBC-001\tempDir-002
   C:\Users\JenkinsSlave\workspace\Lucene-Solr-trunk-Windows\solr\build\solr-core\test\J0\temp\solr.cloud.BasicDistributedZk2Test AD67B4CAAB2A4EBC-001: java.nio.file.DirectoryNotEmptyException: C:\Users\JenkinsSlave\workspace\Lucene-Solr-trunk-Windows\solr\build\solr-core\test\J0\temp\solr.cloud.BasicDistributedZk2Test AD67B4CAAB2A4EBC-001

	at __randomizedtesting.SeedInfo.seed([AD67B4CAAB2A4EBC]:0)
	at org.apache.lucene.util.IOUtils.rm(IOUtils.java:286)
	at org.apache.lucene.util.TestRuleTemporaryFilesCleanup.afterAlways(TestRuleTemporaryFilesCleanup.java:170)
	at com.carrotsearch.randomizedtesting.rules.TestRuleAdapter$1.afterAlways(TestRuleAdapter.java:31)
	at com.carrotsearch.randomizedtesting.rules.StatementAdapter.evaluate(StatementAdapter.java:43)
	at com.carrotsearch.randomizedtesting.rules.StatementAdapter.evaluate(StatementAdapter.java:36)
	at org.apache.lucene.util.TestRuleAssertionsRequired$1.evaluate(TestRuleAssertionsRequired.java:54)
	at org.apache.lucene.util.TestRuleMarkFailure$1.evaluate(TestRuleMarkFailure.java:48)
	at org.apache.lucene.util.TestRuleIgnoreAfterMaxFailures$1.evaluate(TestRuleIgnoreAfterMaxFailures.java:65)
	at org.apache.lucene.util.TestRuleIgnoreTestSuites$1.evaluate(TestRuleIgnoreTestSuites.java:55)
	at com.carrotsearch.randomizedtesting.rules.StatementAdapter.evaluate(StatementAdapter.java:36)
	at com.carrotsearch.randomizedtesting.ThreadLeakControl$StatementRunner.run(ThreadLeakControl.java:365)
	at java.lang.Thread.run(Thread.java:745)


FAILED:  junit.framework.TestSuite.org.apache.solr.core.TestSolrConfigHandler

Error Message:
Could not remove the following files (in the order of attempts):    C:\Users\JenkinsSlave\workspace\Lucene-Solr-trunk-Windows\solr\build\solr-core\test\J0\temp\solr.core.TestSolrConfigHandler AD67B4CAAB2A4EBC-001\tempDir-010\collection1\conf\params.json: java.nio.file.FileSystemException: C:\Users\JenkinsSlave\workspace\Lucene-Solr-trunk-Windows\solr\build\solr-core\test\J0\temp\solr.core.TestSolrConfigHandler AD67B4CAAB2A4EBC-001\tempDir-010\collection1\conf\params.json: The process cannot access the file because it is being used by another process.     C:\Users\JenkinsSlave\workspace\Lucene-Solr-trunk-Windows\solr\build\solr-core\test\J0\temp\solr.core.TestSolrConfigHandler AD67B4CAAB2A4EBC-001\tempDir-010\collection1\conf: java.nio.file.DirectoryNotEmptyException: C:\Users\JenkinsSlave\workspace\Lucene-Solr-trunk-Windows\solr\build\solr-core\test\J0\temp\solr.core.TestSolrConfigHandler AD67B4CAAB2A4EBC-001\tempDir-010\collection1\conf    C:\Users\JenkinsSlave\workspace\Lucene-Solr-trunk-Windows\solr\build\solr-core\test\J0\temp\solr.core.TestSolrConfigHandler AD67B4CAAB2A4EBC-001\tempDir-010\collection1: java.nio.file.DirectoryNotEmptyException: C:\Users\JenkinsSlave\workspace\Lucene-Solr-trunk-Windows\solr\build\solr-core\test\J0\temp\solr.core.TestSolrConfigHandler AD67B4CAAB2A4EBC-001\tempDir-010\collection1    C:\Users\JenkinsSlave\workspace\Lucene-Solr-trunk-Windows\solr\build\solr-core\test\J0\temp\solr.core.TestSolrConfigHandler AD67B4CAAB2A4EBC-001\tempDir-010: java.nio.file.DirectoryNotEmptyException: C:\Users\JenkinsSlave\workspace\Lucene-Solr-trunk-Windows\solr\build\solr-core\test\J0\temp\solr.core.TestSolrConfigHandler AD67B4CAAB2A4EBC-001\tempDir-010 

Stack Trace:
java.io.IOException: Could not remove the following files (in the order of attempts):
   C:\Users\JenkinsSlave\workspace\Lucene-Solr-trunk-Windows\solr\build\solr-core\test\J0\temp\solr.core.TestSolrConfigHandler AD67B4CAAB2A4EBC-001\tempDir-010\collection1\conf\params.json: java.nio.file.FileSystemException: C:\Users\JenkinsSlave\workspace\Lucene-Solr-trunk-Windows\solr\build\solr-core\test\J0\temp\solr.core.TestSolrConfigHandler AD67B4CAAB2A4EBC-001\tempDir-010\collection1\conf\params.json: The process cannot access the file because it is being used by another process.

   C:\Users\JenkinsSlave\workspace\Lucene-Solr-trunk-Windows\solr\build\solr-core\test\J0\temp\solr.core.TestSolrConfigHandler AD67B4CAAB2A4EBC-001\tempDir-010\collection1\conf: java.nio.file.DirectoryNotEmptyException: C:\Users\JenkinsSlave\workspace\Lucene-Solr-trunk-Windows\solr\build\solr-core\test\J0\temp\solr.core.TestSolrConfigHandler AD67B4CAAB2A4EBC-001\tempDir-010\collection1\conf
   C:\Users\JenkinsSlave\workspace\Lucene-Solr-trunk-Windows\solr\build\solr-core\test\J0\temp\solr.core.TestSolrConfigHandler AD67B4CAAB2A4EBC-001\tempDir-010\collection1: java.nio.file.DirectoryNotEmptyException: C:\Users\JenkinsSlave\workspace\Lucene-Solr-trunk-Windows\solr\build\solr-core\test\J0\temp\solr.core.TestSolrConfigHandler AD67B4CAAB2A4EBC-001\tempDir-010\collection1
   C:\Users\JenkinsSlave\workspace\Lucene-Solr-trunk-Windows\solr\build\solr-core\test\J0\temp\solr.core.TestSolrConfigHandler AD67B4CAAB2A4EBC-001\tempDir-010: java.nio.file.DirectoryNotEmptyException: C:\Users\JenkinsSlave\workspace\Lucene-Solr-trunk-Windows\solr\build\solr-core\test\J0\temp\solr.core.TestSolrConfigHandler AD67B4CAAB2A4EBC-001\tempDir-010

	at __randomizedtesting.SeedInfo.seed([AD67B4CAAB2A4EBC]:0)
	at org.apache.lucene.util.IOUtils.rm(IOUtils.java:286)
	at org.apache.lucene.util.TestRuleTemporaryFilesCleanup.afterAlways(TestRuleTemporaryFilesCleanup.java:170)
	at com.carrotsearch.randomizedtesting.rules.TestRuleAdapter$1.afterAlways(TestRuleAdapter.java:31)
	at com.carrotsearch.randomizedtesting.rules.StatementAdapter.evaluate(StatementAdapter.java:43)
	at com.carrotsearch.randomizedtesting.rules.StatementAdapter.evaluate(StatementAdapter.java:36)
	at org.apache.lucene.util.TestRuleAssertionsRequired$1.evaluate(TestRuleAssertionsRequired.java:54)
	at org.apache.lucene.util.TestRuleMarkFailure$1.evaluate(TestRuleMarkFailure.java:48)
	at org.apache.lucene.util.TestRuleIgnoreAfterMaxFailures$1.evaluate(TestRuleIgnoreAfterMaxFailures.java:65)
	at org.apache.lucene.util.TestRuleIgnoreTestSuites$1.evaluate(TestRuleIgnoreTestSuites.java:55)
	at com.carrotsearch.randomizedtesting.rules.StatementAdapter.evaluate(StatementAdapter.java:36)
	at com.carrotsearch.randomizedtesting.ThreadLeakControl$StatementRunner.run(ThreadLeakControl.java:365)
	at java.lang.Thread.run(Thread.java:745)


FAILED:  org.apache.solr.handler.TestReplicationHandlerBackup.doTestBackup

Error Message:
Could not remove the following files (in the order of attempts):    C:\Users\JenkinsSlave\workspace\Lucene-Solr-trunk-Windows\solr\build\solr-core\test\J0\temp\solr.handler.TestReplicationHandlerBackup AD67B4CAAB2A4EBC-001\solr-instance-001\collection1: java.nio.file.DirectoryNotEmptyException: C:\Users\JenkinsSlave\workspace\Lucene-Solr-trunk-Windows\solr\build\solr-core\test\J0\temp\solr.handler.TestReplicationHandlerBackup AD67B4CAAB2A4EBC-001\solr-instance-001\collection1    C:\Users\JenkinsSlave\workspace\Lucene-Solr-trunk-Windows\solr\build\solr-core\test\J0\temp\solr.handler.TestReplicationHandlerBackup AD67B4CAAB2A4EBC-001\solr-instance-001: java.nio.file.DirectoryNotEmptyException: C:\Users\JenkinsSlave\workspace\Lucene-Solr-trunk-Windows\solr\build\solr-core\test\J0\temp\solr.handler.TestReplicationHandlerBackup AD67B4CAAB2A4EBC-001\solr-instance-001 

Stack Trace:
java.io.IOException: Could not remove the following files (in the order of attempts):
   C:\Users\JenkinsSlave\workspace\Lucene-Solr-trunk-Windows\solr\build\solr-core\test\J0\temp\solr.handler.TestReplicationHandlerBackup AD67B4CAAB2A4EBC-001\solr-instance-001\collection1: java.nio.file.DirectoryNotEmptyException: C:\Users\JenkinsSlave\workspace\Lucene-Solr-trunk-Windows\solr\build\solr-core\test\J0\temp\solr.handler.TestReplicationHandlerBackup AD67B4CAAB2A4EBC-001\solr-instance-001\collection1
   C:\Users\JenkinsSlave\workspace\Lucene-Solr-trunk-Windows\solr\build\solr-core\test\J0\temp\solr.handler.TestReplicationHandlerBackup AD67B4CAAB2A4EBC-001\solr-instance-001: java.nio.file.DirectoryNotEmptyException: C:\Users\JenkinsSlave\workspace\Lucene-Solr-trunk-Windows\solr\build\solr-core\test\J0\temp\solr.handler.TestReplicationHandlerBackup AD67B4CAAB2A4EBC-001\solr-instance-001

	at __randomizedtesting.SeedInfo.seed([AD67B4CAAB2A4EBC:ECEC94AF8C94BDF3]:0)
	at org.apache.lucene.util.IOUtils.rm(IOUtils.java:286)
	at org.apache.solr.handler.TestReplicationHandler$SolrInstance.tearDown(TestReplicationHandler.java:1509)
	at org.apache.solr.handler.TestReplicationHandlerBackup.tearDown(TestReplicationHandlerBackup.java:115)
	at sun.reflect.NativeMethodAccessorImpl.invoke0(Native Method)
	at sun.reflect.NativeMethodAccessorImpl.invoke(NativeMethodAccessorImpl.java:62)
	at sun.reflect.DelegatingMethodAccessorImpl.invoke(DelegatingMethodAccessorImpl.java:43)
	at java.lang.reflect.Method.invoke(Method.java:483)
	at com.carrotsearch.randomizedtesting.RandomizedRunner.invoke(RandomizedRunner.java:1618)
	at com.carrotsearch.randomizedtesting.RandomizedRunner$8.evaluate(RandomizedRunner.java:885)
	at com.carrotsearch.randomizedtesting.rules.SystemPropertiesRestoreRule$1.evaluate(SystemPropertiesRestoreRule.java:53)
	at org.apache.lucene.util.TestRuleSetupTeardownChained$1.evaluate(TestRuleSetupTeardownChained.java:50)
	at org.apache.lucene.util.AbstractBeforeAfterRule$1.evaluate(AbstractBeforeAfterRule.java:46)
	at com.carrotsearch.randomizedtesting.rules.SystemPropertiesInvariantRule$1.evaluate(SystemPropertiesInvariantRule.java:55)
	at org.apache.lucene.util.TestRuleThreadAndTestName$1.evaluate(TestRuleThreadAndTestName.java:49)
	at org.apache.lucene.util.TestRuleIgnoreAfterMaxFailures$1.evaluate(TestRuleIgnoreAfterMaxFailures.java:65)
	at org.apache.lucene.util.TestRuleMarkFailure$1.evaluate(TestRuleMarkFailure.java:48)
	at com.carrotsearch.randomizedtesting.rules.StatementAdapter.evaluate(StatementAdapter.java:36)
	at com.carrotsearch.randomizedtesting.ThreadLeakControl$StatementRunner.run(ThreadLeakControl.java:365)
	at com.carrotsearch.randomizedtesting.ThreadLeakControl.forkTimeoutingTask(ThreadLeakControl.java:798)
	at com.carrotsearch.randomizedtesting.ThreadLeakControl$3.evaluate(ThreadLeakControl.java:458)
	at com.carrotsearch.randomizedtesting.RandomizedRunner.runSingleTest(RandomizedRunner.java:836)
	at com.carrotsearch.randomizedtesting.RandomizedRunner$3.evaluate(RandomizedRunner.java:738)
	at com.carrotsearch.randomizedtesting.RandomizedRunner$4.evaluate(RandomizedRunner.java:772)
	at com.carrotsearch.randomizedtesting.RandomizedRunner$5.evaluate(RandomizedRunner.java:783)
	at com.carrotsearch.randomizedtesting.rules.StatementAdapter.evaluate(StatementAdapter.java:36)
	at com.carrotsearch.randomizedtesting.rules.SystemPropertiesRestoreRule$1.evaluate(SystemPropertiesRestoreRule.java:53)
	at org.apache.lucene.util.AbstractBeforeAfterRule$1.evaluate(AbstractBeforeAfterRule.java:46)
	at org.apache.lucene.util.TestRuleStoreClassName$1.evaluate(TestRuleStoreClassName.java:42)
	at com.carrotsearch.randomizedtesting.rules.SystemPropertiesInvariantRule$1.evaluate(SystemPropertiesInvariantRule.java:55)
	at com.carrotsearch.randomizedtesting.rules.NoShadowingOrOverridesOnMethodsRule$1.evaluate(NoShadowingOrOverridesOnMethodsRule.java:39)
	at com.carrotsearch.randomizedtesting.rules.NoShadowingOrOverridesOnMethodsRule$1.evaluate(NoShadowingOrOverridesOnMethodsRule.java:39)
	at com.carrotsearch.randomizedtesting.rules.StatementAdapter.evaluate(StatementAdapter.java:36)
	at com.carrotsearch.randomizedtesting.rules.StatementAdapter.evaluate(StatementAdapter.java:36)
	at com.carrotsearch.randomizedtesting.rules.StatementAdapter.evaluate(StatementAdapter.java:36)
	at org.apache.lucene.util.TestRuleAssertionsRequired$1.evaluate(TestRuleAssertionsRequired.java:54)
	at org.apache.lucene.util.TestRuleMarkFailure$1.evaluate(TestRuleMarkFailure.java:48)
	at org.apache.lucene.util.TestRuleIgnoreAfterMaxFailures$1.evaluate(TestRuleIgnoreAfterMaxFailures.java:65)
	at org.apache.lucene.util.TestRuleIgnoreTestSuites$1.evaluate(TestRuleIgnoreTestSuites.java:55)
	at com.carrotsearch.randomizedtesting.rules.StatementAdapter.evaluate(StatementAdapter.java:36)
	at com.carrotsearch.randomizedtesting.ThreadLeakControl$StatementRunner.run(ThreadLeakControl.java:365)
	at java.lang.Thread.run(Thread.java:745)


FAILED:  org.apache.solr.handler.TestReplicationHandlerBackup.testBackupOnCommit

Error Message:
Could not remove the following files (in the order of attempts):    C:\Users\JenkinsSlave\workspace\Lucene-Solr-trunk-Windows\solr\build\solr-core\test\J0\temp\solr.handler.TestReplicationHandlerBackup AD67B4CAAB2A4EBC-001\solr-instance-002\collection1: java.nio.file.DirectoryNotEmptyException: C:\Users\JenkinsSlave\workspace\Lucene-Solr-trunk-Windows\solr\build\solr-core\test\J0\temp\solr.handler.TestReplicationHandlerBackup AD67B4CAAB2A4EBC-001\solr-instance-002\collection1    C:\Users\JenkinsSlave\workspace\Lucene-Solr-trunk-Windows\solr\build\solr-core\test\J0\temp\solr.handler.TestReplicationHandlerBackup AD67B4CAAB2A4EBC-001\solr-instance-002: java.nio.file.DirectoryNotEmptyException: C:\Users\JenkinsSlave\workspace\Lucene-Solr-trunk-Windows\solr\build\solr-core\test\J0\temp\solr.handler.TestReplicationHandlerBackup AD67B4CAAB2A4EBC-001\solr-instance-002 

Stack Trace:
java.io.IOException: Could not remove the following files (in the order of attempts):
   C:\Users\JenkinsSlave\workspace\Lucene-Solr-trunk-Windows\solr\build\solr-core\test\J0\temp\solr.handler.TestReplicationHandlerBackup AD67B4CAAB2A4EBC-001\solr-instance-002\collection1: java.nio.file.DirectoryNotEmptyException: C:\Users\JenkinsSlave\workspace\Lucene-Solr-trunk-Windows\solr\build\solr-core\test\J0\temp\solr.handler.TestReplicationHandlerBackup AD67B4CAAB2A4EBC-001\solr-instance-002\collection1
   C:\Users\JenkinsSlave\workspace\Lucene-Solr-trunk-Windows\solr\build\solr-core\test\J0\temp\solr.handler.TestReplicationHandlerBackup AD67B4CAAB2A4EBC-001\solr-instance-002: java.nio.file.DirectoryNotEmptyException: C:\Users\JenkinsSlave\workspace\Lucene-Solr-trunk-Windows\solr\build\solr-core\test\J0\temp\solr.handler.TestReplicationHandlerBackup AD67B4CAAB2A4EBC-001\solr-instance-002

	at __randomizedtesting.SeedInfo.seed([AD67B4CAAB2A4EBC:848F5A21D4D2F2A5]:0)
	at org.apache.lucene.util.IOUtils.rm(IOUtils.java:286)
	at org.apache.solr.handler.TestReplicationHandler$SolrInstance.tearDown(TestReplicationHandler.java:1509)
	at org.apache.solr.handler.TestReplicationHandlerBackup.tearDown(TestReplicationHandlerBackup.java:115)
	at sun.reflect.NativeMethodAccessorImpl.invoke0(Native Method)
	at sun.reflect.NativeMethodAccessorImpl.invoke(NativeMethodAccessorImpl.java:62)
	at sun.reflect.DelegatingMethodAccessorImpl.invoke(DelegatingMethodAccessorImpl.java:43)
	at java.lang.reflect.Method.invoke(Method.java:483)
	at com.carrotsearch.randomizedtesting.RandomizedRunner.invoke(RandomizedRunner.java:1618)
	at com.carrotsearch.randomizedtesting.RandomizedRunner$8.evaluate(RandomizedRunner.java:885)
	at com.carrotsearch.randomizedtesting.rules.SystemPropertiesRestoreRule$1.evaluate(SystemPropertiesRestoreRule.java:53)
	at org.apache.lucene.util.TestRuleSetupTeardownChained$1.evaluate(TestRuleSetupTeardownChained.java:50)
	at org.apache.lucene.util.AbstractBeforeAfterRule$1.evaluate(AbstractBeforeAfterRule.java:46)
	at com.carrotsearch.randomizedtesting.rules.SystemPropertiesInvariantRule$1.evaluate(SystemPropertiesInvariantRule.java:55)
	at org.apache.lucene.util.TestRuleThreadAndTestName$1.evaluate(TestRuleThreadAndTestName.java:49)
	at org.apache.lucene.util.TestRuleIgnoreAfterMaxFailures$1.evaluate(TestRuleIgnoreAfterMaxFailures.java:65)
	at org.apache.lucene.util.TestRuleMarkFailure$1.evaluate(TestRuleMarkFailure.java:48)
	at com.carrotsearch.randomizedtesting.rules.StatementAdapter.evaluate(StatementAdapter.java:36)
	at com.carrotsearch.randomizedtesting.ThreadLeakControl$StatementRunner.run(ThreadLeakControl.java:365)
	at com.carrotsearch.randomizedtesting.ThreadLeakControl.forkTimeoutingTask(ThreadLeakControl.java:798)
	at com.carrotsearch.randomizedtesting.ThreadLeakControl$3.evaluate(ThreadLeakControl.java:458)
	at com.carrotsearch.randomizedtesting.RandomizedRunner.runSingleTest(RandomizedRunner.java:836)
	at com.carrotsearch.randomizedtesting.RandomizedRunner$3.evaluate(RandomizedRunner.java:738)
	at com.carrotsearch.randomizedtesting.RandomizedRunner$4.evaluate(RandomizedRunner.java:772)
	at com.carrotsearch.randomizedtesting.RandomizedRunner$5.evaluate(RandomizedRunner.java:783)
	at com.carrotsearch.randomizedtesting.rules.StatementAdapter.evaluate(StatementAdapter.java:36)
	at com.carrotsearch.randomizedtesting.rules.SystemPropertiesRestoreRule$1.evaluate(SystemPropertiesRestoreRule.java:53)
	at org.apache.lucene.util.AbstractBeforeAfterRule$1.evaluate(AbstractBeforeAfterRule.java:46)
	at org.apache.lucene.util.TestRuleStoreClassName$1.evaluate(TestRuleStoreClassName.java:42)
	at com.carrotsearch.randomizedtesting.rules.SystemPropertiesInvariantRule$1.evaluate(SystemPropertiesInvariantRule.java:55)
	at com.carrotsearch.randomizedtesting.rules.NoShadowingOrOverridesOnMethodsRule$1.evaluate(NoShadowingOrOverridesOnMethodsRule.java:39)
	at com.carrotsearch.randomizedtesting.rules.NoShadowingOrOverridesOnMethodsRule$1.evaluate(NoShadowingOrOverridesOnMethodsRule.java:39)
	at com.carrotsearch.randomizedtesting.rules.StatementAdapter.evaluate(StatementAdapter.java:36)
	at com.carrotsearch.randomizedtesting.rules.StatementAdapter.evaluate(StatementAdapter.java:36)
	at com.carrotsearch.randomizedtesting.rules.StatementAdapter.evaluate(StatementAdapter.java:36)
	at org.apache.lucene.util.TestRuleAssertionsRequired$1.evaluate(TestRuleAssertionsRequired.java:54)
	at org.apache.lucene.util.TestRuleMarkFailure$1.evaluate(TestRuleMarkFailure.java:48)
	at org.apache.lucene.util.TestRuleIgnoreAfterMaxFailures$1.evaluate(TestRuleIgnoreAfterMaxFailures.java:65)
	at org.apache.lucene.util.TestRuleIgnoreTestSuites$1.evaluate(TestRuleIgnoreTestSuites.java:55)
	at com.carrotsearch.randomizedtesting.rules.StatementAdapter.evaluate(StatementAdapter.java:36)
	at com.carrotsearch.randomizedtesting.ThreadLeakControl$StatementRunner.run(ThreadLeakControl.java:365)
	at java.lang.Thread.run(Thread.java:745)


FAILED:  org.apache.solr.cloud.ReplicationFactorTest.test

Error Message:
org.apache.http.NoHttpResponseException: The target server failed to respond

Stack Trace:
org.apache.solr.client.solrj.SolrServerException: org.apache.http.NoHttpResponseException: The target server failed to respond
	at org.apache.solr.client.solrj.impl.CloudSolrClient.requestWithRetryOnStaleState(CloudSolrClient.java:865)
	at org.apache.solr.client.solrj.impl.CloudSolrClient.request(CloudSolrClient.java:730)
	at org.apache.solr.cloud.ReplicationFactorTest.testRf3(ReplicationFactorTest.java:284)
	at org.apache.solr.cloud.ReplicationFactorTest.test(ReplicationFactorTest.java:112)
	at sun.reflect.NativeMethodAccessorImpl.invoke0(Native Method)
	at sun.reflect.NativeMethodAccessorImpl.invoke(NativeMethodAccessorImpl.java:62)
	at sun.reflect.DelegatingMethodAccessorImpl.invoke(DelegatingMethodAccessorImpl.java:43)
	at java.lang.reflect.Method.invoke(Method.java:483)
	at com.carrotsearch.randomizedtesting.RandomizedRunner.invoke(RandomizedRunner.java:1618)
	at com.carrotsearch.randomizedtesting.RandomizedRunner$6.evaluate(RandomizedRunner.java:827)
	at com.carrotsearch.randomizedtesting.RandomizedRunner$7.evaluate(RandomizedRunner.java:863)
	at com.carrotsearch.randomizedtesting.RandomizedRunner$8.evaluate(RandomizedRunner.java:877)
	at org.apache.solr.BaseDistributedSearchTestCase$ShardsRepeatRule$ShardsFixedStatement.callStatement(BaseDistributedSearchTestCase.java:940)
	at org.apache.solr.BaseDistributedSearchTestCase$ShardsRepeatRule$ShardsStatement.evaluate(BaseDistributedSearchTestCase.java:915)
	at com.carrotsearch.randomizedtesting.rules.SystemPropertiesRestoreRule$1.evaluate(SystemPropertiesRestoreRule.java:53)
	at org.apache.lucene.util.TestRuleSetupTeardownChained$1.evaluate(TestRuleSetupTeardownChained.java:50)
	at org.apache.lucene.util.AbstractBeforeAfterRule$1.evaluate(AbstractBeforeAfterRule.java:46)
	at com.carrotsearch.randomizedtesting.rules.SystemPropertiesInvariantRule$1.evaluate(SystemPropertiesInvariantRule.java:55)
	at org.apache.lucene.util.TestRuleThreadAndTestName$1.evaluate(TestRuleThreadAndTestName.java:49)
	at org.apache.lucene.util.TestRuleIgnoreAfterMaxFailures$1.evaluate(TestRuleIgnoreAfterMaxFailures.java:65)
	at org.apache.lucene.util.TestRuleMarkFailure$1.evaluate(TestRuleMarkFailure.java:48)
	at com.carrotsearch.randomizedtesting.rules.StatementAdapter.evaluate(StatementAdapter.java:36)
	at com.carrotsearch.randomizedtesting.ThreadLeakControl$StatementRunner.run(ThreadLeakControl.java:365)
	at com.carrotsearch.randomizedtesting.ThreadLeakControl.forkTimeoutingTask(ThreadLeakControl.java:798)
	at com.carrotsearch.randomizedtesting.ThreadLeakControl$3.evaluate(ThreadLeakControl.java:458)
	at com.carrotsearch.randomizedtesting.RandomizedRunner.runSingleTest(RandomizedRunner.java:836)
	at com.carrotsearch.randomizedtesting.RandomizedRunner$3.evaluate(RandomizedRunner.java:738)
	at com.carrotsearch.randomizedtesting.RandomizedRunner$4.evaluate(RandomizedRunner.java:772)
	at com.carrotsearch.randomizedtesting.RandomizedRunner$5.evaluate(RandomizedRunner.java:783)
	at com.carrotsearch.randomizedtesting.rules.StatementAdapter.evaluate(StatementAdapter.java:36)
	at com.carrotsearch.randomizedtesting.rules.SystemPropertiesRestoreRule$1.evaluate(SystemPropertiesRestoreRule.java:53)
	at org.apache.lucene.util.AbstractBeforeAfterRule$1.evaluate(AbstractBeforeAfterRule.java:46)
	at org.apache.lucene.util.TestRuleStoreClassName$1.evaluate(TestRuleStoreClassName.java:42)
	at com.carrotsearch.randomizedtesting.rules.SystemPropertiesInvariantRule$1.evaluate(SystemPropertiesInvariantRule.java:55)
	at com.carrotsearch.randomizedtesting.rules.NoShadowingOrOverridesOnMethodsRule$1.evaluate(NoShadowingOrOverridesOnMethodsRule.java:39)
	at com.carrotsearch.randomizedtesting.rules.NoShadowingOrOverridesOnMethodsRule$1.evaluate(NoShadowingOrOverridesOnMethodsRule.java:39)
	at com.carrotsearch.randomizedtesting.rules.StatementAdapter.evaluate(StatementAdapter.java:36)
	at com.carrotsearch.randomizedtesting.rules.StatementAdapter.evaluate(StatementAdapter.java:36)
	at com.carrotsearch.randomizedtesting.rules.StatementAdapter.evaluate(StatementAdapter.java:36)
	at org.apache.lucene.util.TestRuleAssertionsRequired$1.evaluate(TestRuleAssertionsRequired.java:54)
	at org.apache.lucene.util.TestRuleMarkFailure$1.evaluate(TestRuleMarkFailure.java:48)
	at org.apache.lucene.util.TestRuleIgnoreAfterMaxFailures$1.evaluate(TestRuleIgnoreAfterMaxFailures.java:65)
	at org.apache.lucene.util.TestRuleIgnoreTestSuites$1.evaluate(TestRuleIgnoreTestSuites.java:55)
	at com.carrotsearch.randomizedtesting.rules.StatementAdapter.evaluate(StatementAdapter.java:36)
	at com.carrotsearch.randomizedtesting.ThreadLeakControl$StatementRunner.run(ThreadLeakControl.java:365)
	at java.lang.Thread.run(Thread.java:745)
Caused by: org.apache.http.NoHttpResponseException: The target server failed to respond
	at org.apache.http.impl.conn.DefaultHttpResponseParser.parseHead(DefaultHttpResponseParser.java:143)
	at org.apache.http.impl.conn.DefaultHttpResponseParser.parseHead(DefaultHttpResponseParser.java:57)
	at org.apache.http.impl.io.AbstractMessageParser.parse(AbstractMessageParser.java:260)
	at org.apache.http.impl.AbstractHttpClientConnection.receiveResponseHeader(AbstractHttpClientConnection.java:283)
	at org.apache.http.impl.conn.DefaultClientConnection.receiveResponseHeader(DefaultClientConnection.java:251)
	at org.apache.http.impl.conn.ManagedClientConnectionImpl.receiveResponseHeader(ManagedClientConnectionImpl.java:197)
	at org.apache.http.protocol.HttpRequestExecutor.doReceiveResponse(HttpRequestExecutor.java:271)
	at org.apache.http.protocol.HttpRequestExecutor.execute(HttpRequestExecutor.java:123)
	at org.apache.http.impl.client.DefaultRequestDirector.tryExecute(DefaultRequestDirector.java:682)
	at org.apache.http.impl.client.DefaultRequestDirector.execute(DefaultRequestDirector.java:486)
	at org.apache.http.impl.client.AbstractHttpClient.doExecute(AbstractHttpClient.java:863)
	at org.apache.http.impl.client.CloseableHttpClient.execute(CloseableHttpClient.java:82)
	at org.apache.http.impl.client.CloseableHttpClient.execute(CloseableHttpClient.java:106)
	at org.apache.http.impl.client.CloseableHttpClient.execute(CloseableHttpClient.java:57)
	at org.apache.solr.client.solrj.impl.HttpSolrClient.executeMethod(HttpSolrClient.java:464)
	at org.apache.solr.client.solrj.impl.HttpSolrClient.request(HttpSolrClient.java:214)
	at org.apache.solr.client.solrj.impl.HttpSolrClient.request(HttpSolrClient.java:210)
	at org.apache.solr.client.solrj.impl.LBHttpSolrClient.doRequest(LBHttpSolrClient.java:370)
	at org.apache.solr.client.solrj.impl.LBHttpSolrClient.request(LBHttpSolrClient.java:325)
	at org.apache.solr.client.solrj.impl.CloudSolrClient$2.call(CloudSolrClient.java:546)
	at org.apache.solr.client.solrj.impl.CloudSolrClient$2.call(CloudSolrClient.java:543)
	at java.util.concurrent.FutureTask.run(FutureTask.java:266)
	at java.util.concurrent.ThreadPoolExecutor.runWorker(ThreadPoolExecutor.java:1142)
	at java.util.concurrent.ThreadPoolExecutor$Worker.run(ThreadPoolExecutor.java:617)
	... 1 more




Build Log:
[...truncated 8901 lines...]
   [junit4] Suite: org.apache.solr.handler.TestReplicationHandlerBackup
   [junit4]   2> Creating dataDir: C:\Users\JenkinsSlave\workspace\Lucene-Solr-trunk-Windows\solr\build\solr-core\test\J0\temp\solr.handler.TestReplicationHandlerBackup AD67B4CAAB2A4EBC-001\init-core-data-001
   [junit4]   2> 688582 T3553 oas.SolrTestCaseJ4.setUp ###Starting doTestBackup
   [junit4]   2> 688583 T3553 oas.SolrTestCaseJ4.writeCoreProperties Writing core.properties file to C:\Users\JenkinsSlave\workspace\Lucene-Solr-trunk-Windows\solr\build\solr-core\test\J0\temp\solr.handler.TestReplicationHandlerBackup AD67B4CAAB2A4EBC-001\solr-instance-001\collection1
   [junit4]   2> 688608 T3553 oejs.Server.doStart jetty-9.2.6.v20141205
   [junit4]   2> 688613 T3553 oejsh.ContextHandler.doStart Started o.e.j.s.ServletContextHandler@9b8bb6{/solr,null,AVAILABLE}
   [junit4]   2> 688617 T3553 oejs.AbstractConnector.doStart Started ServerConnector@1d98c01{HTTP/1.1}{127.0.0.1:50936}
   [junit4]   2> 688618 T3553 oejs.Server.doStart Started @694852ms
   [junit4]   2> 688618 T3553 oass.SolrDispatchFilter.init SolrDispatchFilter.init()sun.misc.Launcher$AppClassLoader@387f44
   [junit4]   2> 688618 T3553 oasc.SolrResourceLoader.locateSolrHome JNDI not configured for solr (NoInitialContextEx)
   [junit4]   2> 688618 T3553 oasc.SolrResourceLoader.locateSolrHome using system property solr.solr.home: C:\Users\JenkinsSlave\workspace\Lucene-Solr-trunk-Windows\solr\build\solr-core\test\J0\temp\solr.handler.TestReplicationHandlerBackup AD67B4CAAB2A4EBC-001\solr-instance-001
   [junit4]   2> 688618 T3553 oasc.SolrResourceLoader.<init> new SolrResourceLoader for directory: 'C:\Users\JenkinsSlave\workspace\Lucene-Solr-trunk-Windows\solr\build\solr-core\test\J0\temp\solr.handler.TestReplicationHandlerBackup AD67B4CAAB2A4EBC-001\solr-instance-001\'
   [junit4]   2> 688656 T3553 oasc.ConfigSolr.fromFile Loading container configuration from C:\Users\JenkinsSlave\workspace\Lucene-Solr-trunk-Windows\solr\build\solr-core\test\J0\temp\solr.handler.TestReplicationHandlerBackup AD67B4CAAB2A4EBC-001\solr-instance-001\solr.xml
   [junit4]   2> 688667 T3553 oasc.CorePropertiesLocator.<init> Config-defined core root directory: C:\Users\JenkinsSlave\workspace\Lucene-Solr-trunk-Windows\solr\build\solr-core\test\J0\temp\solr.handler.TestReplicationHandlerBackup AD67B4CAAB2A4EBC-001\solr-instance-001\.
   [junit4]   2> 688667 T3553 oasc.CoreContainer.<init> New CoreContainer 17428780
   [junit4]   2> 688667 T3553 oasc.CoreContainer.load Loading cores into CoreContainer [instanceDir=C:\Users\JenkinsSlave\workspace\Lucene-Solr-trunk-Windows\solr\build\solr-core\test\J0\temp\solr.handler.TestReplicationHandlerBackup AD67B4CAAB2A4EBC-001\solr-instance-001\]
   [junit4]   2> 688668 T3553 oashc.HttpShardHandlerFactory.getParameter Setting socketTimeout to: 90000
   [junit4]   2> 688669 T3553 oashc.HttpShardHandlerFactory.getParameter Setting urlScheme to: 
   [junit4]   2> 688669 T3553 oashc.HttpShardHandlerFactory.getParameter Setting connTimeout to: 15000
   [junit4]   2> 688669 T3553 oashc.HttpShardHandlerFactory.getParameter Setting maxConnectionsPerHost to: 20
   [junit4]   2> 688669 T3553 oashc.HttpShardHandlerFactory.getParameter Setting maxConnections to: 10000
   [junit4]   2> 688669 T3553 oashc.HttpShardHandlerFactory.getParameter Setting corePoolSize to: 0
   [junit4]   2> 688669 T3553 oashc.HttpShardHandlerFactory.getParameter Setting maximumPoolSize to: 2147483647
   [junit4]   2> 688669 T3553 oashc.HttpShardHandlerFactory.getParameter Setting maxThreadIdleTime to: 5
   [junit4]   2> 688671 T3553 oashc.HttpShardHandlerFactory.getParameter Setting sizeOfQueue to: -1
   [junit4]   2> 688671 T3553 oashc.HttpShardHandlerFactory.getParameter Setting fairnessPolicy to: false
   [junit4]   2> 688671 T3553 oashc.HttpShardHandlerFactory.getParameter Setting useRetries to: false
   [junit4]   2> 688671 T3553 oasu.UpdateShardHandler.<init> Creating UpdateShardHandler HTTP client with params: socketTimeout=340000&connTimeout=45000&retry=true
   [junit4]   2> 688671 T3553 oasl.LogWatcher.createWatcher SLF4J impl is org.slf4j.impl.Log4jLoggerFactory
   [junit4]   2> 688671 T3553 oasl.LogWatcher.newRegisteredLogWatcher Registering Log Listener [Log4j (org.slf4j.impl.Log4jLoggerFactory)]
   [junit4]   2> 688671 T3553 oasc.CoreContainer.load Host Name: 127.0.0.1
   [junit4]   2> 688675 T3553 oasc.CorePropertiesLocator.discover Looking for core definitions underneath C:\Users\JenkinsSlave\workspace\Lucene-Solr-trunk-Windows\solr\build\solr-core\test\J0\temp\solr.handler.TestReplicationHandlerBackup AD67B4CAAB2A4EBC-001\solr-instance-001\.
   [junit4]   2> 688677 T3553 oasc.CorePropertiesLocator.discoverUnder Found core collection1 in C:\Users\JenkinsSlave\workspace\Lucene-Solr-trunk-Windows\solr\build\solr-core\test\J0\temp\solr.handler.TestReplicationHandlerBackup AD67B4CAAB2A4EBC-001\solr-instance-001\.\collection1\
   [junit4]   2> 688680 T3553 oasc.CorePropertiesLocator.discover Found 1 core definitions
   [junit4]   2> 688681 T3565 oasc.SolrResourceLoader.<init> new SolrResourceLoader for directory: 'C:\Users\JenkinsSlave\workspace\Lucene-Solr-trunk-Windows\solr\build\solr-core\test\J0\temp\solr.handler.TestReplicationHandlerBackup AD67B4CAAB2A4EBC-001\solr-instance-001\.\collection1\'
   [junit4]   2> 688730 T3565 oasc.SolrConfig.refreshRequestParams current version of requestparams : -1
   [junit4]   2> 688732 T3565 oasc.SolrConfig.<init> Using Lucene MatchVersion: 6.0.0
   [junit4]   2> 688753 T3565 oasc.SolrConfig.<init> Loaded SolrConfig: solrconfig.xml
   [junit4]   2> 688755 T3565 oass.IndexSchema.readSchema Reading Solr Schema from C:\Users\JenkinsSlave\workspace\Lucene-Solr-trunk-Windows\solr\build\solr-core\test\J0\temp\solr.handler.TestReplicationHandlerBackup AD67B4CAAB2A4EBC-001\solr-instance-001\.\collection1\conf\schema.xml
   [junit4]   2> 688759 T3565 oass.IndexSchema.readSchema [collection1] Schema name=test
   [junit4]   2> 688769 T3565 oass.IndexSchema.readSchema unique key field: id
   [junit4]   2> 688769 T3565 oasc.CoreContainer.create Creating SolrCore 'collection1' using configuration from instancedir C:\Users\JenkinsSlave\workspace\Lucene-Solr-trunk-Windows\solr\build\solr-core\test\J0\temp\solr.handler.TestReplicationHandlerBackup AD67B4CAAB2A4EBC-001\solr-instance-001\.\collection1\
   [junit4]   2> 688769 T3565 oasc.SolrCore.initDirectoryFactory org.apache.solr.core.MockDirectoryFactory
   [junit4]   2> 688771 T3565 oasc.SolrCore.<init> [collection1] Opening new SolrCore at C:\Users\JenkinsSlave\workspace\Lucene-Solr-trunk-Windows\solr\build\solr-core\test\J0\temp\solr.handler.TestReplicationHandlerBackup AD67B4CAAB2A4EBC-001\solr-instance-001\.\collection1\, dataDir=C:\Users\JenkinsSlave\workspace\Lucene-Solr-trunk-Windows\solr\build\solr-core\test\J0\temp\solr.handler.TestReplicationHandlerBackup AD67B4CAAB2A4EBC-001\solr-instance-001\collection1\data\
   [junit4]   2> 688771 T3565 oasc.SolrCore.<init> JMX monitoring not detected for core: collection1
   [junit4]   2> 688771 T3565 oasc.CachingDirectoryFactory.get return new directory for C:\Users\JenkinsSlave\workspace\Lucene-Solr-trunk-Windows\solr\build\solr-core\test\J0\temp\solr.handler.TestReplicationHandlerBackup AD67B4CAAB2A4EBC-001\solr-instance-001\collection1\data\
   [junit4]   2> 688771 T3565 oasc.SolrCore.getNewIndexDir New index directory detected: old=null new=C:\Users\JenkinsSlave\workspace\Lucene-Solr-trunk-Windows\solr\build\solr-core\test\J0\temp\solr.handler.TestReplicationHandlerBackup AD67B4CAAB2A4EBC-001\solr-instance-001\collection1\data\index/
   [junit4]   2> 688771 T3565 oasc.SolrCore.initIndex WARN [collection1] Solr index directory 'C:\Users\JenkinsSlave\workspace\Lucene-Solr-trunk-Windows\solr\build\solr-core\test\J0\temp\solr.handler.TestReplicationHandlerBackup AD67B4CAAB2A4EBC-001\solr-instance-001\collection1\data\index' doesn't exist. Creating new index...
   [junit4]   2> 688772 T3565 oasc.CachingDirectoryFactory.get return new directory for C:\Users\JenkinsSlave\workspace\Lucene-Solr-trunk-Windows\solr\build\solr-core\test\J0\temp\solr.handler.TestReplicationHandlerBackup AD67B4CAAB2A4EBC-001\solr-instance-001\collection1\data\index
   [junit4]   2> 688773 T3565 oasu.RandomMergePolicy.<init> RandomMergePolicy wrapping class org.apache.lucene.index.LogDocMergePolicy: [LogDocMergePolicy: minMergeSize=1000, mergeFactor=50, maxMergeSize=9223372036854775807, maxMergeSizeForForcedMerge=9223372036854775807, calibrateSizeByDeletes=true, maxMergeDocs=2147483647, maxCFSSegmentSizeMB=8.796093022207999E12, noCFSRatio=0.0]
   [junit4]   2> 688774 T3565 oasc.SolrDeletionPolicy.onCommit SolrDeletionPolicy.onCommit: commits: num=1
   [junit4]   2> 		commit{dir=MockDirectoryWrapper(RAMDirectory@f08c78 lockFactory=org.apache.lucene.store.SingleInstanceLockFactory@baef1a),segFN=segments_1,generation=1}
   [junit4]   2> 688774 T3565 oasc.SolrDeletionPolicy.updateCommits newest commit generation = 1
   [junit4]   2> 688775 T3565 oasc.SolrCore.loadUpdateProcessorChains no updateRequestProcessorChain defined as default, creating implicit default
   [junit4]   2> 688776 T3565 oasc.RequestHandlers.initHandlersFromConfig created /update: org.apache.solr.handler.UpdateRequestHandler
   [junit4]   2> 688776 T3565 oasc.RequestHandlers.initHandlersFromConfig created /update/json: org.apache.solr.handler.UpdateRequestHandler
   [junit4]   2> 688776 T3565 oasc.RequestHandlers.initHandlersFromConfig created /update/csv: org.apache.solr.handler.UpdateRequestHandler
   [junit4]   2> 688776 T3565 oasc.RequestHandlers.initHandlersFromConfig created /update/json/docs: org.apache.solr.handler.UpdateRequestHandler
   [junit4]   2> 688777 T3565 oasc.RequestHandlers.initHandlersFromConfig created /config: org.apache.solr.handler.SolrConfigHandler
   [junit4]   2> 688777 T3565 oasc.RequestHandlers.initHandlersFromConfig created /schema: org.apache.solr.handler.SchemaHandler
   [junit4]   2> 688777 T3565 oasc.RequestHandlers.initHandlersFromConfig created /get: org.apache.solr.handler.RealTimeGetHandler
   [junit4]   2> 688777 T3565 oasc.RequestHandlers.initHandlersFromConfig created /admin/luke: org.apache.solr.handler.admin.LukeRequestHandler
   [junit4]   2> 688778 T3565 oasc.RequestHandlers.initHandlersFromConfig created /admin/system: org.apache.solr.handler.admin.SystemInfoHandler
   [junit4]   2> 688779 T3565 oasc.RequestHandlers.initHandlersFromConfig created /admin/mbeans: org.apache.solr.handler.admin.SolrInfoMBeanHandler
   [junit4]   2> 688779 T3565 oasc.RequestHandlers.initHandlersFromConfig created /admin/plugins: org.apache.solr.handler.admin.PluginInfoHandler
   [junit4]   2> 688779 T3565 oasc.RequestHandlers.initHandlersFromConfig created /admin/threads: org.apache.solr.handler.admin.ThreadDumpHandler
   [junit4]   2> 688780 T3565 oasc.RequestHandlers.initHandlersFromConfig created /admin/properties: org.apache.solr.handler.admin.PropertiesRequestHandler
   [junit4]   2> 688780 T3565 oasc.RequestHandlers.initHandlersFromConfig created /admin/logging: org.apache.solr.handler.admin.LoggingHandler
   [junit4]   2> 688780 T3565 oasc.RequestHandlers.initHandlersFromConfig created /admin/file: org.apache.solr.handler.admin.ShowFileRequestHandler
   [junit4]   2> 688780 T3565 oasc.RequestHandlers.initHandlersFromConfig created /admin/ping: org.apache.solr.handler.PingRequestHandler
   [junit4]   2> 688781 T3565 oasc.RequestHandlers.initHandlersFromConfig created standard: solr.StandardRequestHandler
   [junit4]   2> 688801 T3565 oasc.RequestHandlers.initHandlersFromConfig created /replication: solr.ReplicationHandler
   [junit4]   2> 688807 T3565 oashl.XMLLoader.init xsltCacheLifetimeSeconds=60
   [junit4]   2> 688809 T3565 oashl.XMLLoader.init xsltCacheLifetimeSeconds=60
   [junit4]   2> 688812 T3565 oashl.XMLLoader.init xsltCacheLifetimeSeconds=60
   [junit4]   2> 688813 T3565 oashl.XMLLoader.init xsltCacheLifetimeSeconds=60
   [junit4]   2> 688814 T3565 oasc.SolrCore.initStatsCache Using default statsCache cache: org.apache.solr.search.stats.LocalStatsCache
   [junit4]   2> 688816 T3565 oasu.CommitTracker.<init> Hard AutoCommit: disabled
   [junit4]   2> 688816 T3565 oasu.CommitTracker.<init> Soft AutoCommit: disabled
   [junit4]   2> 688817 T3565 oasu.RandomMergePolicy.<init> RandomMergePolicy wrapping class org.apache.lucene.index.LogByteSizeMergePolicy: [LogByteSizeMergePolicy: minMergeSize=1677721, mergeFactor=13, maxMergeSize=2147483648, maxMergeSizeForForcedMerge=9223372036854775807, calibrateSizeByDeletes=false, maxMergeDocs=2147483647, maxCFSSegmentSizeMB=8.796093022207999E12, noCFSRatio=0.6073353348600594]
   [junit4]   2> 688817 T3565 oasc.SolrDeletionPolicy.onInit SolrDeletionPolicy.onInit: commits: num=1
   [junit4]   2> 		commit{dir=MockDirectoryWrapper(RAMDirectory@f08c78 lockFactory=org.apache.lucene.store.SingleInstanceLockFactory@baef1a),segFN=segments_1,generation=1}
   [junit4]   2> 688817 T3565 oasc.SolrDeletionPolicy.updateCommits newest commit generation = 1
   [junit4]   2> 688818 T3565 oass.SolrIndexSearcher.<init> Opening Searcher@b9d6b3[collection1] main
   [junit4]   2> 688818 T3565 oasr.ManagedResourceStorage$FileStorageIO.configure File-based storage initialized to use dir: C:\Users\JenkinsSlave\workspace\Lucene-Solr-trunk-Windows\solr\build\solr-core\test\J0\temp\solr.handler.TestReplicationHandlerBackup AD67B4CAAB2A4EBC-001\solr-instance-001\.\collection1\conf
   [junit4]   2> 688819 T3565 oasr.RestManager.init Initializing RestManager with initArgs: {storageDir=C:\Users\JenkinsSlave\workspace\Lucene-Solr-trunk-Windows\solr\build\solr-core\test\J0\temp\solr.handler.TestReplicationHandlerBackup AD67B4CAAB2A4EBC-001\solr-instance-001\.\collection1\conf}
   [junit4]   2> 688819 T3565 oasr.ManagedResourceStorage.load Reading _rest_managed.json using file:dir=C:\Users\JenkinsSlave\workspace\Lucene-Solr-trunk-Windows\solr\build\solr-core\test\J0\temp\solr.handler.TestReplicationHandlerBackup AD67B4CAAB2A4EBC-001\solr-instance-001\.\collection1\conf
   [junit4]   2> 688819 T3565 oasr.RestManager.init Initializing 0 registered ManagedResources
   [junit4]   2> 688820 T3565 oash.ReplicationHandler.inform Replication enabled for following config files: schema-replication2.xml:schema.xml
   [junit4]   2> 688820 T3565 oash.ReplicationHandler.inform Commits will be reserved for  10000
   [junit4]   2> 688820 T3565 oasc.CoreContainer.registerCore registering core: collection1
   [junit4]   2> 688820 T3566 oasc.SolrCore.registerSearcher [collection1] Registered new searcher Searcher@b9d6b3[collection1] main{ExitableDirectoryReader(UninvertingDirectoryReader())}
   [junit4]   2> 688821 T3553 oass.SolrDispatchFilter.init user.dir=C:\Users\JenkinsSlave\workspace\Lucene-Solr-trunk-Windows\solr\build\solr-core\test\J0
   [junit4]   2> 688822 T3553 oass.SolrDispatchFilter.init SolrDispatchFilter.init() done
   [junit4]   2> ASYNC  NEW_CORE C2127 name=collection1 org.apache.solr.core.SolrCore@860a69
   [junit4]   2> 688836 T3557 C2127 oasu.DirectUpdateHandler2.deleteAll [collection1] REMOVING ALL DOCUMENTS FROM INDEX
   [junit4]   2> 688836 T3557 C2127 oasup.LogUpdateProcessor.finish [collection1] webapp=/solr path=/update params={wt=javabin&version=2} {deleteByQuery=*:*} 0 2
   [junit4]   2> 688841 T3558 C2127 oasup.LogUpdateProcessor.finish [collection1] webapp=/solr path=/update params={wt=javabin&version=2} {add=[0]} 0 1
   [junit4]   2> 688848 T3559 C2127 oasup.LogUpdateProcessor.finish [collection1] webapp=/solr path=/update params={wt=javabin&version=2} {add=[1]} 0 1
   [junit4]   2> 688852 T3560 C2127 oasup.LogUpdateProcessor.finish [collection1] webapp=/solr path=/update params={wt=javabin&version=2} {add=[2]} 0 1
   [junit4]   2> 688856 T3561 C2127 oasup.LogUpdateProcessor.finish [collection1] webapp=/solr path=/update params={wt=javabin&version=2} {add=[3]} 0 0
   [junit4]   2> 688861 T3562 C2127 oasup.LogUpdateProcessor.finish [collection1] webapp=/solr path=/update params={wt=javabin&version=2} {add=[4]} 0 0
   [junit4]   2> 688866 T3557 C2127 oasup.LogUpdateProcessor.finish [collection1] webapp=/solr path=/update params={wt=javabin&version=2} {add=[5]} 0 0
   [junit4]   2> 688870 T3558 C2127 oasup.LogUpdateProcessor.finish [collection1] webapp=/solr path=/update params={wt=javabin&version=2} {add=[6]} 0 0
   [junit4]   2> 688874 T3559 C2127 oasup.LogUpdateProcessor.finish [collection1] webapp=/solr path=/update params={wt=javabin&version=2} {add=[7]} 0 1
   [junit4]   2> ASYNC  NEW_CORE C2128 name=collection1 org.apache.solr.core.SolrCore@860a69
   [junit4]   2> 688880 T3560 C2128 oasup.LogUpdateProcessor.finish [collection1] webapp=/solr path=/update params={wt=javabin&version=2} {add=[8]} 0 0
   [junit4]   2> 688883 T3561 C2128 oasup.LogUpdateProcessor.finish [collection1] webapp=/solr path=/update params={wt=javabin&version=2} {add=[9]} 0 0
   [junit4]   2> 688886 T3562 C2128 oasup.LogUpdateProcessor.finish [collection1] webapp=/solr path=/update params={wt=javabin&version=2} {add=[10]} 0 0
   [junit4]   2> 688889 T3557 C2128 oasup.LogUpdateProcessor.finish [collection1] webapp=/solr path=/update params={wt=javabin&version=2} {add=[11]} 0 0
   [junit4]   2> 688892 T3558 C2128 oasup.LogUpdateProcessor.finish [collection1] webapp=/solr path=/update params={wt=javabin&version=2} {add=[12]} 0 0
   [junit4]   2> 688895 T3559 C2128 oasup.LogUpdateProcessor.finish [collection1] webapp=/solr path=/update params={wt=javabin&version=2} {add=[13]} 0 0
   [junit4]   2> 688899 T3560 C2128 oasup.LogUpdateProcessor.finish [collection1] webapp=/solr path=/update params={wt=javabin&version=2} {add=[14]} 0 0
   [junit4]   2> 688903 T3561 C2128 oasup.LogUpdateProcessor.finish [collection1] webapp=/solr path=/update params={wt=javabin&version=2} {add=[15]} 0 0
   [junit4]   2> 688907 T3562 C2128 oasup.LogUpdateProcessor.finish [collection1] webapp=/solr path=/update params={wt=javabin&version=2} {add=[16]} 0 0
   [junit4]   2> 688912 T3557 C2128 oasup.LogUpdateProcessor.finish [collection1] webapp=/solr path=/update params={wt=javabin&version=2} {add=[17]} 0 0
   [junit4]   2> 688915 T3558 C2128 oasup.LogUpdateProcessor.finish [collection1] webapp=/solr path=/update params={wt=javabin&version=2} {add=[18]} 0 0
   [junit4]   2> 688918 T3559 C2128 oasup.LogUpdateProcessor.finish [collection1] webapp=/solr path=/update params={wt=javabin&version=2} {add=[19]} 0 0
   [junit4]   2> 688921 T3560 C2128 oasup.LogUpdateProcessor.finish [collection1] webapp=/solr path=/update params={wt=javabin&version=2} {add=[20]} 0 0
   [junit4]   2> 688924 T3561 C2128 oasup.LogUpdateProcessor.finish [collection1] webapp=/solr path=/update params={wt=javabin&version=2} {add=[21]} 0 0
   [junit4]   2> 688927 T3562 C2128 oasup.LogUpdateProcessor.finish [collection1] webapp=/solr path=/update params={wt=javabin&version=2} {add=[22]} 0 0
   [junit4]   2> 688930 T3557 C2128 oasup.LogUpdateProcessor.finish [collection1] webapp=/solr path=/update params={wt=javabin&version=2} {add=[23]} 0 0
   [junit4]   2> 688934 T3558 C2128 oasup.LogUpdateProcessor.finish [collection1] webapp=/solr path=/update params={wt=javabin&version=2} {add=[24]} 0 0
   [junit4]   2> 688937 T3559 C2128 oasup.LogUpdateProcessor.finish [collection1] webapp=/solr path=/update params={wt=javabin&version=2} {add=[25]} 0 0
   [junit4]   2> 688941 T3560 C2128 oasup.LogUpdateProcessor.finish [collection1] webapp=/solr path=/update params={wt=javabin&version=2} {add=[26]} 0 0
   [junit4]   2> 688945 T3561 C2128 oasup.LogUpdateProcessor.finish [collection1] webapp=/solr path=/update params={wt=javabin&version=2} {add=[27]} 0 0
   [junit4]   2> 688948 T3562 C2128 oasup.LogUpdateProcessor.finish [collection1] webapp=/solr path=/update params={wt=javabin&version=2} {add=[28]} 0 0
   [junit4]   2> 688952 T3557 C2128 oasup.LogUpdateProcessor.finish [collection1] webapp=/solr path=/update params={wt=javabin&version=2} {add=[29]} 0 0
   [junit4]   2> 688956 T3558 C2128 oasup.LogUpdateProcessor.finish [collection1] webapp=/solr path=/update params={wt=javabin&version=2} {add=[30]} 0 1
   [junit4]   2> 688960 T3559 C2128 oasup.LogUpdateProcessor.finish [collection1] webapp=/solr path=/update params={wt=javabin&version=2} {add=[31]} 0 0
   [junit4]   2> 688964 T3560 C2128 oasup.LogUpdateProcessor.finish [collection1] webapp=/solr path=/update params={wt=javabin&version=2} {add=[32]} 0 0
   [junit4]   2> 688967 T3561 C2128 oasup.LogUpdateProcessor.finish [collection1] webapp=/solr path=/update params={wt=javabin&version=2} {add=[33]} 0 0
   [junit4]   2> 688971 T3562 C2128 oasup.LogUpdateProcessor.finish [collection1] webapp=/solr path=/update params={wt=javabin&version=2} {add=[34]} 0 1
   [junit4]   2> 688973 T3557 C2128 oasup.LogUpdateProcessor.finish [collection1] webapp=/solr path=/update params={wt=javabin&version=2} {add=[35]} 0 0
   [junit4]   2> 688976 T3558 C2128 oasup.LogUpdateProcessor.finish [collection1] webapp=/solr path=/update params={wt=javabin&version=2} {add=[36]} 0 0
   [junit4]   2> 688981 T3559 C2128 oasup.LogUpdateProcessor.finish [collection1] webapp=/solr path=/update params={wt=javabin&version=2} {add=[37]} 0 0
   [junit4]   2> 688986 T3560 C2128 oasup.LogUpdateProcessor.finish [collection1] webapp=/solr path=/update params={wt=javabin&version=2} {add=[38]} 0 0
   [junit4]   2> 688989 T3561 C2128 oasup.LogUpdateProcessor.finish [collection1] webapp=/solr path=/update params={wt=javabin&version=2} {add=[39]} 0 0
   [junit4]   2> 688992 T3562 C2128 oasup.LogUpdateProcessor.finish [collection1] webapp=/solr path=/update params={wt=javabin&version=2} {add=[40]} 0 0
   [junit4]   2> 688996 T3557 C2128 oasup.LogUpdateProcessor.finish [collection1] webapp=/solr path=/update params={wt=javabin&version=2} {add=[41]} 0 1
   [junit4]   2> 688998 T3558 C2128 oasup.LogUpdateProcessor.finish [collection1] webapp=/solr path=/update params={wt=javabin&version=2} {add=[42]} 0 0
   [junit4]   2> 689002 T3559 C2128 oasup.LogUpdateProcessor.finish [collection1] webapp=/solr path=/update params={wt=javabin&version=2} {add=[43]} 0 0
   [junit4]   2> 689007 T3560 C2128 oasup.LogUpdateProcessor.finish [collection1] webapp=/solr path=/update params={wt=javabin&version=2} {add=[44]} 0 1
   [junit4]   2> 689011 T3561 C2128 oasup.LogUpdateProcessor.finish [collection1] webapp=/solr path=/update params={wt=javabin&version=2} {add=[45]} 0 0
   [junit4]   2> 689017 T3562 C2128 oasup.LogUpdateProcessor.finish [collection1] webapp=/solr path=/update params={wt=javabin&version=2} {add=[46]} 0 0
   [junit4]   2> 689023 T3557 C2128 oasup.LogUpdateProcessor.finish [collection1] webapp=/solr path=/update params={wt=javabin&version=2} {add=[47]} 0 0
   [junit4]   2> 689030 T3558 C2128 oasup.LogUpdateProcessor.finish [collection1] webapp=/solr path=/update params={wt=javabin&version=2} {add=[48]} 0 0
   [junit4]   2> 689034 T3559 C2128 oasup.LogUpdateProcessor.finish [collection1] webapp=/solr path=/update params={wt=javabin&version=2} {add=[49]} 0 0
   [junit4]   2> 689038 T3560 C2128 oasup.LogUpdateProcessor.finish [collection1] webapp=/solr path=/update params={wt=javabin&version=2} {add=[50]} 0 0
   [junit4]   2> 689042 T3561 C2128 oasup.LogUpdateProcessor.finish [collection1] webapp=/solr path=/update params={wt=javabin&version=2} {add=[51]} 0 0
   [junit4]   2> 689050 T3562 C2128 oasup.LogUpdateProcessor.finish [collection1] webapp=/solr path=/update params={wt=javabin&version=2} {add=[52]} 0 0
   [junit4]   2> 689057 T3557 C2128 oasup.LogUpdateProcessor.finish [collection1] webapp=/solr path=/update params={wt=javabin&version=2} {add=[53]} 0 3
   [junit4]   2> 689062 T3558 C2128 oasup.LogUpdateProcessor.finish [collection1] webapp=/solr path=/update params={wt=javabin&version=2} {add=[54]} 0 0
   [junit4]   2> 689066 T3559 C2128 oasup.LogUpdateProcessor.finish [collection1] webapp=/solr path=/update params={wt=javabin&version=2} {add=[55]} 0 0
   [junit4]   2> 689072 T3560 C2128 oasup.LogUpdateProcessor.finish [collection1] webapp=/solr path=/update params={wt=javabin&version=2} {add=[56]} 0 3
   [junit4]   2> 689075 T3561 C2128 oasup.LogUpdateProcessor.finish [collection1] webapp=/solr path=/update params={wt=javabin&version=2} {add=[57]} 0 0
   [junit4]   2> 689078 T3562 C2128 oasup.LogUpdateProcessor.finish [collection1] webapp=/solr path=/update params={wt=javabin&version=2} {add=[58]} 0 0
   [junit4]   2> 689081 T3557 C2128 oasup.LogUpdateProcessor.finish [collection1] webapp=/solr path=/update params={wt=javabin&version=2} {add=[59]} 0 0
   [junit4]   2> 689084 T3558 C2128 oasup.LogUpdateProcessor.finish [collection1] webapp=/solr path=/update params={wt=javabin&version=2} {add=[60]} 0 0
   [junit4]   2> 689087 T3559 C2128 oasup.LogUpdateProcessor.finish [collection1] webapp=/solr path=/update params={wt=javabin&version=2} {add=[61]} 0 0
   [junit4]   2> 689090 T3560 C2128 oasup.LogUpdateProcessor.finish [collection1] webapp=/solr path=/update params={wt=javabin&version=2} {add=[62]} 0 0
   [junit4]   2> 689094 T3561 C2128 oasup.LogUpdateProcessor.finish [collection1] webapp=/solr path=/update params={wt=javabin&version=2} {add=[63]} 0 0
   [junit4]   2> 689098 T3562 C2128 oasup.LogUpdateProcessor.finish [collection1] webapp=/solr path=/update params={wt=javabin&version=2} {add=[64]} 0 1
   [junit4]   2> 689102 T3557 C2128 oasup.LogUpdateProcessor.finish [collection1] webapp=/solr path=/update params={wt=javabin&version=2} {add=[65]} 0 1
   [junit4]   2> 689105 T3558 C2128 oasu.DirectUpdateHandler2.commit start commit{,optimize=false,openSearcher=true,waitSearcher=true,expungeDeletes=false,softCommit=false,prepareCommit=false}
   [junit4]   2> 689108 T3558 C2128 oasc.SolrDeletionPolicy.onCommit SolrDeletionPolicy.onCommit: commits: num=2
   [junit4]   2> 		commit{dir=MockDirectoryWrapper(RAMDirectory@f08c78 lockFactory=org.apache.lucene.store.SingleInstanceLockFactory@baef1a),segFN=segments_1,generation=1}
   [junit4]   2> 		commit{dir=MockDirectoryWrapper(RAMDirectory@f08c78 lockFactory=org.apache.lucene.store.SingleInstanceLockFactory@baef1a),segFN=segments_2,generation=2}
   [junit4]   2> 689109 T3558 C2128 oasc.SolrDeletionPolicy.updateCommits newest commit generation = 2
   [junit4]   2> 689123 T3558 C2128 oass.SolrIndexSearcher.<init> Opening Searcher@7f53f[collection1] main
   [junit4]   2> 689124 T3558 C2128 oasu.DirectUpdateHandler2.commit end_commit_flush
   [junit4]   2> 689125 T3566 oasc.SolrCore.registerSearcher [collection1] Registered new searcher Searcher@7f53f[collection1] main{ExitableDirectoryReader(UninvertingDirectoryReader(Uninverting(_0(6.0.0):C66)))}
   [junit4]   2> 689125 T3558 C2128 oasup.LogUpdateProcessor.finish [collection1] webapp=/solr path=/update params={waitSearcher=true&commit=true&softCommit=false&wt=javabin&version=2} {commit=} 0 20
   [junit4]   2> 689142 T3569 oash.SnapShooter.createSnapshot Creating backup snapshot...
   [junit4]   2> 689167 T3569 oash.SnapShooter.createSnapshot Done creating backup snapshot: <not named>
   [junit4]   2> 689248 T3559 C2128 oasc.SolrCore.execute [collection1] webapp=/solr path=/replication params={command=backup} status=0 QTime=2 
   [junit4]   2> 689258 T3570 oash.SnapShooter.createSnapshot Creating backup snapshot...
   [junit4]   2> 689276 T3570 oash.SnapShooter.createSnapshot Done creating backup snapshot: <not named>
   [junit4]   2> 689298 T3560 C2128 oasc.SolrCore.execute [collection1] webapp=/solr path=/replication params={command=details} status=0 QTime=1 
   [junit4]   2> 690387 T3561 C2128 oasc.SolrCore.execute [collection1] webapp=/solr path=/replication params={command=backup} status=0 QTime=3 
   [junit4]   2> 690396 T3572 oash.SnapShooter.createSnapshot Creating backup snapshot...
   [junit4]   2> 690400 T3562 C2128 oasc.SolrCore.execute [collection1] webapp=/solr path=/replication params={command=details} status=0 QTime=0 
   [junit4]   2> 690411 T3572 oash.SnapShooter.createSnapshot Done creating backup snapshot: <not named>
   [junit4]   2> 691451 T3553 oas.SolrTestCaseJ4.tearDown ###Ending doTestBackup
   [junit4]   2> 691455 T3553 oejs.AbstractConnector.doStop Stopped ServerConnector@1d98c01{HTTP/1.1}{127.0.0.1:0}
   [junit4]   2> 691456 T3553 oasc.CoreContainer.shutdown Shutting down CoreContainer instance=17428780
   [junit4]   2> 691457 T3553 oasc.SolrCore.close [collection1]  CLOSING SolrCore org.apache.solr.core.SolrCore@860a69
   [junit4]   2> 691458 T3553 oasu.DirectUpdateHandler2.close closing DirectUpdateHandler2{commits=1,autocommits=0,soft autocommits=0,optimizes=0,rollbacks=0,expungeDeletes=0,docsPending=0,adds=0,deletesById=0,deletesByQuery=0,errors=0,cumulative_adds=66,cumulative_deletesById=0,cumulative_deletesByQuery=1,cumulative_errors=0}
   [junit4]   2> 691459 T3553 oasu.SolrCoreState.decrefSolrCoreState Closing SolrCoreState
   [junit4]   2> 691460 T3553 oasu.DefaultSolrCoreState.closeIndexWriter SolrCoreState ref count has reached 0 - closing IndexWriter
   [junit4]   2> 691460 T3553 oasu.DefaultSolrCoreState.closeIndexWriter closing IndexWriter with IndexWriterCloser
   [junit4]   2> 691462 T3553 oasc.SolrCore.closeSearcher [collection1] Closing main searcher on request.
   [junit4]   2> 691462 T3553 oasc.CachingDirectoryFactory.close Closing MockDirectoryFactory - 2 directories currently being tracked
   [junit4]   2> 691462 T3553 oasc.CachingDirectoryFactory.closeCacheValue looking to close C:\Users\JenkinsSlave\workspace\Lucene-Solr-trunk-Windows\solr\build\solr-core\test\J0\temp\solr.handler.TestReplicationHandlerBackup AD67B4CAAB2A4EBC-001\solr-instance-001\collection1\data\index [CachedDir<<refCount=0;path=C:\Users\JenkinsSlave\workspace\Lucene-Solr-trunk-Windows\solr\build\solr-core\test\J0\temp\solr.handler.TestReplicationHandlerBackup AD67B4CAAB2A4EBC-001\solr-instance-001\collection1\data\index;done=false>>]
   [junit4]   2> 691462 T3553 oasc.CachingDirectoryFactory.close Closing directory: C:\Users\JenkinsSlave\workspace\Lucene-Solr-trunk-Windows\solr\build\solr-core\test\J0\temp\solr.handler.TestReplicationHandlerBackup AD67B4CAAB2A4EBC-001\solr-instance-001\collection1\data\index
   [junit4]   2> 691462 T3553 oasc.CachingDirectoryFactory.closeCacheValue looking to close C:\Users\JenkinsSlave\workspace\Lucene-Solr-trunk-Windows\solr\build\solr-core\test\J0\temp\solr.handler.TestReplicationHandlerBackup AD67B4CAAB2A4EBC-001\solr-instance-001\collection1\data\ [CachedDir<<refCount=0;path=C:\Users\JenkinsSlave\workspace\Lucene-Solr-trunk-Windows\solr\build\solr-core\test\J0\temp\solr.handler.TestReplicationHandlerBackup AD67B4CAAB2A4EBC-001\solr-instance-001\collection1\data\;done=false>>]
   [junit4]   2> 691462 T3553 oasc.CachingDirectoryFactory.close Closing directory: C:\Users\JenkinsSlave\workspace\Lucene-Solr-trunk-Windows\solr\build\solr-core\test\J0\temp\solr.handler.TestReplicationHandlerBackup AD67B4CAAB2A4EBC-001\solr-instance-001\collection1\data\
   [junit4]   2> 691465 T3553 oejsh.ContextHandler.doStop Stopped o.e.j.s.ServletContextHandler@9b8bb6{/solr,null,UNAVAILABLE}
   [junit4]   2> NOTE: reproduce with: ant test  -Dtestcase=TestReplicationHandlerBackup -Dtests.method=doTestBackup -Dtests.seed=AD67B4CAAB2A4EBC -Dtests.slow=true -Dtests.locale=es_GT -Dtests.timezone=America/Whitehorse -Dtests.asserts=true -Dtests.file.encoding=ISO-8859-1
   [junit4] ERROR   2.92s | TestReplicationHandlerBackup.doTestBackup <<<
   [junit4]    > Throwable #1: java.io.IOException: Could not remove the following files (in the order of attempts):
   [junit4]    >    C:\Users\JenkinsSlave\workspace\Lucene-Solr-trunk-Windows\solr\build\solr-core\test\J0\temp\solr.handler.TestReplicationHandlerBackup AD67B4CAAB2A4EBC-001\solr-instance-001\collection1: java.nio.file.DirectoryNotEmptyException: C:\Users\JenkinsSlave\workspace\Lucene-Solr-trunk-Windows\solr\build\solr-core\test\J0\temp\solr.handler.TestReplicationHandlerBackup AD67B4CAAB2A4EBC-001\solr-instance-001\collection1
   [junit4]    >    C:\Users\JenkinsSlave\workspace\Lucene-Solr-trunk-Windows\solr\build\solr-core\test\J0\temp\solr.handler.TestReplicationHandlerBackup AD67B4CAAB2A4EBC-001\solr-instance-001: java.nio.file.DirectoryNotEmptyException: C:\Users\JenkinsSlave\workspace\Lucene-Solr-trunk-Windows\solr\build\solr-core\test\J0\temp\solr.handler.TestReplicationHandlerBackup AD67B4CAAB2A4EBC-001\solr-instance-001
   [junit4]    > 	at __randomizedtesting.SeedInfo.seed([AD67B4CAAB2A4EBC:ECEC94AF8C94BDF3]:0)
   [junit4]    > 	at org.apache.lucene.util.IOUtils.rm(IOUtils.java:286)
   [junit4]    > 	at org.apache.solr.handler.TestReplicationHandler$SolrInstance.tearDown(TestReplicationHandler.java:1509)
   [junit4]    > 	at org.apache.solr.handler.TestReplicationHandlerBackup.tearDown(TestReplicationHandlerBackup.java:115)
   [junit4]    > 	at java.lang.Thread.run(Thread.java:745)
   [junit4]   2> 691503 T3553 oas.SolrTestCaseJ4.setUp ###Starting testBackupOnCommit
   [junit4]   2> 691506 T3553 oas.SolrTestCaseJ4.writeCoreProperties Writing core.properties file to C:\Users\JenkinsSlave\workspace\Lucene-Solr-trunk-Windows\solr\build\solr-core\test\J0\temp\solr.handler.TestReplicationHandlerBackup AD67B4CAAB2A4EBC-001\solr-instance-002\collection1
   [junit4]   2> 691532 T3553 oejs.Server.doStart jetty-9.2.6.v20141205
   [junit4]   2> 691538 T3553 oejsh.ContextHandler.doStart Started o.e.j.s.ServletContextHandler@1775696{/solr,null,AVAILABLE}
   [junit4]   2> 691540 T3553 oejs.AbstractConnector.doStart Started ServerConnector@1fb3dec{HTTP/1.1}{127.0.0.1:50941}
   [junit4]   2> 691540 T3553 oejs.Server.doStart Started @697748ms
   [junit4]   2> 691541 T3553 oass.SolrDispatchFilter.init SolrDispatchFilter.init()sun.misc.Launcher$AppClassLoader@387f44
   [junit4]   2> 691541 T3553 oasc.SolrResourceLoader.locateSolrHome JNDI not configured for solr (NoInitialContextEx)
   [junit4]   2> 691542 T3553 oasc.SolrResourceLoader.locateSolrHome using system property solr.solr.home: C:\Users\JenkinsSlave\workspace\Lucene-Solr-trunk-Windows\solr\build\solr-core\test\J0\temp\solr.handler.TestReplicationHandlerBackup AD67B4CAAB2A4EBC-001\solr-instance-002
   [junit4]   2> 691542 T3553 oasc.SolrResourceLoader.<init> new SolrResourceLoader for directory: 'C:\Users\JenkinsSlave\workspace\Lucene-Solr-trunk-Windows\solr\build\solr-core\test\J0\temp\solr.handler.TestReplicationHandlerBackup AD67B4CAAB2A4EBC-001\solr-instance-002\'
   [junit4]   2> 691587 T3553 oasc.ConfigSolr.fromFile Loading container configuration from C:\Users\JenkinsSlave\workspace\Lucene-Solr-trunk-Windows\solr\build\solr-core\test\J0\temp\solr.handler.TestReplicationHandlerBackup AD67B4CAAB2A4EBC-001\solr-instance-002\solr.xml
   [junit4]   2> 691614 T3553 oasc.CorePropertiesLocator.<init> Config-defined core root directory: C:\Users\JenkinsSlave\workspace\Lucene-Solr-trunk-Windows\solr\build\solr-core\test\J0\temp\solr.handler.TestReplicationHandlerBackup AD67B4CAAB2A4EBC-001\solr-instance-002\.
   [junit4]   2> 691614 T3553 oasc.CoreContainer.<init> New CoreContainer 11350426
   [junit4]   2> 691614 T3553 oasc.CoreContainer.load Loading cores into CoreContainer [instanceDir=C:\Users\JenkinsSlave\workspace\Lucene-Solr-trunk-Windows\solr\build\solr-core\test\J0\temp\solr.handler.TestReplicationHandlerBackup AD67B4CAAB2A4EBC-001\solr-instance-002\]
   [junit4]   2> 691614 T3553 oashc.HttpShardHandlerFactory.getParameter Setting socketTimeout to: 90000
   [junit4]   2> 691615 T3553 oashc.HttpShardHandlerFactory.getParameter Setting urlScheme to: 
   [junit4]   2> 691615 T3553 oashc.HttpShardHandlerFactory.getParameter Setting connTimeout to: 15000
   [junit4]   2> 691615 T3553 oashc.HttpShardHandlerFactory.getParameter Setting maxConnectionsPerHost to: 20
   [junit4]   2> 691615 T3553 oashc.HttpShardHandlerFactory.getParameter Setting maxConnections to: 10000
   [junit4]   2> 691616 T3553 oashc.HttpShardHandlerFactory.getParameter Setting corePoolSize to: 0
   [junit4]   2> 691616 T3553 oashc.HttpShardHandlerFactory.getParameter Setting maximumPoolSize to: 2147483647
   [junit4]   2> 691616 T3553 oashc.HttpShardHandlerFactory.getParameter Setting maxThreadIdleTime to: 5
   [junit4]   2> 691616 T3553 oashc.HttpShardHandlerFactory.getParameter Setting sizeOfQueue to: -1
   [junit4]   2> 691616 T3553 oashc.HttpShardHandlerFactory.getParameter Setting fairnessPolicy to: false
   [junit4]   2> 691616 T3553 oashc.HttpShardHandlerFactory.getParameter Setting useRetries to: false
   [junit4]   2> 691617 T3553 oasu.UpdateShardHandler.<init> Creating UpdateShardHandler HTTP client with params: socketTimeout=340000&connTimeout=45000&retry=true
   [junit4]   2> 691617 T3553 oasl.LogWatcher.createWatcher SLF4J impl is org.slf4j.impl.Log4jLoggerFactory
   [junit4]   2> 691617 T3553 oasl.LogWatcher.newRegisteredLogWatcher Registering Log Listener [Log4j (org.slf4j.impl.Log4jLoggerFactory)]
   [junit4]   2> 691618 T3553 oasc.CoreContainer.load Host Name: 127.0.0.1
   [junit4]   2> 691620 T3553 oasc.CorePropertiesLocator.discover Looking for core definitions underneath C:\Users\JenkinsSlave\workspace\Lucene-Solr-trunk-Windows\solr\build\solr-core\test\J0\temp\solr.handler.TestReplicationHandlerBackup AD67B4CAAB2A4EBC-001\solr-instance-002\.
   [junit4]   2> 691623 T3553 oasc.CorePropertiesLocator.discoverUnder Found core collection1 in C:\Users\JenkinsSlave\workspace\Lucene-Solr-trunk-Windows\solr\build\solr-core\test\J0\temp\solr.handler.TestReplicationHandlerBackup AD67B4CAAB2A4EBC-001\solr-instance-002\.\collection1\
   [junit4]   2> 691626 T3553 oasc.CorePropertiesLocator.discover Found 1 core definitions
   [junit4]   2> 691628 T3585 oasc.SolrResourceLoader.<init> new SolrResourceLoader for directory: 'C:\Users\JenkinsSlave\workspace\Lucene-Solr-trunk-Windows\solr\build\solr-core\test\J0\temp\solr.handler.TestReplicationHandlerBackup AD67B4CAAB2A4EBC-001\solr-instance-002\.\collection1\'
   [junit4]   2> 691668 T3585 oasc.SolrConfig.refreshRequestParams current version of requestparams : -1
   [junit4]   2> 691682 T3585 oasc.SolrConfig.<init> Using Lucene MatchVersion: 6.0.0
   [junit4]   2> 691708 T3585 oasc.SolrConfig.<init> Loaded SolrConfig: solrconfig.xml
   [junit4]   2> 691708 T3585 oass.IndexSchema.readSchema Reading Solr Schema from C:\Users\JenkinsSlave\workspace\Lucene-Solr-trunk-Windows\solr\build\solr-core\test\J0\temp\solr.handler.TestReplicationHandlerBackup AD67B4CAAB2A4EBC-001\solr-instance-002\.\collection1\conf\schema.xml
   [junit4]   2> 691713 T3585 oass.IndexSchema.readSchema [collection1] Schema name=test
   [junit4]   2> 691729 T3585 oass.IndexSchema.readSchema unique key field: id
   [junit4]   2> 691730 T3585 oasc.CoreContainer.create Creating SolrCore 'collection1' using configuration from instancedir C:\Users\JenkinsSlave\workspace\Lucene-Solr-trunk-Windows\solr\build\solr-core\test\J0\temp\solr.handler.TestReplicationHandlerBackup AD67B4CAAB2A4EBC-001\solr-instance-002\.\collection1\
   [junit4]   2> 691730 T3585 oasc.SolrCore.initDirectoryFactory org.apache.solr.core.MockDirectoryFactory
   [junit4]   2> 691730 T3585 oasc.SolrCore.<init> [collection1] Opening new SolrCore at C:\Users\JenkinsSlave\workspace\Lucene-Solr-trunk-Windows\solr\build\solr-core\test\J0\temp\solr.handler.TestReplicationHandlerBackup AD67B4CAAB2A4EBC-001\solr-instance-002\.\collection1\, dataDir=C:\Users\JenkinsSlave\workspace\Lucene-Solr-trunk-Windows\solr\build\solr-core\test\J0\temp\solr.handler.TestReplicationHandlerBackup AD67B4CAAB2A4EBC-001\solr-instance-002\collection1\data\
   [junit4]   2> 691730 T3585 oasc.SolrCore.<init> JMX monitoring not detected for core: collection1
   [junit4]   2> 691731 T3585 oasc.CachingDirectoryFactory.get return new directory for C:\Users\JenkinsSlave\workspace\Lucene-Solr-trunk-Windows\solr\build\solr-core\test\J0\temp\solr.handler.TestReplicationHandlerBackup AD67B4CAAB2A4EBC-001\solr-instance-002\collection1\data\
   [junit4]   2> 691731 T3585 oasc.SolrCore.getNewIndexDir New index directory detected: old=null new=C:\Users\JenkinsSlave\workspace\Lucene-Solr-trunk-Windows\solr\build\solr-core\test\J0\temp\solr.handler.TestReplicationHandlerBackup AD67B4CAAB2A4EBC-001\solr-instance-002\collection1\data\index/
   [junit4]   2> 691731 T3585 oasc.SolrCore.initIndex WARN [collection1] Solr index directory 'C:\Users\JenkinsSlave\workspace\Lucene-Solr-trunk-Windows\solr\build\solr-core\test\J0\temp\solr.handler.TestReplicationHandlerBackup AD67B4CAAB2A4EBC-001\solr-instance-002\collection1\data\index' doesn't exist. Creating new index...
   [junit4]   2> 691733 T3585 oasc.CachingDirectoryFactory.get return new directory for C:\Users\JenkinsSlave\workspace\Lucene-Solr-trunk-Windows\solr\build\solr-core\test\J0\temp\solr.handler.TestReplicationHandlerBackup AD67B4CAAB2A4EBC-001\solr-instance-002\collection1\data\index
   [junit4]   2> 691733 T3585 oasu.RandomMergePolicy.<init> RandomMergePolicy wrapping class org.apache.lucene.index.LogDocMergePolicy: [LogDocMergePolicy: minMergeSize=1000, mergeFactor=50, maxMergeSize=9223372036854775807, maxMergeSizeForForcedMerge=9223372036854775807, calibrateSizeByDeletes=true, maxMergeDocs=2147483647, maxCFSSegmentSizeMB=8.796093022207999E12, noCFSRatio=0.0]
   [junit4]   2> 691734 T3585 oasc.SolrDeletionPolicy.onCommit SolrDeletionPolicy.onCommit: commits: num=1
   [junit4]   2> 		commit{dir=MockDirectoryWrapper(RAMDirectory@c93ea5 lockFactory=org.apache.lucene.store.SingleInstanceLockFactory@11f5ecd),segFN=segments_1,generation=1}
   [junit4]   2> 691734 T3585 oasc.SolrDeletionPolicy.updateCommits newest commit generation = 1
   [junit4]   2> 691735 T3585 oasc.SolrCore.loadUpdateProcessorChains no updateRequestProcessorChain defined as default, creating implicit default
   [junit4]   2> 691735 T3585 oasc.RequestHandlers.initHandlersFromConfig created /update/json: org.apache.solr.handler.UpdateRequestHandler
   [junit4]   2> 691735 T3585 oasc.RequestHandlers.initHandlersFromConfig created /update/csv: org.apache.solr.handler.UpdateRequestHandler
   [junit4]   2> 691736 T3585 oasc.RequestHandlers.initHandlersFromConfig created /update/json/docs: org.apache.solr.handler.UpdateRequestHandler
   [junit4]   2> 691736 T3585 oasc.RequestHandlers.initHandlersFromConfig created /config: org.apache.solr.handler.SolrConfigHandler
   [junit4]   2> 691736 T3585 oasc.RequestHandlers.initHandlersFromConfig created /schema: org.apache.solr.handler.SchemaHandler
   [junit4]   2> 691736 T3585 oasc.RequestHandlers.initHandlersFromConfig created /get: org.apache.solr.handler.RealTimeGetHandler
   [junit4]   2> 691737 T3585 oasc.RequestHandlers.initHandlersFromConfig created /admin/luke: org.apache.solr.handler.admin.LukeRequestHandler
   [junit4]   2> 691741 T3585 oasc.RequestHandlers.initHandlersFromConfig created /admin/system: org.apache.solr.handler.admin.SystemInfoHandler
   [junit4]   2> 691741 T3585 oasc.RequestHandlers.initHandlersFromConfig created /admin/mbeans: org.apache.solr.handler.admin.SolrInfoMBeanHandler
   [junit4]   2> 691741 T3585 oasc.RequestHandlers.initHandlersFromConfig created /admin/plugins: org.apache.solr.handler.admin.PluginInfoHandler
   [junit4]   2> 691741 T3585 oasc.RequestHandlers.initHandlersFromConfig created /admin/threads: org.apache.solr.handler.admin.ThreadDumpHandler
   [junit4]   2> 691741 T3585 oasc.RequestHandlers.initHandlersFromConfig created /admin/properties: org.apache.solr.handler.admin.PropertiesRequestHandler
   [junit4]   2> 691742 T3585 oasc.RequestHandlers.initHandlersFromConfig created /admin/logging: org.apache.solr.handler.admin.LoggingHandler
   [junit4]   2> 691742 T3585 oasc.RequestHandlers.initHandlersFromConfig created /admin/file: org.apache.solr.handler.admin.ShowFileRequestHandler
   [junit4]   2> 691742 T3585 oasc.RequestHandlers.initHandlersFromConfig created /admin/ping: org.apache.solr.handler.PingRequestHandler
   [junit4]   2> 691742 T3585 oasc.RequestHandlers.initHandlersFromConfig created standard: solr.StandardRequestHandler
   [junit4]   2> 691742 T3585 oasc.RequestHandlers.initHandlersFromConfig created /replication: solr.ReplicationHandler
   [junit4]   2> 691742 T3585 oasc.RequestHandlers.initHandlersFromConfig created defaults: solr.StandardRequestHandler
   [junit4]   2> 691742 T3585 oasc.RequestHandlers.initHandlersFromConfig adding lazy requestHandler: solr.StandardRequestHandler
   [junit4]   2> 691742 T3585 oasc.RequestHandlers.initHandlersFromConfig created lazy: solr.StandardRequestHandler
   [junit4]   2> 691743 T3585 oasc.RequestHandlers.initHandlersFromConfig created /update: solr.UpdateRequestHandler
   [junit4]   2> 691749 T3585 oashl.XMLLoader.init xsltCacheLifetimeSeconds=60
   [junit4]   2> 691751 T3585 oashl.XMLLoader.init xsltCacheLifetimeSeconds=60
   [junit4]   2> 691754 T3585 oashl.XMLLoader.init xsltCacheLifetimeSeconds=60
   [junit4]   2> 691756 T3585 oashl.XMLLoader.init xsltCacheLifetimeSeconds=60
   [junit4]   2> 691756 T3585 oasc.SolrCore.initStatsCache Using default statsCache cache: org.apache.solr.search.stats.LocalStatsCache
   [junit4]   2> 691758 T3585 oasu.CommitTracker.<init> Hard AutoCommit: disabled
   [junit4]   2> 691758 T3585 oasu.CommitTracker.<init> Soft AutoCommit: disabled
   [junit4]   2> 691758 T3585 oasu.RandomMergePolicy.<init> RandomMergePolicy wrapping class org.apache.lucene.index.LogByteSizeMergePolicy: [LogByteSizeMergePolicy: minMergeSize=1677721, mergeFactor=13, maxMergeSize=2147483648, maxMergeSizeForForcedMerge=9223372036854775807, calibrateSizeByDeletes=false, maxMergeDocs=2147483647, maxCFSSegmentSizeMB=8.796093022207999E12, noCFSRatio=0.6073353348600594]
   [junit4]   2> 691758 T3585 oasc.SolrDeletionPolicy.onInit SolrDeletionPolicy.onInit: commits: num=1
   [junit4]   2> 		commit{dir=MockDirectoryWrapper(RAMDirectory@c93ea5 lockFactory=org.apache.lucene.store.SingleInstanceLockFactory@11f5ecd),segFN=segments_1,generation=1}
   [junit4]   2> 691758 T3585 oasc.SolrDeletionPolicy.updateCommits newest commit generation = 1
   [junit4]   2> 691759 T3585 oass.SolrIndexSearcher.<init> Opening Searcher@1e92b0c[collection1] main
   [junit4]   2> 691759 T3585 oasr.ManagedResourceStorage$FileStorageIO.configure File-based storage initialized to use dir: C:\Users\JenkinsSlave\workspace\Lucene-Solr-trunk-Windows\solr\build\solr-core\test\J0\temp\solr.handler.TestReplicationHandlerBackup AD67B4CAAB2A4EBC-001\solr-instance-002\.\collection1\conf
   [junit4]   2> 691759 T3585 oasr.RestManager.init Initializing RestManager with initArgs: {storageDir=C:\Users\JenkinsSlave\workspace\Lucene-Solr-trunk-Windows\solr\build\solr-core\test\J0\temp\solr.handler.TestReplicationHandlerBackup AD67B4CAAB2A4EBC-001\solr-instance-002\.\collection1\conf}
   [junit4]   2> 691759 T3585 oasr.ManagedResourceStorage.load Reading _rest_managed.json using file:dir=C:\Users\JenkinsSlave\workspace\Lucene-Solr-trunk-Windows\solr\build\solr-core\test\J0\temp\solr.handler.TestReplicationHandlerBackup AD67B4CAAB2A4EBC-001\solr-instance-002\.\collection1\conf
   [junit4]   2> 691761 T3585 oasr.RestManager.init Initializing 0 registered ManagedResources
   [junit4]   2> 691761 T3585 oash.ReplicationHandler.inform Replication enabled for following config files: schema-replication2.xml:schema.xml
   [junit4]   2> 691761 T3585 oash.ReplicationHandler.inform Commits will be reserved for  10000
   [junit4]   2> 691761 T3585 oasc.CoreContainer.registerCore registering core: collection1
   [junit4]   2> 691762 T3586 oasc.SolrCore.registerSearcher [collection1] Registered new searcher Searcher@1e92b0c[collection1] main{ExitableDirectoryReader(UninvertingDirectoryReader())}
   [junit4]   2> 691764 T3553 oass.SolrDispatchFilter.init user.dir=C:\Users\JenkinsSlave\workspace\Lucene-Solr-trunk-Windows\solr\build\solr-core\test\J0
   [junit4]   2> 691764 T3553 oass.SolrDispatchFilter.init SolrDispatchFilter.init() done
   [junit4]   2> ASYNC  NEW_CORE C2129 name=collection1 org.apache.solr.core.SolrCore@1c4ae07
   [junit4]   2> 691769 T3577 C2129 oasu.DirectUpdateHandler2.deleteAll [collection1] REMOVING ALL DOCUMENTS FROM INDEX
   [junit4]   2> 691769 T3577 C2129 oasup.LogUpdateProcessor.finish [collection1] webapp=/solr path=/update params={wt=javabin&version=2} {deleteByQuery=*:*} 0 0
   [junit4]   2> 691777 T3578 C2129 oasup.LogUpdateProcessor.finish [collection1] webapp=/solr path=/update params={wt=javabin&version=2} {add=[0]} 0 0
   [junit4]   2> 691784 T3579 C2129 oasup.LogUpdateProcessor.finish [collection1] webapp=/solr path=/update params={wt=javabin&version=2} {add=[1]} 0 0
   [junit4]   2> 691789 T3580 C2129 oasup.LogUpdateProcessor.finish [collection1] webapp=/solr path=/update params={wt=javabin&version=2} {add=[2]} 0 0
   [junit4]   2> 691794 T3581 C2129 oasup.LogUpdateProcessor.finish [collection1] webapp=/solr path=/update params={wt=javabin&version=2} {add=[3]} 0 0
   [junit4]   2> 691797 T3582 C2129 oasup.LogUpdateProcessor.finish [collection1] webapp=/solr path=/update params={wt=javabin&version=2} {add=[4]} 0 0
   [junit4]   2> 691801 T3577 C2129 oasup.LogUpdateProcessor.finish [collection1] webapp=/solr path=/update params={wt=javabin&version=2} {add=[5]} 0 0
   [junit4]   2> 691804 T3578 C2129 oasup.LogUpdateProcessor.finish [collection1] webapp=/solr path=/update params={wt=javabin&version=2} {add=[6]} 0 0
   [junit4]   2> 691808 T3579 C2129 oasup.LogUpdateProcessor.finish [collection1] webapp=/solr path=/update params={wt=javabin&version=2} {add=[7]} 0 0
   [junit4]   2> 691811 T3580 C2129 oasup.LogUpdateProcessor.finish [collection1] webapp=/solr path=/update params={wt=javabin&version=2} {add=[8]} 0 0
   [junit4]   2> 691814 T3581 C2129 oasup.LogUpdateProcessor.finish [collection1] webapp=/solr path=/update params={wt=javabin&version=2} {add=[9]} 0 0
   [junit4]   2> 691818 T3582 C2129 oasup.LogUpdateProcessor.finish [collection1] webapp=/solr path=/update params={wt=javabin&version=2} {add=[10]} 0 0
   [junit4]   2> 691821 T3577 C2129 oasup.LogUpdateProcessor.finish [collection1] webapp=/solr path=/update params={wt=javabin&version=2} {add=[11]} 0 0
   [junit4]   2> 691825 T3578 C2129 oasup.LogUpdateProcessor.finish [collection1] webapp=/solr path=/update params={wt=javabin&version=2} {add=[12]} 0 0
   [junit4]   2> 691828 T3579 C2129 oasup.LogUpdateProcessor.finish [collection1] webapp=/solr path=/update params={wt=javabin&version=2} {add=[13]} 0 0
   [junit4]   2> 691831 T3580 C2129 oasup.LogUpdateProcessor.finish [collection1] webapp=/solr path=/update params={wt=javabin&version=2} {add=[14]} 0 0
   [junit4]   2> 691834 T3581 C2129 oasup.LogUpdateProcessor.finish [collection1] webapp=/solr path=/update params={wt=javabin&version=2} {add=[15]} 0 0
   [junit4]   2> 691837 T3582 C2129 oasup.LogUpdateProcessor.finish [collection1] webapp=/solr path=/update params={wt=javabin&version=2} {add=[16]} 0 0
   [junit4]   2> 691840 T3577 C2129 oasup.LogUpdateProcessor.finish [collection1] webapp=/solr path=/update params={wt=javabin&version=2} {add=[17]} 0 0
   [junit4]   2> 691844 T3578 C2129 oasup.LogUpdateProcessor.finish [collection1] webapp=/solr path=/update params={wt=javabin&version=2} {add=[18]} 0 0
   [junit4]   2> 691848 T3579 C2129 oasup.LogUpdateProcessor.finish [collection1] webapp=/solr path=/update params={wt=javabin&version=2} {add=[19]} 0 0
   [junit4]   2> 691851 T3580 C2129 oasup.LogUpdateProcessor.finish [collection1] webapp=/solr path=/update params={wt=javabin&version=2} {add=[20]} 0 0
   [junit4]   2> 691855 T3581 C2129 oasup.LogUpdateProcessor.finish [collection1] webapp=/solr path=/update params={wt=javabin&version=2} {add=[21]} 0 0
   [junit4]   2> 691858 T3582 C2129 oasup.LogUpdateProcessor.finish [collection1] webapp=/solr path=/update params={wt=javabin&version=2} {add=[22]} 0 0
   [junit4]   2> 691862 T3577 C2129 oasup.LogUpdateProcessor.finish [collection1] webapp=/solr path=/update params={wt=javabin&version=2} {add=[23]} 0 0
   [junit4]   2> 691867 T3578 C2129 oasup.LogUpdateProcessor.finish [collection1] webapp=/solr path=/update params={wt=javabin&version=2} {add=[24]} 0 0
   [junit4]   2> 691870 T3579 C2129 oasup.LogUpdateProcessor.finish [collection1] webapp=/solr path=/update params={wt=javabin&version=2} {add=[25]} 0 0
   [junit4]   2> 691875 T3580 C2129 oasup.LogUpdateProcessor.finish [collection1] webapp=/solr path=/update params={wt=javabin&version=2} {add=[26]} 0 0
   [junit4]   2> 691878 T3581 C2129 oasup.LogUpdateProcessor.finish [collection1] webapp=/solr path=/update params={wt=javabin&version=2} {add=[27]} 0 0
   [junit4]   2> ASYNC  NEW_CORE C2130 name=collection1 org.apache.solr.core.SolrCore@1c4ae07
   [junit4]   2> 691889 T3582 C2130 oasup.LogUpdateProcessor.finish [collection1] webapp=/solr path=/update params={wt=javabin&version=2} {add=[28]} 0 0
   [junit4]   2> 691893 T3577 C2130 oasup.LogUpdateProcessor.finish [collection1] webapp=/solr path=/update params={wt=javabin&version=2} {add=[29]} 0 0
   [junit4]   2> 691897 T3578 C2130 oasup.LogUpdateProcessor.finish [collection1] webapp=/solr path=/update params={wt=javabin&version=2} {add=[30]} 0 0
   [junit4]   2> 691902 T3579 C2130 oasup.LogUpdateProcessor.finish [collection1] webapp=/solr path=/update params={wt=javabin&version=2} {add=[31]} 0 1
   [junit4]   2> 691907 T3580 C2130 oasup.LogUpdateProcessor.finish [collection1] webapp=/solr path=/update params={wt=javabin&version=2} {add=[32]} 0 0
   [junit4]   2> 691913 T3581 C2130 oasup.LogUpdateProcessor.finish [collection1] webapp=/solr path=/update params={wt=javabin&version=2} {add=[33]} 0 0
   [junit4]   2> 691918 T3582 C2130 oasup.LogUpdateProcessor.finish [collection1] webapp=/solr path=/update params={wt=javabin&version=2} {add=[34]} 0 0
   [junit4]   2> 691923 T3577 C2130 oasup.LogUpdateProcessor.finish [collection1] webapp=/solr path=/update params={wt=javabin&version=2} {add=[35]} 0 0
   [junit4]   2> 691928 T3578 C2130 oasup.LogUpdateProcessor.finish [collection1] webapp=/solr path=/update params={wt=javabin&version=2} {add=[36]} 0 0
   [junit4]   2> 691932 T3579 C2130 oasup.LogUpdateProcessor.finish [collection1] webapp=/solr path=/update params={wt=javabin&version=2} {add=[37]} 0 0
   [junit4]   2> 691936 T3580 C2130 oasup.LogUpdateProcessor.finish [collection1] webapp=/solr path=/update params={wt=javabin&version=2} {add=[38]} 0 0
   [junit4]   2> 691941 T3581 C2130 oasup.LogUpdateProcessor.finish [collection1] webapp=/solr path=/update params={wt=javabin&version=2} {add=[39]} 0 0
   [junit4]   2> 691949 T3582 C2130 oasup.LogUpdateProcessor.finish [collection1] webapp=/solr path=/update params={wt=javabin&version=2} {add=[40]} 0 3
   [junit4]   2> 691958 T3577 C2130 oasup.LogUpdateProcessor.finish [collection1] webapp=/solr path=/update params={wt=javabin&version=2} {add=[41]} 0 0
   [junit4]   2> 691962 T3577 C2130 oasup.LogUpdateProcessor.finish [collection1] webapp=/solr path=/update params={wt=javabin&version=2} {add=[42]} 0 0
   [junit4]   2> 691970 T3578 C2130 oasup.LogUpdateProcessor.finish [collection1] webapp=/solr path=/update params={wt=javabin&version=2} {add=[43]} 0 0
   [junit4]   2> 691975 T3579 C2130 oasup.LogUpdateProcessor.finish [collection1] webapp=/solr path=/update params={wt=javabin&version=2} {add=[44]} 0 0
   [junit4]   2> 691981 T3580 C2130 oasu.DirectUpdateHandler2.commit start commit{,optimize=false,openSearcher=true,waitSearcher=true,expungeDeletes=false,softCommit=false,prepareCommit=false}
   [junit4]   2> 691982 T3580 C2130 oasc.SolrDeletionPolicy.onCommit SolrDeletionPolicy.onCommit: commits: num=2
   [junit4]   2> 		commit{dir=MockDirectoryWrapper(RAMDirectory@c93ea5 lockFactory=org.apache.lucene.store.SingleInstanceLockFactory@11f5ecd),segFN=segments_1,generation=1}
   [junit4]   2> 		commit{dir=MockDirectoryWrapper(RAMDirectory@c93ea5 lockFactory=org.apache.lucene.store.SingleInstanceLockFactory@11f5ecd),segFN=segments_2,generation=2}
   [junit4]   2> 691984 T3580 C2130 oasc.SolrDeletionPolicy.updateCommits newest commit generation = 2
   [junit4]   2> 691988 T3580 C2130 oass.SolrIndexSearcher.<init> Opening Searcher@194a54b[collection1] main
   [junit4]   2> 691988 T3580 C2130 oasu.DirectUpdateHandler2.commit end_commit_flush
   [junit4]   2> 691988 T3589 oash.SnapShooter.createSnapshot Creating backup snapshot...
   [junit4]   2> 691992 T3586 oasc.SolrCore.registerSearcher [collection1] Registered new searcher Searcher@194a54b[collection1] main{ExitableDirectoryReader(UninvertingDirectoryReader(Uninverting(_0(6.0.0):C45)))}
   [junit4]   2> 691992 T3580 C2130 oasup.LogUpdateProcessor.finish [collection1] webapp=/solr path=/update params={waitSearcher=true&commit=true&softCommit=false&wt=javabin&version=2} {commit=} 0 11
   [junit4]   2> 691995 T3581 C2130 oasc.SolrCore.execute [collection1] webapp=/solr path=/replication params={command=details} status=0 QTime=0 
   [junit4]   2> 692004 T3589 oash.SnapShooter.createSnapshot Done creating backup snapshot: <not named>
   [junit4]   2> 693039 T3582 C2130 oasc.SolrCore.execute [collection1] webapp=/solr path=/replication params={command=details} status=0 QTime=0 
   [junit4]   2> 694084 T3553 oas.SolrTestCaseJ4.tearDown ###Ending testBackupOnCommit
   [junit4]   2> 694086 T3553 oejs.AbstractConnector.doStop Stopped ServerConnector@1fb3dec{HTTP/1.1}{127.0.0.1:0}
   [junit4]   2> 694086 T3553 oasc.CoreContainer.shutdown Shutting down CoreContainer instance=11350426
   [junit4]   2> 694087 T3553 oasc.SolrCore.close [collection1]  CLOSING SolrCore org.apache.solr.core.SolrCore@1c4ae07
   [junit4]   2> 694087 T3553 oasu.DirectUpdateHandler2.close closing DirectUpdateHandler2{commits=1,autocommits=0,soft autocommits=0,optimizes=0,rollbacks=0,expungeDeletes=0,docsPending=0,adds=0,deletesById=0,deletesByQuery=0,errors=0,cumulative_adds=45,cumulative_deletesById=0,cumulative_deletesByQuery=1,cumulative_errors=0}
   [junit4]   2> 694088 T3553 oasu.SolrCoreState.decrefSolrCoreState Closing SolrCoreState
   [junit4]   2> 694088 T3553 oasu.DefaultSolrCoreState.closeIndexWriter SolrCoreState ref count has reached 0 - closing IndexWriter
   [junit4]   2> 694089 T3553 oasu.DefaultSolrCoreState.closeIndexWriter closing IndexWriter with IndexWriterCloser
   [junit4]   2> 694092 T3553 oasc.SolrCore.closeSearcher [collection1] Closing main searcher on request.
   [junit4]   2> 694093 T3553 oasc.CachingDirectoryFactory.close Closing MockDirectoryFactory - 2 directories currently being tracked
   [junit4]   2> 694093 T3553 oasc.CachingDirectoryFactory.closeCacheValue looking to close C:\Users\JenkinsSlave\workspace\Lucene-Solr-trunk-Windows\solr\build\solr-core\test\J0\temp\solr.handler.TestReplicationHandlerBackup AD67B4CAAB2A4EBC-001\solr-instance-002\collection1\data\index [CachedDir<<refCount=0;path=C:\Users\JenkinsSlave\workspace\Lucene-Solr-trunk-Windows\solr\build\solr-core\test\J0\temp\solr.handler.TestReplicationHandlerBackup AD67B4CAAB2A4EBC-001\solr-instance-002\collection1\data\index;done=false>>]
   [junit4]   2> 694093 T3553 oasc.CachingDirectoryFactory.close Closing directory: C:\Users\JenkinsSlave\workspace\Lucene-Solr-trunk-Windows\solr\build\solr-core\test\J0\temp\solr.handler.TestReplicationHandlerBackup AD67B4CAAB2A4EBC-001\solr-instance-002\collection1\data\index
   [junit4]   2> 694094 T3553 oasc.CachingDirectoryFactory.closeCacheValue looking to close C:\Users\JenkinsSlave\workspace\Lucene-Solr-trunk-Windows\solr\build\solr-core\test\J0\temp\solr.handler.TestReplicationHandlerBackup AD67B4CAAB2A4EBC-001\solr-instance-002\collection1\data\ [CachedDir<<refCount=0;path=C:\Users\JenkinsSlave\workspace\Lucene-Solr-trunk-Windows\solr\build\solr-core\test\J0\temp\solr.handler.TestReplicationHandlerBackup AD67B4CAAB2A4EBC-001\solr-instance-002\collection1\data\;done=false>>]
   [junit4]   2> 694094 T3553 oasc.CachingDirectoryFactory.close Closing directory: C:\Users\JenkinsSlave\workspace\Lucene-Solr-trunk-Windows\solr\build\solr-core\test\J0\temp\solr.handler.TestReplicationHandlerBackup AD67B4CAAB2A4EBC-001\solr-instance-002\collection1\data\
   [junit4]   2> 694095 T3553 oejsh.ContextHandler.doStop Stopped o.e.j.s.ServletContextHandler@1775696{/solr,null,UNAVAILABLE}
   [junit4]   2> NOTE: reproduce with: ant test  -Dtestcase=TestReplicationHandlerBackup -Dtests.method=testBackupOnCommit -Dtests.seed=AD67B4CAAB2A4EBC -Dtests.slow=true -Dtests.locale=es_GT -Dtests.timezone=America/Whitehorse -Dtests.asserts=true -Dtests.file.encoding=ISO-8859-1
   [junit4] ERROR   2.62s | TestReplicationHandlerBackup.testBackupOnCommit <<<
   [junit4]    > Throwable #1: java.io.IOException: Could not remove the following files (in the order of attempts):
   [junit4]    >    C:\Users\JenkinsSlave\workspace\Lucene-Solr-trunk-Windows\solr\build\solr-core\test\J0\temp\solr.handler.TestReplicationHandlerBackup AD67B4CAAB2A4EBC-001\solr-instance-002\collection1: java.nio.file.DirectoryNotEmptyException: C:\Users\JenkinsSlave\workspace\Lucene-Solr-trunk-Windows\solr\build\solr-core\test\J0\temp\solr.handler.TestReplicationHandlerBackup AD67B4CAAB2A4EBC-001\solr-instance-002\collection1
   [junit4]    >    C:\Users\JenkinsSlave\workspace\Lucene-Solr-trunk-Windows\solr\build\solr-core\test\J0\temp\solr.handler.TestReplicationHandlerBackup AD67B4CAAB2A4EBC-001\solr-instance-002: java.nio.file.DirectoryNotEmptyException: C:\Users\JenkinsSlave\workspace\Lucene-Solr-trunk-Windows\solr\build\solr-core\test\J0\temp\solr.handler.TestReplicationHandlerBackup AD67B4CAAB2A4EBC-001\solr-instance-002
   [junit4]    > 	at __randomizedtesting.SeedInfo.seed([AD67B4CAAB2A4EBC:848F5A21D4D2F2A5]:0)
   [junit4]    > 	at org.apache.lucene.util.IOUtils.rm(IOUtils.java:286)
   [junit4]    > 	at org.apache.solr.handler.TestReplicationHandler$SolrInstance.tearDown(TestReplicationHandler.java:1509)
   [junit4]    > 	at org.apache.solr.handler.TestReplicationHandlerBackup.tearDown(TestReplicationHandlerBackup.java:115)
   [junit4]    > 	at java.lang.Thread.run(Thread.java:745)
   [junit4]   2> 694112 T3553 oas.SolrTestCaseJ4.deleteCore ###deleteCore
   [junit4]   2> NOTE: leaving temporary files on disk at: C:\Users\JenkinsSlave\workspace\Lucene-Solr-trunk-Windows\solr\build\solr-core\test\J0\temp\solr.handler.TestReplicationHandlerBackup AD67B4CAAB2A4EBC-001
   [junit4]   2> NOTE: test params are: codec=Lucene50, sim=RandomSimilarityProvider(queryNorm=false,coord=yes): {}, locale=es_GT, timezone=America/Whitehorse
   [junit4]   2> NOTE: Windows 7 6.1 x86/Oracle Corporation 1.8.0_31 (32-bit)/cpus=2,threads=1,free=85984752,total=135352320
   [junit4]   2> NOTE: All tests run in this JVM: [TestNoOpRegenerator, FullSolrCloudDistribCmdsTest, TestExtendedDismaxParser, PrimUtilsTest, TestBM25SimilarityFactory, TestTrie, TestSolrDeletionPolicy1, PreAnalyzedFieldTest, PolyFieldTest, TimeZoneUtilsTest, UUIDFieldTest, SuggesterFSTTest, TestIndexingPerformance, TestFuzzyAnalyzedSuggestions, TestManagedReso

[...truncated too long message...]

 		10	/solr/live_nodes
   [junit4]   2> 		3	/solr/overseer/queue
   [junit4]   2> 		3	/solr/overseer/collection-queue-work
   [junit4]   2> 	
   [junit4]   2> 2328454 T10987 oas.SolrTestCaseJ4.deleteCore ###deleteCore
   [junit4]   2> NOTE: test params are: codec=Asserting(Lucene50): {other_tl1=Lucene50(blocksize=128), SubjectTerms_mfacet=Lucene50(blocksize=128), n_l1=Lucene50(blocksize=128), multiDefault=TestBloomFilteredLucenePostings(BloomFilteringPostingsFormat(Lucene50(blocksize=128))), intDefault=Lucene50(blocksize=128), n_td1=TestBloomFilteredLucenePostings(BloomFilteringPostingsFormat(Lucene50(blocksize=128))), n_d1=Lucene50(blocksize=128), range_facet_l=Lucene50(blocksize=128), n_f1=TestBloomFilteredLucenePostings(BloomFilteringPostingsFormat(Lucene50(blocksize=128))), n_tl1=TestBloomFilteredLucenePostings(BloomFilteringPostingsFormat(Lucene50(blocksize=128))), oddField_s=FSTOrd50, n_tf1=Lucene50(blocksize=128), a_t=Lucene50(blocksize=128), id=PostingsFormat(name=LuceneFixedGap), text=FSTOrd50, timestamp=Lucene50(blocksize=128), n_dt1=TestBloomFilteredLucenePostings(BloomFilteringPostingsFormat(Lucene50(blocksize=128))), a_i1=Lucene50(blocksize=128), n_ti1=PostingsFormat(name=LuceneFixedGap), rnd_b=PostingsFormat(name=LuceneFixedGap), _version_=Lucene50(blocksize=128), foo_b=FSTOrd50, n_tdt1=Lucene50(blocksize=128), foo_d=PostingsFormat(name=LuceneFixedGap), foo_f=FSTOrd50}, docValues:{timestamp=DocValuesFormat(name=Asserting)}, sim=RandomSimilarityProvider(queryNorm=true,coord=yes): {}, locale=en_IE, timezone=America/Miquelon
   [junit4]   2> NOTE: Windows 7 6.1 x86/Oracle Corporation 1.8.0_31 (32-bit)/cpus=2,threads=1,free=136540784,total=240119808
   [junit4]   2> NOTE: All tests run in this JVM: [TestNoOpRegenerator, FullSolrCloudDistribCmdsTest, TestExtendedDismaxParser, PrimUtilsTest, TestBM25SimilarityFactory, TestTrie, TestSolrDeletionPolicy1, PreAnalyzedFieldTest, PolyFieldTest, TimeZoneUtilsTest, UUIDFieldTest, SuggesterFSTTest, TestIndexingPerformance, TestFuzzyAnalyzedSuggestions, TestManagedResource, EchoParamsTest, TestManagedSynonymFilterFactory, TestIBSimilarityFactory, NotRequiredUniqueKeyTest, MultiTermTest, PeerSyncTest, TestNonDefinedSimilarityFactory, SolrIndexSplitterTest, DirectUpdateHandlerTest, DefaultValueUpdateProcessorTest, TestInfoStreamLogging, TestQuerySenderNoQuery, SimpleFacetsTest, TestBulkSchemaAPI, OverseerTest, CurrencyFieldOpenExchangeTest, ConvertedLegacyTest, TestIndexSearcher, TestJmxIntegration, BadCopyFieldTest, RequestHandlersTest, TestTolerantSearch, TestWordDelimiterFilterFactory, BasicDistributedZkTest, HdfsDirectoryFactoryTest, CoreAdminCreateDiscoverTest, IndexSchemaTest, DistributedMLTComponentTest, TestBulkSchemaConcurrent, DirectUpdateHandlerOptimizeTest, LoggingHandlerTest, TestPhraseSuggestions, TestHighFrequencyDictionaryFactory, CSVRequestHandlerTest, DistributedFacetPivotSmallAdvancedTest, VMParamsZkACLAndCredentialsProvidersTest, DistanceUnitsTest, SuggesterTest, CollectionsAPIDistributedZkTest, IndexSchemaRuntimeFieldTest, TestCollapseQParserPlugin, TestSimpleQParserPlugin, OverseerRolesTest, URLClassifyProcessorTest, SSLMigrationTest, SimpleCollectionCreateDeleteTest, DistributedExpandComponentTest, TestSchemaResource, TestRangeQuery, SuggesterTSTTest, CursorMarkTest, ExternalCollectionsTest, DistributedIntervalFacetingTest, DOMUtilTest, TestReload, TestInitQParser, TestSolrXml, TestReplicationHandlerBackup, BasicFunctionalityTest, DistanceFunctionTest, CoreAdminHandlerTest, CachingDirectoryFactoryTest, SolrRequestParserTest, TestFaceting, AliasIntegrationTest, SpellCheckComponentTest, AnalysisErrorHandlingTest, SoftAutoCommitTest, TestSuggestSpellingConverter, UpdateRequestProcessorFactoryTest, TestSolrConfigHandler, BufferStoreTest, UnloadDistributedZkTest, EnumFieldTest, TestStressRecovery, TestCharFilters, TestCodecSupport, DocValuesTest, DeleteShardTest, TestCursorMarkWithoutUniqueKey, TestCSVLoader, AddSchemaFieldsUpdateProcessorFactoryTest, SyncSliceTest, TestStandardQParsers, TestReversedWildcardFilterFactory, BJQParserTest, TestUtils, TestAddFieldRealTimeGet, TestExactStatsCache, DirectSolrSpellCheckerTest, TestStressReorder, ScriptEngineTest, TestAnalyzeInfixSuggestions, AnalyticsMergeStrategyTest, SpellPossibilityIteratorTest, TestRandomMergePolicy, TestLFUCache, RankQueryTest, IndexBasedSpellCheckerTest, SpellingQueryConverterTest, TestLMDirichletSimilarityFactory, HdfsRecoveryZkTest, ClusterStateTest, TestSolrConfigHandlerCloud, SliceStateTest, HighlighterConfigTest, AutoCommitTest, LeaderElectionIntegrationTest, TestManagedSchemaFieldResource, TestDefaultSimilarityFactory, TestDistributedSearch, FacetPivotSmallTest, ShowFileRequestHandlerTest, TestDistribDocBasedVersion, TestMergePolicyConfig, TestOmitPositions, DistributedFacetPivotWhiteBoxTest, TestZkChroot, ParsingFieldUpdateProcessorsTest, TestConfigReload, TestFieldCollectionResource, TestComplexPhraseQParserPlugin, SuggestComponentTest, TestCopyFieldCollectionResource, DocumentAnalysisRequestHandlerTest, DateFieldTest, LukeRequestHandlerTest, OverseerCollectionProcessorTest, StandardRequestHandlerTest, SynonymTokenizerTest, CacheHeaderTest, TestFastOutputStream, TestNRTOpen, TestSolr4Spatial, CursorPagingTest, TermsComponentTest, TestCustomSort, HdfsBasicDistributedZkTest, TestXIncludeConfig, TestBlendedInfixSuggestions, TestMiniSolrCloudCluster, TestQuerySenderListener, TestClassNameShortening, MergeStrategyTest, TestCollectionAPI, ZkSolrClientTest, TestConfigSets, TestIntervalFaceting, AtomicUpdatesTest, ReplicationFactorTest, TestUniqueKeyFieldResource, TestFieldTypeCollectionResource, TestSolrIndexConfig, SpatialRPTFieldTypeTest, TestBinaryResponseWriter, SolrCmdDistributorTest, DistributedQueueTest, TestComponentsName, TestReplicaProperties, ResponseHeaderTest, DistributedSuggestComponentTest, SolrCoreCheckLockOnStartupTest, CoreMergeIndexesAdminHandlerTest, DistributedQueryComponentCustomSortTest, TermVectorComponentDistributedTest, StressHdfsTest, TestCoreDiscovery, DeleteReplicaTest, ZkCLITest, DistribCursorPagingTest, SchemaVersionSpecificBehaviorTest, HdfsChaosMonkeySafeLeaderTest, CloudMLTQParserTest, RollingRestartTest, StatsComponentTest, TestSolrDynamicMBean, TestHighlightDedupGrouping, BlockCacheTest, TestClusterStateMutator, HdfsBasicDistributedZk2Test, TestShortCircuitedRequests, SharedFSAutoReplicaFailoverTest, TestSystemIdResolver, ZkNodePropsTest, CloudExitableDirectoryReaderTest, TestFieldSortValues, TestSweetSpotSimilarityFactory, OverriddenZkACLAndCredentialsProvidersTest, TestLRUStatsCache, ShardSplitTest, DirectSolrConnectionTest, TestArbitraryIndexDir, SOLR749Test, NumericFieldsTest, TestPostingsSolrHighlighter, CollectionsAPIAsyncDistributedZkTest, OpenCloseCoreStressTest, TestLuceneMatchVersion, RemoteQueryErrorTest, SimpleMLTQParserTest, RequestLoggingTest, TestRecoveryHdfs, DistributedFacetPivotLongTailTest, AlternateDirectoryTest, TestDocBasedVersionConstraints, ExitableDirectoryReaderTest, TestWriterPerf, ChaosMonkeySafeLeaderTest, BasicDistributedZk2Test]
   [junit4]   2> NOTE: reproduce with: ant test  -Dtestcase=BasicDistributedZk2Test -Dtests.seed=AD67B4CAAB2A4EBC -Dtests.slow=true -Dtests.locale=en_IE -Dtests.timezone=America/Miquelon -Dtests.asserts=true -Dtests.file.encoding=ISO-8859-1
   [junit4] ERROR   0.00s | BasicDistributedZk2Test (suite) <<<
   [junit4]    > Throwable #1: java.io.IOException: Could not remove the following files (in the order of attempts):
   [junit4]    >    C:\Users\JenkinsSlave\workspace\Lucene-Solr-trunk-Windows\solr\build\solr-core\test\J0\temp\solr.cloud.BasicDistributedZk2Test AD67B4CAAB2A4EBC-001\tempDir-002: java.nio.file.AccessDeniedException: C:\Users\JenkinsSlave\workspace\Lucene-Solr-trunk-Windows\solr\build\solr-core\test\J0\temp\solr.cloud.BasicDistributedZk2Test AD67B4CAAB2A4EBC-001\tempDir-002
   [junit4]    >    C:\Users\JenkinsSlave\workspace\Lucene-Solr-trunk-Windows\solr\build\solr-core\test\J0\temp\solr.cloud.BasicDistributedZk2Test AD67B4CAAB2A4EBC-001: java.nio.file.DirectoryNotEmptyException: C:\Users\JenkinsSlave\workspace\Lucene-Solr-trunk-Windows\solr\build\solr-core\test\J0\temp\solr.cloud.BasicDistributedZk2Test AD67B4CAAB2A4EBC-001
   [junit4]    > 	at __randomizedtesting.SeedInfo.seed([AD67B4CAAB2A4EBC]:0)
   [junit4]    > 	at org.apache.lucene.util.IOUtils.rm(IOUtils.java:286)
   [junit4]    > 	at java.lang.Thread.run(Thread.java:745)
   [junit4] Completed in 79.48s, 1 test, 1 error <<< FAILURES!

[...truncated 714 lines...]
BUILD FAILED
C:\Users\JenkinsSlave\workspace\Lucene-Solr-trunk-Windows\build.xml:519: The following error occurred while executing this line:
C:\Users\JenkinsSlave\workspace\Lucene-Solr-trunk-Windows\build.xml:467: The following error occurred while executing this line:
C:\Users\JenkinsSlave\workspace\Lucene-Solr-trunk-Windows\build.xml:61: The following error occurred while executing this line:
C:\Users\JenkinsSlave\workspace\Lucene-Solr-trunk-Windows\extra-targets.xml:39: The following error occurred while executing this line:
C:\Users\JenkinsSlave\workspace\Lucene-Solr-trunk-Windows\solr\build.xml:191: The following error occurred while executing this line:
C:\Users\JenkinsSlave\workspace\Lucene-Solr-trunk-Windows\solr\common-build.xml:510: The following error occurred while executing this line:
C:\Users\JenkinsSlave\workspace\Lucene-Solr-trunk-Windows\lucene\common-build.xml:1348: The following error occurred while executing this line:
C:\Users\JenkinsSlave\workspace\Lucene-Solr-trunk-Windows\lucene\common-build.xml:956: There were test failures: 463 suites, 1853 tests, 2 suite-level errors, 3 errors, 55 ignored (30 assumptions)

Total time: 115 minutes 55 seconds
Build step 'Invoke Ant' marked build as failure
[description-setter] Description set: Java: 32bit/jdk1.8.0_31 -server -XX:+UseConcMarkSweepGC
Archiving artifacts
Recording test results
Email was triggered for: Failure - Any
Sending email for trigger: Failure - Any



Mime
View raw message