lucene-dev mailing list archives

Site index · List index
Message view « Date » · « Thread »
Top « Date » · « Thread »
From Policeman Jenkins Server <jenk...@thetaphi.de>
Subject [JENKINS] Lucene-Solr-trunk-Windows (64bit/jdk1.8.0_31) - Build # 4472 - Still Failing!
Date Sun, 08 Feb 2015 15:48:27 GMT
Build: http://jenkins.thetaphi.de/job/Lucene-Solr-trunk-Windows/4472/
Java: 64bit/jdk1.8.0_31 -XX:+UseCompressedOops -XX:+UseParallelGC

5 tests failed.
FAILED:  org.apache.solr.cloud.CollectionsAPIAsyncDistributedZkTest.testSolrJAPICalls

Error Message:
Shard split did not complete. Last recorded state: running expected:<[completed]> but was:<[running]>

Stack Trace:
org.junit.ComparisonFailure: Shard split did not complete. Last recorded state: running expected:<[completed]> but was:<[running]>
	at __randomizedtesting.SeedInfo.seed([10B6A7243CBE525A:48D22B453AD4FA8E]:0)
	at org.junit.Assert.assertEquals(Assert.java:125)
	at org.apache.solr.cloud.CollectionsAPIAsyncDistributedZkTest.testSolrJAPICalls(CollectionsAPIAsyncDistributedZkTest.java:101)
	at sun.reflect.NativeMethodAccessorImpl.invoke0(Native Method)
	at sun.reflect.NativeMethodAccessorImpl.invoke(NativeMethodAccessorImpl.java:62)
	at sun.reflect.DelegatingMethodAccessorImpl.invoke(DelegatingMethodAccessorImpl.java:43)
	at java.lang.reflect.Method.invoke(Method.java:483)
	at com.carrotsearch.randomizedtesting.RandomizedRunner.invoke(RandomizedRunner.java:1618)
	at com.carrotsearch.randomizedtesting.RandomizedRunner$6.evaluate(RandomizedRunner.java:827)
	at com.carrotsearch.randomizedtesting.RandomizedRunner$7.evaluate(RandomizedRunner.java:863)
	at com.carrotsearch.randomizedtesting.RandomizedRunner$8.evaluate(RandomizedRunner.java:877)
	at org.apache.solr.BaseDistributedSearchTestCase$ShardsRepeatRule$ShardsFixedStatement.callStatement(BaseDistributedSearchTestCase.java:940)
	at org.apache.solr.BaseDistributedSearchTestCase$ShardsRepeatRule$ShardsStatement.evaluate(BaseDistributedSearchTestCase.java:915)
	at com.carrotsearch.randomizedtesting.rules.SystemPropertiesRestoreRule$1.evaluate(SystemPropertiesRestoreRule.java:53)
	at org.apache.lucene.util.TestRuleSetupTeardownChained$1.evaluate(TestRuleSetupTeardownChained.java:50)
	at org.apache.lucene.util.AbstractBeforeAfterRule$1.evaluate(AbstractBeforeAfterRule.java:46)
	at com.carrotsearch.randomizedtesting.rules.SystemPropertiesInvariantRule$1.evaluate(SystemPropertiesInvariantRule.java:55)
	at org.apache.lucene.util.TestRuleThreadAndTestName$1.evaluate(TestRuleThreadAndTestName.java:49)
	at org.apache.lucene.util.TestRuleIgnoreAfterMaxFailures$1.evaluate(TestRuleIgnoreAfterMaxFailures.java:65)
	at org.apache.lucene.util.TestRuleMarkFailure$1.evaluate(TestRuleMarkFailure.java:48)
	at com.carrotsearch.randomizedtesting.rules.StatementAdapter.evaluate(StatementAdapter.java:36)
	at com.carrotsearch.randomizedtesting.ThreadLeakControl$StatementRunner.run(ThreadLeakControl.java:365)
	at com.carrotsearch.randomizedtesting.ThreadLeakControl.forkTimeoutingTask(ThreadLeakControl.java:798)
	at com.carrotsearch.randomizedtesting.ThreadLeakControl$3.evaluate(ThreadLeakControl.java:458)
	at com.carrotsearch.randomizedtesting.RandomizedRunner.runSingleTest(RandomizedRunner.java:836)
	at com.carrotsearch.randomizedtesting.RandomizedRunner$3.evaluate(RandomizedRunner.java:738)
	at com.carrotsearch.randomizedtesting.RandomizedRunner$4.evaluate(RandomizedRunner.java:772)
	at com.carrotsearch.randomizedtesting.RandomizedRunner$5.evaluate(RandomizedRunner.java:783)
	at com.carrotsearch.randomizedtesting.rules.StatementAdapter.evaluate(StatementAdapter.java:36)
	at com.carrotsearch.randomizedtesting.rules.SystemPropertiesRestoreRule$1.evaluate(SystemPropertiesRestoreRule.java:53)
	at org.apache.lucene.util.AbstractBeforeAfterRule$1.evaluate(AbstractBeforeAfterRule.java:46)
	at org.apache.lucene.util.TestRuleStoreClassName$1.evaluate(TestRuleStoreClassName.java:42)
	at com.carrotsearch.randomizedtesting.rules.SystemPropertiesInvariantRule$1.evaluate(SystemPropertiesInvariantRule.java:55)
	at com.carrotsearch.randomizedtesting.rules.NoShadowingOrOverridesOnMethodsRule$1.evaluate(NoShadowingOrOverridesOnMethodsRule.java:39)
	at com.carrotsearch.randomizedtesting.rules.NoShadowingOrOverridesOnMethodsRule$1.evaluate(NoShadowingOrOverridesOnMethodsRule.java:39)
	at com.carrotsearch.randomizedtesting.rules.StatementAdapter.evaluate(StatementAdapter.java:36)
	at com.carrotsearch.randomizedtesting.rules.StatementAdapter.evaluate(StatementAdapter.java:36)
	at com.carrotsearch.randomizedtesting.rules.StatementAdapter.evaluate(StatementAdapter.java:36)
	at org.apache.lucene.util.TestRuleAssertionsRequired$1.evaluate(TestRuleAssertionsRequired.java:54)
	at org.apache.lucene.util.TestRuleMarkFailure$1.evaluate(TestRuleMarkFailure.java:48)
	at org.apache.lucene.util.TestRuleIgnoreAfterMaxFailures$1.evaluate(TestRuleIgnoreAfterMaxFailures.java:65)
	at org.apache.lucene.util.TestRuleIgnoreTestSuites$1.evaluate(TestRuleIgnoreTestSuites.java:55)
	at com.carrotsearch.randomizedtesting.rules.StatementAdapter.evaluate(StatementAdapter.java:36)
	at com.carrotsearch.randomizedtesting.ThreadLeakControl$StatementRunner.run(ThreadLeakControl.java:365)
	at java.lang.Thread.run(Thread.java:745)


FAILED:  junit.framework.TestSuite.org.apache.solr.cloud.BasicDistributedZk2Test

Error Message:
Could not remove the following files (in the order of attempts):    C:\Users\JenkinsSlave\workspace\Lucene-Solr-trunk-Windows\solr\build\solr-core\test\J0\temp\solr.cloud.BasicDistributedZk2Test 10B6A7243CBE525A-001\tempDir-002: java.nio.file.AccessDeniedException: C:\Users\JenkinsSlave\workspace\Lucene-Solr-trunk-Windows\solr\build\solr-core\test\J0\temp\solr.cloud.BasicDistributedZk2Test 10B6A7243CBE525A-001\tempDir-002    C:\Users\JenkinsSlave\workspace\Lucene-Solr-trunk-Windows\solr\build\solr-core\test\J0\temp\solr.cloud.BasicDistributedZk2Test 10B6A7243CBE525A-001: java.nio.file.DirectoryNotEmptyException: C:\Users\JenkinsSlave\workspace\Lucene-Solr-trunk-Windows\solr\build\solr-core\test\J0\temp\solr.cloud.BasicDistributedZk2Test 10B6A7243CBE525A-001 

Stack Trace:
java.io.IOException: Could not remove the following files (in the order of attempts):
   C:\Users\JenkinsSlave\workspace\Lucene-Solr-trunk-Windows\solr\build\solr-core\test\J0\temp\solr.cloud.BasicDistributedZk2Test 10B6A7243CBE525A-001\tempDir-002: java.nio.file.AccessDeniedException: C:\Users\JenkinsSlave\workspace\Lucene-Solr-trunk-Windows\solr\build\solr-core\test\J0\temp\solr.cloud.BasicDistributedZk2Test 10B6A7243CBE525A-001\tempDir-002
   C:\Users\JenkinsSlave\workspace\Lucene-Solr-trunk-Windows\solr\build\solr-core\test\J0\temp\solr.cloud.BasicDistributedZk2Test 10B6A7243CBE525A-001: java.nio.file.DirectoryNotEmptyException: C:\Users\JenkinsSlave\workspace\Lucene-Solr-trunk-Windows\solr\build\solr-core\test\J0\temp\solr.cloud.BasicDistributedZk2Test 10B6A7243CBE525A-001

	at __randomizedtesting.SeedInfo.seed([10B6A7243CBE525A]:0)
	at org.apache.lucene.util.IOUtils.rm(IOUtils.java:286)
	at org.apache.lucene.util.TestRuleTemporaryFilesCleanup.afterAlways(TestRuleTemporaryFilesCleanup.java:170)
	at com.carrotsearch.randomizedtesting.rules.TestRuleAdapter$1.afterAlways(TestRuleAdapter.java:31)
	at com.carrotsearch.randomizedtesting.rules.StatementAdapter.evaluate(StatementAdapter.java:43)
	at com.carrotsearch.randomizedtesting.rules.StatementAdapter.evaluate(StatementAdapter.java:36)
	at org.apache.lucene.util.TestRuleAssertionsRequired$1.evaluate(TestRuleAssertionsRequired.java:54)
	at org.apache.lucene.util.TestRuleMarkFailure$1.evaluate(TestRuleMarkFailure.java:48)
	at org.apache.lucene.util.TestRuleIgnoreAfterMaxFailures$1.evaluate(TestRuleIgnoreAfterMaxFailures.java:65)
	at org.apache.lucene.util.TestRuleIgnoreTestSuites$1.evaluate(TestRuleIgnoreTestSuites.java:55)
	at com.carrotsearch.randomizedtesting.rules.StatementAdapter.evaluate(StatementAdapter.java:36)
	at com.carrotsearch.randomizedtesting.ThreadLeakControl$StatementRunner.run(ThreadLeakControl.java:365)
	at java.lang.Thread.run(Thread.java:745)


FAILED:  org.apache.solr.handler.TestReplicationHandlerBackup.testBackupOnCommit

Error Message:
Could not remove the following files (in the order of attempts):    C:\Users\JenkinsSlave\workspace\Lucene-Solr-trunk-Windows\solr\build\solr-core\test\J0\temp\solr.handler.TestReplicationHandlerBackup 10B6A7243CBE525A-001\solr-instance-001\collection1: java.nio.file.DirectoryNotEmptyException: C:\Users\JenkinsSlave\workspace\Lucene-Solr-trunk-Windows\solr\build\solr-core\test\J0\temp\solr.handler.TestReplicationHandlerBackup 10B6A7243CBE525A-001\solr-instance-001\collection1    C:\Users\JenkinsSlave\workspace\Lucene-Solr-trunk-Windows\solr\build\solr-core\test\J0\temp\solr.handler.TestReplicationHandlerBackup 10B6A7243CBE525A-001\solr-instance-001: java.nio.file.DirectoryNotEmptyException: C:\Users\JenkinsSlave\workspace\Lucene-Solr-trunk-Windows\solr\build\solr-core\test\J0\temp\solr.handler.TestReplicationHandlerBackup 10B6A7243CBE525A-001\solr-instance-001 

Stack Trace:
java.io.IOException: Could not remove the following files (in the order of attempts):
   C:\Users\JenkinsSlave\workspace\Lucene-Solr-trunk-Windows\solr\build\solr-core\test\J0\temp\solr.handler.TestReplicationHandlerBackup 10B6A7243CBE525A-001\solr-instance-001\collection1: java.nio.file.DirectoryNotEmptyException: C:\Users\JenkinsSlave\workspace\Lucene-Solr-trunk-Windows\solr\build\solr-core\test\J0\temp\solr.handler.TestReplicationHandlerBackup 10B6A7243CBE525A-001\solr-instance-001\collection1
   C:\Users\JenkinsSlave\workspace\Lucene-Solr-trunk-Windows\solr\build\solr-core\test\J0\temp\solr.handler.TestReplicationHandlerBackup 10B6A7243CBE525A-001\solr-instance-001: java.nio.file.DirectoryNotEmptyException: C:\Users\JenkinsSlave\workspace\Lucene-Solr-trunk-Windows\solr\build\solr-core\test\J0\temp\solr.handler.TestReplicationHandlerBackup 10B6A7243CBE525A-001\solr-instance-001

	at __randomizedtesting.SeedInfo.seed([10B6A7243CBE525A:395E49CF4346EE43]:0)
	at org.apache.lucene.util.IOUtils.rm(IOUtils.java:286)
	at org.apache.solr.handler.TestReplicationHandler$SolrInstance.tearDown(TestReplicationHandler.java:1509)
	at org.apache.solr.handler.TestReplicationHandlerBackup.tearDown(TestReplicationHandlerBackup.java:115)
	at sun.reflect.NativeMethodAccessorImpl.invoke0(Native Method)
	at sun.reflect.NativeMethodAccessorImpl.invoke(NativeMethodAccessorImpl.java:62)
	at sun.reflect.DelegatingMethodAccessorImpl.invoke(DelegatingMethodAccessorImpl.java:43)
	at java.lang.reflect.Method.invoke(Method.java:483)
	at com.carrotsearch.randomizedtesting.RandomizedRunner.invoke(RandomizedRunner.java:1618)
	at com.carrotsearch.randomizedtesting.RandomizedRunner$8.evaluate(RandomizedRunner.java:885)
	at com.carrotsearch.randomizedtesting.rules.SystemPropertiesRestoreRule$1.evaluate(SystemPropertiesRestoreRule.java:53)
	at org.apache.lucene.util.TestRuleSetupTeardownChained$1.evaluate(TestRuleSetupTeardownChained.java:50)
	at org.apache.lucene.util.AbstractBeforeAfterRule$1.evaluate(AbstractBeforeAfterRule.java:46)
	at com.carrotsearch.randomizedtesting.rules.SystemPropertiesInvariantRule$1.evaluate(SystemPropertiesInvariantRule.java:55)
	at org.apache.lucene.util.TestRuleThreadAndTestName$1.evaluate(TestRuleThreadAndTestName.java:49)
	at org.apache.lucene.util.TestRuleIgnoreAfterMaxFailures$1.evaluate(TestRuleIgnoreAfterMaxFailures.java:65)
	at org.apache.lucene.util.TestRuleMarkFailure$1.evaluate(TestRuleMarkFailure.java:48)
	at com.carrotsearch.randomizedtesting.rules.StatementAdapter.evaluate(StatementAdapter.java:36)
	at com.carrotsearch.randomizedtesting.ThreadLeakControl$StatementRunner.run(ThreadLeakControl.java:365)
	at com.carrotsearch.randomizedtesting.ThreadLeakControl.forkTimeoutingTask(ThreadLeakControl.java:798)
	at com.carrotsearch.randomizedtesting.ThreadLeakControl$3.evaluate(ThreadLeakControl.java:458)
	at com.carrotsearch.randomizedtesting.RandomizedRunner.runSingleTest(RandomizedRunner.java:836)
	at com.carrotsearch.randomizedtesting.RandomizedRunner$3.evaluate(RandomizedRunner.java:738)
	at com.carrotsearch.randomizedtesting.RandomizedRunner$4.evaluate(RandomizedRunner.java:772)
	at com.carrotsearch.randomizedtesting.RandomizedRunner$5.evaluate(RandomizedRunner.java:783)
	at com.carrotsearch.randomizedtesting.rules.StatementAdapter.evaluate(StatementAdapter.java:36)
	at com.carrotsearch.randomizedtesting.rules.SystemPropertiesRestoreRule$1.evaluate(SystemPropertiesRestoreRule.java:53)
	at org.apache.lucene.util.AbstractBeforeAfterRule$1.evaluate(AbstractBeforeAfterRule.java:46)
	at org.apache.lucene.util.TestRuleStoreClassName$1.evaluate(TestRuleStoreClassName.java:42)
	at com.carrotsearch.randomizedtesting.rules.SystemPropertiesInvariantRule$1.evaluate(SystemPropertiesInvariantRule.java:55)
	at com.carrotsearch.randomizedtesting.rules.NoShadowingOrOverridesOnMethodsRule$1.evaluate(NoShadowingOrOverridesOnMethodsRule.java:39)
	at com.carrotsearch.randomizedtesting.rules.NoShadowingOrOverridesOnMethodsRule$1.evaluate(NoShadowingOrOverridesOnMethodsRule.java:39)
	at com.carrotsearch.randomizedtesting.rules.StatementAdapter.evaluate(StatementAdapter.java:36)
	at com.carrotsearch.randomizedtesting.rules.StatementAdapter.evaluate(StatementAdapter.java:36)
	at com.carrotsearch.randomizedtesting.rules.StatementAdapter.evaluate(StatementAdapter.java:36)
	at org.apache.lucene.util.TestRuleAssertionsRequired$1.evaluate(TestRuleAssertionsRequired.java:54)
	at org.apache.lucene.util.TestRuleMarkFailure$1.evaluate(TestRuleMarkFailure.java:48)
	at org.apache.lucene.util.TestRuleIgnoreAfterMaxFailures$1.evaluate(TestRuleIgnoreAfterMaxFailures.java:65)
	at org.apache.lucene.util.TestRuleIgnoreTestSuites$1.evaluate(TestRuleIgnoreTestSuites.java:55)
	at com.carrotsearch.randomizedtesting.rules.StatementAdapter.evaluate(StatementAdapter.java:36)
	at com.carrotsearch.randomizedtesting.ThreadLeakControl$StatementRunner.run(ThreadLeakControl.java:365)
	at java.lang.Thread.run(Thread.java:745)


FAILED:  org.apache.solr.handler.TestReplicationHandlerBackup.doTestBackup

Error Message:
Could not remove the following files (in the order of attempts):    C:\Users\JenkinsSlave\workspace\Lucene-Solr-trunk-Windows\solr\build\solr-core\test\J0\temp\solr.handler.TestReplicationHandlerBackup 10B6A7243CBE525A-001\solr-instance-002\collection1: java.nio.file.DirectoryNotEmptyException: C:\Users\JenkinsSlave\workspace\Lucene-Solr-trunk-Windows\solr\build\solr-core\test\J0\temp\solr.handler.TestReplicationHandlerBackup 10B6A7243CBE525A-001\solr-instance-002\collection1    C:\Users\JenkinsSlave\workspace\Lucene-Solr-trunk-Windows\solr\build\solr-core\test\J0\temp\solr.handler.TestReplicationHandlerBackup 10B6A7243CBE525A-001\solr-instance-002: java.nio.file.DirectoryNotEmptyException: C:\Users\JenkinsSlave\workspace\Lucene-Solr-trunk-Windows\solr\build\solr-core\test\J0\temp\solr.handler.TestReplicationHandlerBackup 10B6A7243CBE525A-001\solr-instance-002 

Stack Trace:
java.io.IOException: Could not remove the following files (in the order of attempts):
   C:\Users\JenkinsSlave\workspace\Lucene-Solr-trunk-Windows\solr\build\solr-core\test\J0\temp\solr.handler.TestReplicationHandlerBackup 10B6A7243CBE525A-001\solr-instance-002\collection1: java.nio.file.DirectoryNotEmptyException: C:\Users\JenkinsSlave\workspace\Lucene-Solr-trunk-Windows\solr\build\solr-core\test\J0\temp\solr.handler.TestReplicationHandlerBackup 10B6A7243CBE525A-001\solr-instance-002\collection1
   C:\Users\JenkinsSlave\workspace\Lucene-Solr-trunk-Windows\solr\build\solr-core\test\J0\temp\solr.handler.TestReplicationHandlerBackup 10B6A7243CBE525A-001\solr-instance-002: java.nio.file.DirectoryNotEmptyException: C:\Users\JenkinsSlave\workspace\Lucene-Solr-trunk-Windows\solr\build\solr-core\test\J0\temp\solr.handler.TestReplicationHandlerBackup 10B6A7243CBE525A-001\solr-instance-002

	at __randomizedtesting.SeedInfo.seed([10B6A7243CBE525A:513D87411B00A115]:0)
	at org.apache.lucene.util.IOUtils.rm(IOUtils.java:286)
	at org.apache.solr.handler.TestReplicationHandler$SolrInstance.tearDown(TestReplicationHandler.java:1509)
	at org.apache.solr.handler.TestReplicationHandlerBackup.tearDown(TestReplicationHandlerBackup.java:115)
	at sun.reflect.NativeMethodAccessorImpl.invoke0(Native Method)
	at sun.reflect.NativeMethodAccessorImpl.invoke(NativeMethodAccessorImpl.java:62)
	at sun.reflect.DelegatingMethodAccessorImpl.invoke(DelegatingMethodAccessorImpl.java:43)
	at java.lang.reflect.Method.invoke(Method.java:483)
	at com.carrotsearch.randomizedtesting.RandomizedRunner.invoke(RandomizedRunner.java:1618)
	at com.carrotsearch.randomizedtesting.RandomizedRunner$8.evaluate(RandomizedRunner.java:885)
	at com.carrotsearch.randomizedtesting.rules.SystemPropertiesRestoreRule$1.evaluate(SystemPropertiesRestoreRule.java:53)
	at org.apache.lucene.util.TestRuleSetupTeardownChained$1.evaluate(TestRuleSetupTeardownChained.java:50)
	at org.apache.lucene.util.AbstractBeforeAfterRule$1.evaluate(AbstractBeforeAfterRule.java:46)
	at com.carrotsearch.randomizedtesting.rules.SystemPropertiesInvariantRule$1.evaluate(SystemPropertiesInvariantRule.java:55)
	at org.apache.lucene.util.TestRuleThreadAndTestName$1.evaluate(TestRuleThreadAndTestName.java:49)
	at org.apache.lucene.util.TestRuleIgnoreAfterMaxFailures$1.evaluate(TestRuleIgnoreAfterMaxFailures.java:65)
	at org.apache.lucene.util.TestRuleMarkFailure$1.evaluate(TestRuleMarkFailure.java:48)
	at com.carrotsearch.randomizedtesting.rules.StatementAdapter.evaluate(StatementAdapter.java:36)
	at com.carrotsearch.randomizedtesting.ThreadLeakControl$StatementRunner.run(ThreadLeakControl.java:365)
	at com.carrotsearch.randomizedtesting.ThreadLeakControl.forkTimeoutingTask(ThreadLeakControl.java:798)
	at com.carrotsearch.randomizedtesting.ThreadLeakControl$3.evaluate(ThreadLeakControl.java:458)
	at com.carrotsearch.randomizedtesting.RandomizedRunner.runSingleTest(RandomizedRunner.java:836)
	at com.carrotsearch.randomizedtesting.RandomizedRunner$3.evaluate(RandomizedRunner.java:738)
	at com.carrotsearch.randomizedtesting.RandomizedRunner$4.evaluate(RandomizedRunner.java:772)
	at com.carrotsearch.randomizedtesting.RandomizedRunner$5.evaluate(RandomizedRunner.java:783)
	at com.carrotsearch.randomizedtesting.rules.StatementAdapter.evaluate(StatementAdapter.java:36)
	at com.carrotsearch.randomizedtesting.rules.SystemPropertiesRestoreRule$1.evaluate(SystemPropertiesRestoreRule.java:53)
	at org.apache.lucene.util.AbstractBeforeAfterRule$1.evaluate(AbstractBeforeAfterRule.java:46)
	at org.apache.lucene.util.TestRuleStoreClassName$1.evaluate(TestRuleStoreClassName.java:42)
	at com.carrotsearch.randomizedtesting.rules.SystemPropertiesInvariantRule$1.evaluate(SystemPropertiesInvariantRule.java:55)
	at com.carrotsearch.randomizedtesting.rules.NoShadowingOrOverridesOnMethodsRule$1.evaluate(NoShadowingOrOverridesOnMethodsRule.java:39)
	at com.carrotsearch.randomizedtesting.rules.NoShadowingOrOverridesOnMethodsRule$1.evaluate(NoShadowingOrOverridesOnMethodsRule.java:39)
	at com.carrotsearch.randomizedtesting.rules.StatementAdapter.evaluate(StatementAdapter.java:36)
	at com.carrotsearch.randomizedtesting.rules.StatementAdapter.evaluate(StatementAdapter.java:36)
	at com.carrotsearch.randomizedtesting.rules.StatementAdapter.evaluate(StatementAdapter.java:36)
	at org.apache.lucene.util.TestRuleAssertionsRequired$1.evaluate(TestRuleAssertionsRequired.java:54)
	at org.apache.lucene.util.TestRuleMarkFailure$1.evaluate(TestRuleMarkFailure.java:48)
	at org.apache.lucene.util.TestRuleIgnoreAfterMaxFailures$1.evaluate(TestRuleIgnoreAfterMaxFailures.java:65)
	at org.apache.lucene.util.TestRuleIgnoreTestSuites$1.evaluate(TestRuleIgnoreTestSuites.java:55)
	at com.carrotsearch.randomizedtesting.rules.StatementAdapter.evaluate(StatementAdapter.java:36)
	at com.carrotsearch.randomizedtesting.ThreadLeakControl$StatementRunner.run(ThreadLeakControl.java:365)
	at java.lang.Thread.run(Thread.java:745)


FAILED:  org.apache.solr.cloud.ReplicationFactorTest.test

Error Message:
org.apache.solr.client.solrj.SolrServerException: IOException occured when talking to server at: http://127.0.0.1:63522/u/repfacttest_c8n_1x3_shard1_replica1

Stack Trace:
org.apache.solr.client.solrj.SolrServerException: org.apache.solr.client.solrj.SolrServerException: IOException occured when talking to server at: http://127.0.0.1:63522/u/repfacttest_c8n_1x3_shard1_replica1
	at org.apache.solr.client.solrj.impl.CloudSolrClient.directUpdate(CloudSolrClient.java:575)
	at org.apache.solr.client.solrj.impl.CloudSolrClient.sendRequest(CloudSolrClient.java:884)
	at org.apache.solr.client.solrj.impl.CloudSolrClient.requestWithRetryOnStaleState(CloudSolrClient.java:787)
	at org.apache.solr.client.solrj.impl.CloudSolrClient.request(CloudSolrClient.java:730)
	at org.apache.solr.cloud.ReplicationFactorTest.testRf3(ReplicationFactorTest.java:284)
	at org.apache.solr.cloud.ReplicationFactorTest.test(ReplicationFactorTest.java:112)
	at sun.reflect.NativeMethodAccessorImpl.invoke0(Native Method)
	at sun.reflect.NativeMethodAccessorImpl.invoke(NativeMethodAccessorImpl.java:62)
	at sun.reflect.DelegatingMethodAccessorImpl.invoke(DelegatingMethodAccessorImpl.java:43)
	at java.lang.reflect.Method.invoke(Method.java:483)
	at com.carrotsearch.randomizedtesting.RandomizedRunner.invoke(RandomizedRunner.java:1618)
	at com.carrotsearch.randomizedtesting.RandomizedRunner$6.evaluate(RandomizedRunner.java:827)
	at com.carrotsearch.randomizedtesting.RandomizedRunner$7.evaluate(RandomizedRunner.java:863)
	at com.carrotsearch.randomizedtesting.RandomizedRunner$8.evaluate(RandomizedRunner.java:877)
	at org.apache.solr.BaseDistributedSearchTestCase$ShardsRepeatRule$ShardsFixedStatement.callStatement(BaseDistributedSearchTestCase.java:940)
	at org.apache.solr.BaseDistributedSearchTestCase$ShardsRepeatRule$ShardsStatement.evaluate(BaseDistributedSearchTestCase.java:915)
	at com.carrotsearch.randomizedtesting.rules.SystemPropertiesRestoreRule$1.evaluate(SystemPropertiesRestoreRule.java:53)
	at org.apache.lucene.util.TestRuleSetupTeardownChained$1.evaluate(TestRuleSetupTeardownChained.java:50)
	at org.apache.lucene.util.AbstractBeforeAfterRule$1.evaluate(AbstractBeforeAfterRule.java:46)
	at com.carrotsearch.randomizedtesting.rules.SystemPropertiesInvariantRule$1.evaluate(SystemPropertiesInvariantRule.java:55)
	at org.apache.lucene.util.TestRuleThreadAndTestName$1.evaluate(TestRuleThreadAndTestName.java:49)
	at org.apache.lucene.util.TestRuleIgnoreAfterMaxFailures$1.evaluate(TestRuleIgnoreAfterMaxFailures.java:65)
	at org.apache.lucene.util.TestRuleMarkFailure$1.evaluate(TestRuleMarkFailure.java:48)
	at com.carrotsearch.randomizedtesting.rules.StatementAdapter.evaluate(StatementAdapter.java:36)
	at com.carrotsearch.randomizedtesting.ThreadLeakControl$StatementRunner.run(ThreadLeakControl.java:365)
	at com.carrotsearch.randomizedtesting.ThreadLeakControl.forkTimeoutingTask(ThreadLeakControl.java:798)
	at com.carrotsearch.randomizedtesting.ThreadLeakControl$3.evaluate(ThreadLeakControl.java:458)
	at com.carrotsearch.randomizedtesting.RandomizedRunner.runSingleTest(RandomizedRunner.java:836)
	at com.carrotsearch.randomizedtesting.RandomizedRunner$3.evaluate(RandomizedRunner.java:738)
	at com.carrotsearch.randomizedtesting.RandomizedRunner$4.evaluate(RandomizedRunner.java:772)
	at com.carrotsearch.randomizedtesting.RandomizedRunner$5.evaluate(RandomizedRunner.java:783)
	at com.carrotsearch.randomizedtesting.rules.StatementAdapter.evaluate(StatementAdapter.java:36)
	at com.carrotsearch.randomizedtesting.rules.SystemPropertiesRestoreRule$1.evaluate(SystemPropertiesRestoreRule.java:53)
	at org.apache.lucene.util.AbstractBeforeAfterRule$1.evaluate(AbstractBeforeAfterRule.java:46)
	at org.apache.lucene.util.TestRuleStoreClassName$1.evaluate(TestRuleStoreClassName.java:42)
	at com.carrotsearch.randomizedtesting.rules.SystemPropertiesInvariantRule$1.evaluate(SystemPropertiesInvariantRule.java:55)
	at com.carrotsearch.randomizedtesting.rules.NoShadowingOrOverridesOnMethodsRule$1.evaluate(NoShadowingOrOverridesOnMethodsRule.java:39)
	at com.carrotsearch.randomizedtesting.rules.NoShadowingOrOverridesOnMethodsRule$1.evaluate(NoShadowingOrOverridesOnMethodsRule.java:39)
	at com.carrotsearch.randomizedtesting.rules.StatementAdapter.evaluate(StatementAdapter.java:36)
	at com.carrotsearch.randomizedtesting.rules.StatementAdapter.evaluate(StatementAdapter.java:36)
	at com.carrotsearch.randomizedtesting.rules.StatementAdapter.evaluate(StatementAdapter.java:36)
	at org.apache.lucene.util.TestRuleAssertionsRequired$1.evaluate(TestRuleAssertionsRequired.java:54)
	at org.apache.lucene.util.TestRuleMarkFailure$1.evaluate(TestRuleMarkFailure.java:48)
	at org.apache.lucene.util.TestRuleIgnoreAfterMaxFailures$1.evaluate(TestRuleIgnoreAfterMaxFailures.java:65)
	at org.apache.lucene.util.TestRuleIgnoreTestSuites$1.evaluate(TestRuleIgnoreTestSuites.java:55)
	at com.carrotsearch.randomizedtesting.rules.StatementAdapter.evaluate(StatementAdapter.java:36)
	at com.carrotsearch.randomizedtesting.ThreadLeakControl$StatementRunner.run(ThreadLeakControl.java:365)
	at java.lang.Thread.run(Thread.java:745)
Caused by: org.apache.solr.client.solrj.SolrServerException: IOException occured when talking to server at: http://127.0.0.1:63522/u/repfacttest_c8n_1x3_shard1_replica1
	at org.apache.solr.client.solrj.impl.HttpSolrClient.executeMethod(HttpSolrClient.java:573)
	at org.apache.solr.client.solrj.impl.HttpSolrClient.request(HttpSolrClient.java:214)
	at org.apache.solr.client.solrj.impl.HttpSolrClient.request(HttpSolrClient.java:210)
	at org.apache.solr.client.solrj.impl.LBHttpSolrClient.doRequest(LBHttpSolrClient.java:370)
	at org.apache.solr.client.solrj.impl.LBHttpSolrClient.request(LBHttpSolrClient.java:325)
	at org.apache.solr.client.solrj.impl.CloudSolrClient.directUpdate(CloudSolrClient.java:572)
	... 47 more
Caused by: org.apache.http.NoHttpResponseException: The target server failed to respond
	at org.apache.http.impl.conn.DefaultHttpResponseParser.parseHead(DefaultHttpResponseParser.java:143)
	at org.apache.http.impl.conn.DefaultHttpResponseParser.parseHead(DefaultHttpResponseParser.java:57)
	at org.apache.http.impl.io.AbstractMessageParser.parse(AbstractMessageParser.java:260)
	at org.apache.http.impl.AbstractHttpClientConnection.receiveResponseHeader(AbstractHttpClientConnection.java:283)
	at org.apache.http.impl.conn.DefaultClientConnection.receiveResponseHeader(DefaultClientConnection.java:251)
	at org.apache.http.impl.conn.ManagedClientConnectionImpl.receiveResponseHeader(ManagedClientConnectionImpl.java:197)
	at org.apache.http.protocol.HttpRequestExecutor.doReceiveResponse(HttpRequestExecutor.java:271)
	at org.apache.http.protocol.HttpRequestExecutor.execute(HttpRequestExecutor.java:123)
	at org.apache.http.impl.client.DefaultRequestDirector.tryExecute(DefaultRequestDirector.java:682)
	at org.apache.http.impl.client.DefaultRequestDirector.execute(DefaultRequestDirector.java:486)
	at org.apache.http.impl.client.AbstractHttpClient.doExecute(AbstractHttpClient.java:863)
	at org.apache.http.impl.client.CloseableHttpClient.execute(CloseableHttpClient.java:82)
	at org.apache.http.impl.client.CloseableHttpClient.execute(CloseableHttpClient.java:106)
	at org.apache.http.impl.client.CloseableHttpClient.execute(CloseableHttpClient.java:57)
	at org.apache.solr.client.solrj.impl.HttpSolrClient.executeMethod(HttpSolrClient.java:464)
	... 52 more




Build Log:
[...truncated 8763 lines...]
   [junit4] Suite: org.apache.solr.handler.TestReplicationHandlerBackup
   [junit4]   2> Creating dataDir: C:\Users\JenkinsSlave\workspace\Lucene-Solr-trunk-Windows\solr\build\solr-core\test\J0\temp\solr.handler.TestReplicationHandlerBackup 10B6A7243CBE525A-001\init-core-data-001
   [junit4]   2> 32608 T58 oas.SolrTestCaseJ4.setUp ###Starting testBackupOnCommit
   [junit4]   2> 32611 T58 oas.SolrTestCaseJ4.writeCoreProperties Writing core.properties file to C:\Users\JenkinsSlave\workspace\Lucene-Solr-trunk-Windows\solr\build\solr-core\test\J0\temp\solr.handler.TestReplicationHandlerBackup 10B6A7243CBE525A-001\solr-instance-001\collection1
   [junit4]   2> 33449 T58 oejs.Server.doStart jetty-9.2.6.v20141205
   [junit4]   2> 33703 T58 oejsh.ContextHandler.doStart Started o.e.j.s.ServletContextHandler@75be61d7{/solr,null,AVAILABLE}
   [junit4]   2> 33737 T58 oejs.AbstractConnector.doStart Started ServerConnector@7ae10e91{HTTP/1.1}{127.0.0.1:53154}
   [junit4]   2> 33739 T58 oejs.Server.doStart Started @28834ms
   [junit4]   2> 33834 T58 oass.SolrDispatchFilter.init SolrDispatchFilter.init()sun.misc.Launcher$AppClassLoader@c387f44
   [junit4]   2> 33835 T58 oasc.SolrResourceLoader.locateSolrHome JNDI not configured for solr (NoInitialContextEx)
   [junit4]   2> 33835 T58 oasc.SolrResourceLoader.locateSolrHome using system property solr.solr.home: C:\Users\JenkinsSlave\workspace\Lucene-Solr-trunk-Windows\solr\build\solr-core\test\J0\temp\solr.handler.TestReplicationHandlerBackup 10B6A7243CBE525A-001\solr-instance-001
   [junit4]   2> 33835 T58 oasc.SolrResourceLoader.<init> new SolrResourceLoader for directory: 'C:\Users\JenkinsSlave\workspace\Lucene-Solr-trunk-Windows\solr\build\solr-core\test\J0\temp\solr.handler.TestReplicationHandlerBackup 10B6A7243CBE525A-001\solr-instance-001\'
   [junit4]   2> 33902 T58 oasc.ConfigSolr.fromFile Loading container configuration from C:\Users\JenkinsSlave\workspace\Lucene-Solr-trunk-Windows\solr\build\solr-core\test\J0\temp\solr.handler.TestReplicationHandlerBackup 10B6A7243CBE525A-001\solr-instance-001\solr.xml
   [junit4]   2> 33953 T58 oasc.CorePropertiesLocator.<init> Config-defined core root directory: C:\Users\JenkinsSlave\workspace\Lucene-Solr-trunk-Windows\solr\build\solr-core\test\J0\temp\solr.handler.TestReplicationHandlerBackup 10B6A7243CBE525A-001\solr-instance-001\.
   [junit4]   2> 33955 T58 oasc.CoreContainer.<init> New CoreContainer 699234877
   [junit4]   2> 33955 T58 oasc.CoreContainer.load Loading cores into CoreContainer [instanceDir=C:\Users\JenkinsSlave\workspace\Lucene-Solr-trunk-Windows\solr\build\solr-core\test\J0\temp\solr.handler.TestReplicationHandlerBackup 10B6A7243CBE525A-001\solr-instance-001\]
   [junit4]   2> 34029 T58 oashc.HttpShardHandlerFactory.getParameter Setting socketTimeout to: 90000
   [junit4]   2> 34029 T58 oashc.HttpShardHandlerFactory.getParameter Setting urlScheme to: 
   [junit4]   2> 34030 T58 oashc.HttpShardHandlerFactory.getParameter Setting connTimeout to: 15000
   [junit4]   2> 34030 T58 oashc.HttpShardHandlerFactory.getParameter Setting maxConnectionsPerHost to: 20
   [junit4]   2> 34030 T58 oashc.HttpShardHandlerFactory.getParameter Setting maxConnections to: 10000
   [junit4]   2> 34032 T58 oashc.HttpShardHandlerFactory.getParameter Setting corePoolSize to: 0
   [junit4]   2> 34032 T58 oashc.HttpShardHandlerFactory.getParameter Setting maximumPoolSize to: 2147483647
   [junit4]   2> 34032 T58 oashc.HttpShardHandlerFactory.getParameter Setting maxThreadIdleTime to: 5
   [junit4]   2> 34032 T58 oashc.HttpShardHandlerFactory.getParameter Setting sizeOfQueue to: -1
   [junit4]   2> 34033 T58 oashc.HttpShardHandlerFactory.getParameter Setting fairnessPolicy to: false
   [junit4]   2> 34035 T58 oashc.HttpShardHandlerFactory.getParameter Setting useRetries to: false
   [junit4]   2> 34035 T58 oasu.UpdateShardHandler.<init> Creating UpdateShardHandler HTTP client with params: socketTimeout=340000&connTimeout=45000&retry=true
   [junit4]   2> 34035 T58 oasl.LogWatcher.createWatcher SLF4J impl is org.slf4j.impl.Log4jLoggerFactory
   [junit4]   2> 34035 T58 oasl.LogWatcher.newRegisteredLogWatcher Registering Log Listener [Log4j (org.slf4j.impl.Log4jLoggerFactory)]
   [junit4]   2> 34035 T58 oasc.CoreContainer.load Host Name: 127.0.0.1
   [junit4]   2> 34037 T58 oasc.CorePropertiesLocator.discover Looking for core definitions underneath C:\Users\JenkinsSlave\workspace\Lucene-Solr-trunk-Windows\solr\build\solr-core\test\J0\temp\solr.handler.TestReplicationHandlerBackup 10B6A7243CBE525A-001\solr-instance-001\.
   [junit4]   2> 34044 T58 oasc.CorePropertiesLocator.discoverUnder Found core collection1 in C:\Users\JenkinsSlave\workspace\Lucene-Solr-trunk-Windows\solr\build\solr-core\test\J0\temp\solr.handler.TestReplicationHandlerBackup 10B6A7243CBE525A-001\solr-instance-001\.\collection1\
   [junit4]   2> 34046 T58 oasc.CorePropertiesLocator.discover Found 1 core definitions
   [junit4]   2> 34054 T71 oasc.SolrResourceLoader.<init> new SolrResourceLoader for directory: 'C:\Users\JenkinsSlave\workspace\Lucene-Solr-trunk-Windows\solr\build\solr-core\test\J0\temp\solr.handler.TestReplicationHandlerBackup 10B6A7243CBE525A-001\solr-instance-001\.\collection1\'
   [junit4]   2> 34133 T71 oasc.SolrConfig.refreshRequestParams current version of requestparams : -1
   [junit4]   2> 34140 T71 oasc.SolrConfig.<init> Using Lucene MatchVersion: 6.0.0
   [junit4]   2> 34153 T71 oasc.SolrConfig.<init> Loaded SolrConfig: solrconfig.xml
   [junit4]   2> 34153 T71 oass.IndexSchema.readSchema Reading Solr Schema from C:\Users\JenkinsSlave\workspace\Lucene-Solr-trunk-Windows\solr\build\solr-core\test\J0\temp\solr.handler.TestReplicationHandlerBackup 10B6A7243CBE525A-001\solr-instance-001\.\collection1\conf\schema.xml
   [junit4]   2> 34160 T71 oass.IndexSchema.readSchema [collection1] Schema name=test
   [junit4]   2> 34168 T71 oass.IndexSchema.readSchema unique key field: id
   [junit4]   2> 34168 T71 oasc.CoreContainer.create Creating SolrCore 'collection1' using configuration from instancedir C:\Users\JenkinsSlave\workspace\Lucene-Solr-trunk-Windows\solr\build\solr-core\test\J0\temp\solr.handler.TestReplicationHandlerBackup 10B6A7243CBE525A-001\solr-instance-001\.\collection1\
   [junit4]   2> 34168 T71 oasc.SolrCore.initDirectoryFactory org.apache.solr.core.MockDirectoryFactory
   [junit4]   2> 34171 T71 oasc.SolrCore.<init> [collection1] Opening new SolrCore at C:\Users\JenkinsSlave\workspace\Lucene-Solr-trunk-Windows\solr\build\solr-core\test\J0\temp\solr.handler.TestReplicationHandlerBackup 10B6A7243CBE525A-001\solr-instance-001\.\collection1\, dataDir=C:\Users\JenkinsSlave\workspace\Lucene-Solr-trunk-Windows\solr\build\solr-core\test\J0\temp\solr.handler.TestReplicationHandlerBackup 10B6A7243CBE525A-001\solr-instance-001\collection1\data\
   [junit4]   2> 34172 T71 oasc.SolrCore.<init> JMX monitoring not detected for core: collection1
   [junit4]   2> 34202 T71 oasc.CachingDirectoryFactory.get return new directory for C:\Users\JenkinsSlave\workspace\Lucene-Solr-trunk-Windows\solr\build\solr-core\test\J0\temp\solr.handler.TestReplicationHandlerBackup 10B6A7243CBE525A-001\solr-instance-001\collection1\data\
   [junit4]   2> 34303 T71 oasc.SolrCore.getNewIndexDir New index directory detected: old=null new=C:\Users\JenkinsSlave\workspace\Lucene-Solr-trunk-Windows\solr\build\solr-core\test\J0\temp\solr.handler.TestReplicationHandlerBackup 10B6A7243CBE525A-001\solr-instance-001\collection1\data\index/
   [junit4]   2> 34303 T71 oasc.SolrCore.initIndex WARN [collection1] Solr index directory 'C:\Users\JenkinsSlave\workspace\Lucene-Solr-trunk-Windows\solr\build\solr-core\test\J0\temp\solr.handler.TestReplicationHandlerBackup 10B6A7243CBE525A-001\solr-instance-001\collection1\data\index' doesn't exist. Creating new index...
   [junit4]   2> 34305 T71 oasc.CachingDirectoryFactory.get return new directory for C:\Users\JenkinsSlave\workspace\Lucene-Solr-trunk-Windows\solr\build\solr-core\test\J0\temp\solr.handler.TestReplicationHandlerBackup 10B6A7243CBE525A-001\solr-instance-001\collection1\data\index
   [junit4]   2> 34306 T71 oasu.RandomMergePolicy.<init> RandomMergePolicy wrapping class org.apache.lucene.index.LogByteSizeMergePolicy: [LogByteSizeMergePolicy: minMergeSize=1677721, mergeFactor=43, maxMergeSize=2147483648, maxMergeSizeForForcedMerge=9223372036854775807, calibrateSizeByDeletes=true, maxMergeDocs=2147483647, maxCFSSegmentSizeMB=8.796093022207999E12, noCFSRatio=0.0]
   [junit4]   2> 34308 T71 oasc.SolrDeletionPolicy.onCommit SolrDeletionPolicy.onCommit: commits: num=1
   [junit4]   2> 		commit{dir=MockDirectoryWrapper(RAMDirectory@3730d6ca lockFactory=org.apache.lucene.store.SingleInstanceLockFactory@30101c),segFN=segments_1,generation=1}
   [junit4]   2> 34308 T71 oasc.SolrDeletionPolicy.updateCommits newest commit generation = 1
   [junit4]   2> 34309 T71 oasc.SolrCore.loadUpdateProcessorChains no updateRequestProcessorChain defined as default, creating implicit default
   [junit4]   2> 34310 T71 oasc.RequestHandlers.initHandlersFromConfig created /update: solr.UpdateRequestHandler
   [junit4]   2> 34310 T71 oasc.RequestHandlers.initHandlersFromConfig created /update/json: org.apache.solr.handler.UpdateRequestHandler
   [junit4]   2> 34310 T71 oasc.RequestHandlers.initHandlersFromConfig created /update/csv: org.apache.solr.handler.UpdateRequestHandler
   [junit4]   2> 34312 T71 oasc.RequestHandlers.initHandlersFromConfig created /update/json/docs: org.apache.solr.handler.UpdateRequestHandler
   [junit4]   2> 34312 T71 oasc.RequestHandlers.initHandlersFromConfig created /config: org.apache.solr.handler.SolrConfigHandler
   [junit4]   2> 34313 T71 oasc.RequestHandlers.initHandlersFromConfig created /schema: org.apache.solr.handler.SchemaHandler
   [junit4]   2> 34332 T71 oasc.RequestHandlers.initHandlersFromConfig created /replication: solr.ReplicationHandler
   [junit4]   2> 34332 T71 oasc.RequestHandlers.initHandlersFromConfig created /get: org.apache.solr.handler.RealTimeGetHandler
   [junit4]   2> 34333 T71 oasc.RequestHandlers.initHandlersFromConfig created /admin/luke: org.apache.solr.handler.admin.LukeRequestHandler
   [junit4]   2> 34350 T71 oasc.RequestHandlers.initHandlersFromConfig created /admin/system: org.apache.solr.handler.admin.SystemInfoHandler
   [junit4]   2> 34352 T71 oasc.RequestHandlers.initHandlersFromConfig created /admin/mbeans: org.apache.solr.handler.admin.SolrInfoMBeanHandler
   [junit4]   2> 34352 T71 oasc.RequestHandlers.initHandlersFromConfig created /admin/plugins: org.apache.solr.handler.admin.PluginInfoHandler
   [junit4]   2> 34352 T71 oasc.RequestHandlers.initHandlersFromConfig created /admin/threads: org.apache.solr.handler.admin.ThreadDumpHandler
   [junit4]   2> 34353 T71 oasc.RequestHandlers.initHandlersFromConfig created /admin/properties: org.apache.solr.handler.admin.PropertiesRequestHandler
   [junit4]   2> 34353 T71 oasc.RequestHandlers.initHandlersFromConfig created /admin/logging: org.apache.solr.handler.admin.LoggingHandler
   [junit4]   2> 34353 T71 oasc.RequestHandlers.initHandlersFromConfig created /admin/file: org.apache.solr.handler.admin.ShowFileRequestHandler
   [junit4]   2> 34354 T71 oasc.RequestHandlers.initHandlersFromConfig created /admin/ping: org.apache.solr.handler.PingRequestHandler
   [junit4]   2> 34354 T71 oasc.RequestHandlers.initHandlersFromConfig created standard: solr.StandardRequestHandler
   [junit4]   2> 34354 T71 oasc.RequestHandlers.initHandlersFromConfig created defaults: solr.StandardRequestHandler
   [junit4]   2> 34354 T71 oasc.RequestHandlers.initHandlersFromConfig adding lazy requestHandler: solr.StandardRequestHandler
   [junit4]   2> 34354 T71 oasc.RequestHandlers.initHandlersFromConfig created lazy: solr.StandardRequestHandler
   [junit4]   2> 34372 T71 oashl.XMLLoader.init xsltCacheLifetimeSeconds=60
   [junit4]   2> 34373 T71 oashl.XMLLoader.init xsltCacheLifetimeSeconds=60
   [junit4]   2> 34376 T71 oashl.XMLLoader.init xsltCacheLifetimeSeconds=60
   [junit4]   2> 34381 T71 oashl.XMLLoader.init xsltCacheLifetimeSeconds=60
   [junit4]   2> 34383 T71 oasc.SolrCore.initStatsCache Using default statsCache cache: org.apache.solr.search.stats.LocalStatsCache
   [junit4]   2> 34383 T71 oasu.CommitTracker.<init> Hard AutoCommit: disabled
   [junit4]   2> 34383 T71 oasu.CommitTracker.<init> Soft AutoCommit: disabled
   [junit4]   2> 34384 T71 oasu.RandomMergePolicy.<init> RandomMergePolicy wrapping class org.apache.lucene.index.LogByteSizeMergePolicy: [LogByteSizeMergePolicy: minMergeSize=1677721, mergeFactor=22, maxMergeSize=2147483648, maxMergeSizeForForcedMerge=9223372036854775807, calibrateSizeByDeletes=true, maxMergeDocs=2147483647, maxCFSSegmentSizeMB=8.796093022207999E12, noCFSRatio=0.0]
   [junit4]   2> 34387 T71 oasc.SolrDeletionPolicy.onInit SolrDeletionPolicy.onInit: commits: num=1
   [junit4]   2> 		commit{dir=MockDirectoryWrapper(RAMDirectory@3730d6ca lockFactory=org.apache.lucene.store.SingleInstanceLockFactory@30101c),segFN=segments_1,generation=1}
   [junit4]   2> 34387 T71 oasc.SolrDeletionPolicy.updateCommits newest commit generation = 1
   [junit4]   2> 34389 T71 oass.SolrIndexSearcher.<init> Opening Searcher@3666649e[collection1] main
   [junit4]   2> 34390 T71 oasr.ManagedResourceStorage$FileStorageIO.configure File-based storage initialized to use dir: C:\Users\JenkinsSlave\workspace\Lucene-Solr-trunk-Windows\solr\build\solr-core\test\J0\temp\solr.handler.TestReplicationHandlerBackup 10B6A7243CBE525A-001\solr-instance-001\.\collection1\conf
   [junit4]   2> 34390 T71 oasr.RestManager.init Initializing RestManager with initArgs: {storageDir=C:\Users\JenkinsSlave\workspace\Lucene-Solr-trunk-Windows\solr\build\solr-core\test\J0\temp\solr.handler.TestReplicationHandlerBackup 10B6A7243CBE525A-001\solr-instance-001\.\collection1\conf}
   [junit4]   2> 34390 T71 oasr.ManagedResourceStorage.load Reading _rest_managed.json using file:dir=C:\Users\JenkinsSlave\workspace\Lucene-Solr-trunk-Windows\solr\build\solr-core\test\J0\temp\solr.handler.TestReplicationHandlerBackup 10B6A7243CBE525A-001\solr-instance-001\.\collection1\conf
   [junit4]   2> 34391 T71 oasr.RestManager.init Initializing 0 registered ManagedResources
   [junit4]   2> 34391 T71 oash.ReplicationHandler.inform Replication enabled for following config files: schema-replication2.xml:schema.xml
   [junit4]   2> 34391 T71 oash.ReplicationHandler.inform Commits will be reserved for  10000
   [junit4]   2> 34393 T72 oasc.SolrCore.registerSearcher [collection1] Registered new searcher Searcher@3666649e[collection1] main{ExitableDirectoryReader(UninvertingDirectoryReader())}
   [junit4]   2> 34394 T71 oasc.CoreContainer.registerCore registering core: collection1
   [junit4]   2> 34396 T58 oass.SolrDispatchFilter.init user.dir=C:\Users\JenkinsSlave\workspace\Lucene-Solr-trunk-Windows\solr\build\solr-core\test\J0
   [junit4]   2> 34396 T58 oass.SolrDispatchFilter.init SolrDispatchFilter.init() done
   [junit4]   2> ASYNC  NEW_CORE C2 name=collection1 org.apache.solr.core.SolrCore@6b8a2b68
   [junit4]   2> 35947 T66 C2 oasu.DirectUpdateHandler2.deleteAll [collection1] REMOVING ALL DOCUMENTS FROM INDEX
   [junit4]   2> 35958 T66 C2 oasup.LogUpdateProcessor.finish [collection1] webapp=/solr path=/update params={wt=javabin&version=2} {deleteByQuery=*:*} 0 61
   [junit4]   2> 36159 T68 C2 oasup.LogUpdateProcessor.finish [collection1] webapp=/solr path=/update params={wt=javabin&version=2} {add=[0]} 0 3
   [junit4]   2> 36167 T67 C2 oasup.LogUpdateProcessor.finish [collection1] webapp=/solr path=/update params={wt=javabin&version=2} {add=[1]} 0 0
   [junit4]   2> 36176 T65 C2 oasup.LogUpdateProcessor.finish [collection1] webapp=/solr path=/update params={wt=javabin&version=2} {add=[2]} 0 0
   [junit4]   2> 36183 T63 C2 oasup.LogUpdateProcessor.finish [collection1] webapp=/solr path=/update params={wt=javabin&version=2} {add=[3]} 0 0
   [junit4]   2> 36190 T61 C2 oasup.LogUpdateProcessor.finish [collection1] webapp=/solr path=/update params={wt=javabin&version=2} {add=[4]} 0 0
   [junit4]   2> 36200 T66 C2 oasup.LogUpdateProcessor.finish [collection1] webapp=/solr path=/update params={wt=javabin&version=2} {add=[5]} 0 1
   [junit4]   2> 36211 T68 C2 oasup.LogUpdateProcessor.finish [collection1] webapp=/solr path=/update params={wt=javabin&version=2} {add=[6]} 0 0
   [junit4]   2> 36220 T67 C2 oasup.LogUpdateProcessor.finish [collection1] webapp=/solr path=/update params={wt=javabin&version=2} {add=[7]} 0 1
   [junit4]   2> 36227 T65 C2 oasup.LogUpdateProcessor.finish [collection1] webapp=/solr path=/update params={wt=javabin&version=2} {add=[8]} 0 1
   [junit4]   2> 36233 T63 C2 oasup.LogUpdateProcessor.finish [collection1] webapp=/solr path=/update params={wt=javabin&version=2} {add=[9]} 0 0
   [junit4]   2> 36238 T61 C2 oasup.LogUpdateProcessor.finish [collection1] webapp=/solr path=/update params={wt=javabin&version=2} {add=[10]} 0 0
   [junit4]   2> 36260 T66 C2 oasup.LogUpdateProcessor.finish [collection1] webapp=/solr path=/update params={wt=javabin&version=2} {add=[11]} 0 2
   [junit4]   2> 36267 T68 C2 oasup.LogUpdateProcessor.finish [collection1] webapp=/solr path=/update params={wt=javabin&version=2} {add=[12]} 0 2
   [junit4]   2> 36274 T67 C2 oasup.LogUpdateProcessor.finish [collection1] webapp=/solr path=/update params={wt=javabin&version=2} {add=[13]} 0 1
   [junit4]   2> 36283 T65 C2 oasup.LogUpdateProcessor.finish [collection1] webapp=/solr path=/update params={wt=javabin&version=2} {add=[14]} 0 3
   [junit4]   2> 36291 T63 C2 oasup.LogUpdateProcessor.finish [collection1] webapp=/solr path=/update params={wt=javabin&version=2} {add=[15]} 0 1
   [junit4]   2> 36307 T61 C2 oasup.LogUpdateProcessor.finish [collection1] webapp=/solr path=/update params={wt=javabin&version=2} {add=[16]} 0 5
   [junit4]   2> 36312 T66 C2 oasup.LogUpdateProcessor.finish [collection1] webapp=/solr path=/update params={wt=javabin&version=2} {add=[17]} 0 0
   [junit4]   2> 36320 T68 C2 oasup.LogUpdateProcessor.finish [collection1] webapp=/solr path=/update params={wt=javabin&version=2} {add=[18]} 0 2
   [junit4]   2> 36334 T67 C2 oasup.LogUpdateProcessor.finish [collection1] webapp=/solr path=/update params={wt=javabin&version=2} {add=[19]} 0 0
   [junit4]   2> 36339 T65 C2 oasup.LogUpdateProcessor.finish [collection1] webapp=/solr path=/update params={wt=javabin&version=2} {add=[20]} 0 0
   [junit4]   2> 36347 T63 C2 oasup.LogUpdateProcessor.finish [collection1] webapp=/solr path=/update params={wt=javabin&version=2} {add=[21]} 0 0
   [junit4]   2> 36352 T61 C2 oasup.LogUpdateProcessor.finish [collection1] webapp=/solr path=/update params={wt=javabin&version=2} {add=[22]} 0 0
   [junit4]   2> 36359 T66 C2 oasup.LogUpdateProcessor.finish [collection1] webapp=/solr path=/update params={wt=javabin&version=2} {add=[23]} 0 0
   [junit4]   2> 36365 T68 C2 oasup.LogUpdateProcessor.finish [collection1] webapp=/solr path=/update params={wt=javabin&version=2} {add=[24]} 0 0
   [junit4]   2> 36372 T67 C2 oasup.LogUpdateProcessor.finish [collection1] webapp=/solr path=/update params={wt=javabin&version=2} {add=[25]} 0 1
   [junit4]   2> 36382 T65 C2 oasup.LogUpdateProcessor.finish [collection1] webapp=/solr path=/update params={wt=javabin&version=2} {add=[26]} 0 0
   [junit4]   2> 36389 T63 C2 oasup.LogUpdateProcessor.finish [collection1] webapp=/solr path=/update params={wt=javabin&version=2} {add=[27]} 0 0
   [junit4]   2> 36396 T61 C2 oasup.LogUpdateProcessor.finish [collection1] webapp=/solr path=/update params={wt=javabin&version=2} {add=[28]} 0 0
   [junit4]   2> 36403 T66 C2 oasup.LogUpdateProcessor.finish [collection1] webapp=/solr path=/update params={wt=javabin&version=2} {add=[29]} 0 1
   [junit4]   2> 36409 T68 C2 oasup.LogUpdateProcessor.finish [collection1] webapp=/solr path=/update params={wt=javabin&version=2} {add=[30]} 0 1
   [junit4]   2> 36416 T67 C2 oasup.LogUpdateProcessor.finish [collection1] webapp=/solr path=/update params={wt=javabin&version=2} {add=[31]} 0 0
   [junit4]   2> 36422 T65 C2 oasup.LogUpdateProcessor.finish [collection1] webapp=/solr path=/update params={wt=javabin&version=2} {add=[32]} 0 2
   [junit4]   2> 36426 T63 C2 oasup.LogUpdateProcessor.finish [collection1] webapp=/solr path=/update params={wt=javabin&version=2} {add=[33]} 0 0
   [junit4]   2> 36433 T61 C2 oasup.LogUpdateProcessor.finish [collection1] webapp=/solr path=/update params={wt=javabin&version=2} {add=[34]} 0 1
   [junit4]   2> 36440 T66 C2 oasup.LogUpdateProcessor.finish [collection1] webapp=/solr path=/update params={wt=javabin&version=2} {add=[35]} 0 1
   [junit4]   2> 36447 T68 C2 oasup.LogUpdateProcessor.finish [collection1] webapp=/solr path=/update params={wt=javabin&version=2} {add=[36]} 0 0
   [junit4]   2> 36453 T67 C2 oasup.LogUpdateProcessor.finish [collection1] webapp=/solr path=/update params={wt=javabin&version=2} {add=[37]} 0 1
   [junit4]   2> 36462 T65 C2 oasup.LogUpdateProcessor.finish [collection1] webapp=/solr path=/update params={wt=javabin&version=2} {add=[38]} 0 2
   [junit4]   2> 36469 T63 C2 oasup.LogUpdateProcessor.finish [collection1] webapp=/solr path=/update params={wt=javabin&version=2} {add=[39]} 0 3
   [junit4]   2> 36476 T61 C2 oasup.LogUpdateProcessor.finish [collection1] webapp=/solr path=/update params={wt=javabin&version=2} {add=[40]} 0 0
   [junit4]   2> 36482 T66 C2 oasup.LogUpdateProcessor.finish [collection1] webapp=/solr path=/update params={wt=javabin&version=2} {add=[41]} 0 0
   [junit4]   2> 36487 T68 C2 oasup.LogUpdateProcessor.finish [collection1] webapp=/solr path=/update params={wt=javabin&version=2} {add=[42]} 0 1
   [junit4]   2> 36494 T67 C2 oasup.LogUpdateProcessor.finish [collection1] webapp=/solr path=/update params={wt=javabin&version=2} {add=[43]} 0 1
   [junit4]   2> 36499 T65 C2 oasup.LogUpdateProcessor.finish [collection1] webapp=/solr path=/update params={wt=javabin&version=2} {add=[44]} 0 0
   [junit4]   2> 36504 T63 C2 oasup.LogUpdateProcessor.finish [collection1] webapp=/solr path=/update params={wt=javabin&version=2} {add=[45]} 0 1
   [junit4]   2> 36510 T61 C2 oasup.LogUpdateProcessor.finish [collection1] webapp=/solr path=/update params={wt=javabin&version=2} {add=[46]} 0 1
   [junit4]   2> 36514 T66 C2 oasup.LogUpdateProcessor.finish [collection1] webapp=/solr path=/update params={wt=javabin&version=2} {add=[47]} 0 1
   [junit4]   2> 36520 T68 C2 oasup.LogUpdateProcessor.finish [collection1] webapp=/solr path=/update params={wt=javabin&version=2} {add=[48]} 0 1
   [junit4]   2> 36526 T67 C2 oasup.LogUpdateProcessor.finish [collection1] webapp=/solr path=/update params={wt=javabin&version=2} {add=[49]} 0 2
   [junit4]   2> 36531 T65 C2 oasup.LogUpdateProcessor.finish [collection1] webapp=/solr path=/update params={wt=javabin&version=2} {add=[50]} 0 1
   [junit4]   2> 36539 T63 C2 oasup.LogUpdateProcessor.finish [collection1] webapp=/solr path=/update params={wt=javabin&version=2} {add=[51]} 0 2
   [junit4]   2> 36546 T61 C2 oasup.LogUpdateProcessor.finish [collection1] webapp=/solr path=/update params={wt=javabin&version=2} {add=[52]} 0 2
   [junit4]   2> 36554 T66 C2 oasup.LogUpdateProcessor.finish [collection1] webapp=/solr path=/update params={wt=javabin&version=2} {add=[53]} 0 0
   [junit4]   2> 36566 T68 C2 oasup.LogUpdateProcessor.finish [collection1] webapp=/solr path=/update params={wt=javabin&version=2} {add=[54]} 0 2
   [junit4]   2> 36573 T67 C2 oasup.LogUpdateProcessor.finish [collection1] webapp=/solr path=/update params={wt=javabin&version=2} {add=[55]} 0 3
   [junit4]   2> 36605 T65 C2 oasu.DirectUpdateHandler2.commit start commit{,optimize=false,openSearcher=true,waitSearcher=true,expungeDeletes=false,softCommit=false,prepareCommit=false}
   [junit4]   2> 36617 T65 C2 oasc.SolrDeletionPolicy.onCommit SolrDeletionPolicy.onCommit: commits: num=2
   [junit4]   2> 		commit{dir=MockDirectoryWrapper(RAMDirectory@3730d6ca lockFactory=org.apache.lucene.store.SingleInstanceLockFactory@30101c),segFN=segments_1,generation=1}
   [junit4]   2> 		commit{dir=MockDirectoryWrapper(RAMDirectory@3730d6ca lockFactory=org.apache.lucene.store.SingleInstanceLockFactory@30101c),segFN=segments_2,generation=2}
   [junit4]   2> 36618 T65 C2 oasc.SolrDeletionPolicy.updateCommits newest commit generation = 2
   [junit4]   2> 36635 T65 C2 oass.SolrIndexSearcher.<init> Opening Searcher@52b90262[collection1] main
   [junit4]   2> 36638 T65 C2 oasu.DirectUpdateHandler2.commit end_commit_flush
   [junit4]   2> 36639 T72 oasc.SolrCore.registerSearcher [collection1] Registered new searcher Searcher@52b90262[collection1] main{ExitableDirectoryReader(UninvertingDirectoryReader(Uninverting(_0(6.0.0):c56)))}
   [junit4]   2> 36641 T65 C2 oasup.LogUpdateProcessor.finish [collection1] webapp=/solr path=/update params={waitSearcher=true&commit=true&softCommit=false&wt=javabin&version=2} {commit=} 0 36
   [junit4]   2> 36641 T75 oash.SnapShooter.createSnapshot Creating backup snapshot...
   [junit4]   2> 36658 T75 oash.SnapShooter.createSnapshot Done creating backup snapshot: <not named>
   [junit4]   2> 36755 T63 C2 oasc.SolrCore.execute [collection1] webapp=/solr path=/replication params={command=details} status=0 QTime=77 
   [junit4]   2> 38260 T58 oas.SolrTestCaseJ4.tearDown ###Ending testBackupOnCommit
   [junit4]   2> 38282 T58 oejs.AbstractConnector.doStop Stopped ServerConnector@7ae10e91{HTTP/1.1}{127.0.0.1:0}
   [junit4]   2> 38283 T58 oasc.CoreContainer.shutdown Shutting down CoreContainer instance=699234877
   [junit4]   2> 38286 T58 oasc.SolrCore.close [collection1]  CLOSING SolrCore org.apache.solr.core.SolrCore@6b8a2b68
   [junit4]   2> 38286 T58 oasu.DirectUpdateHandler2.close closing DirectUpdateHandler2{commits=1,autocommits=0,soft autocommits=0,optimizes=0,rollbacks=0,expungeDeletes=0,docsPending=0,adds=0,deletesById=0,deletesByQuery=0,errors=0,cumulative_adds=56,cumulative_deletesById=0,cumulative_deletesByQuery=1,cumulative_errors=0}
   [junit4]   2> 38287 T58 oasu.SolrCoreState.decrefSolrCoreState Closing SolrCoreState
   [junit4]   2> 38287 T58 oasu.DefaultSolrCoreState.closeIndexWriter SolrCoreState ref count has reached 0 - closing IndexWriter
   [junit4]   2> 38287 T58 oasu.DefaultSolrCoreState.closeIndexWriter closing IndexWriter with IndexWriterCloser
   [junit4]   2> 38292 T58 oasc.SolrCore.closeSearcher [collection1] Closing main searcher on request.
   [junit4]   2> 38295 T58 oasc.CachingDirectoryFactory.close Closing MockDirectoryFactory - 2 directories currently being tracked
   [junit4]   2> 38295 T58 oasc.CachingDirectoryFactory.closeCacheValue looking to close C:\Users\JenkinsSlave\workspace\Lucene-Solr-trunk-Windows\solr\build\solr-core\test\J0\temp\solr.handler.TestReplicationHandlerBackup 10B6A7243CBE525A-001\solr-instance-001\collection1\data\ [CachedDir<<refCount=0;path=C:\Users\JenkinsSlave\workspace\Lucene-Solr-trunk-Windows\solr\build\solr-core\test\J0\temp\solr.handler.TestReplicationHandlerBackup 10B6A7243CBE525A-001\solr-instance-001\collection1\data\;done=false>>]
   [junit4]   2> 38295 T58 oasc.CachingDirectoryFactory.close Closing directory: C:\Users\JenkinsSlave\workspace\Lucene-Solr-trunk-Windows\solr\build\solr-core\test\J0\temp\solr.handler.TestReplicationHandlerBackup 10B6A7243CBE525A-001\solr-instance-001\collection1\data\
   [junit4]   2> 38295 T58 oasc.CachingDirectoryFactory.closeCacheValue looking to close C:\Users\JenkinsSlave\workspace\Lucene-Solr-trunk-Windows\solr\build\solr-core\test\J0\temp\solr.handler.TestReplicationHandlerBackup 10B6A7243CBE525A-001\solr-instance-001\collection1\data\index [CachedDir<<refCount=0;path=C:\Users\JenkinsSlave\workspace\Lucene-Solr-trunk-Windows\solr\build\solr-core\test\J0\temp\solr.handler.TestReplicationHandlerBackup 10B6A7243CBE525A-001\solr-instance-001\collection1\data\index;done=false>>]
   [junit4]   2> 38295 T58 oasc.CachingDirectoryFactory.close Closing directory: C:\Users\JenkinsSlave\workspace\Lucene-Solr-trunk-Windows\solr\build\solr-core\test\J0\temp\solr.handler.TestReplicationHandlerBackup 10B6A7243CBE525A-001\solr-instance-001\collection1\data\index
   [junit4]   2> 38306 T58 oejsh.ContextHandler.doStop Stopped o.e.j.s.ServletContextHandler@75be61d7{/solr,null,UNAVAILABLE}
   [junit4]   2> NOTE: reproduce with: ant test  -Dtestcase=TestReplicationHandlerBackup -Dtests.method=testBackupOnCommit -Dtests.seed=10B6A7243CBE525A -Dtests.slow=true -Dtests.locale= -Dtests.timezone=America/Mendoza -Dtests.asserts=true -Dtests.file.encoding=ISO-8859-1
   [junit4] ERROR   5.75s | TestReplicationHandlerBackup.testBackupOnCommit <<<
   [junit4]    > Throwable #1: java.io.IOException: Could not remove the following files (in the order of attempts):
   [junit4]    >    C:\Users\JenkinsSlave\workspace\Lucene-Solr-trunk-Windows\solr\build\solr-core\test\J0\temp\solr.handler.TestReplicationHandlerBackup 10B6A7243CBE525A-001\solr-instance-001\collection1: java.nio.file.DirectoryNotEmptyException: C:\Users\JenkinsSlave\workspace\Lucene-Solr-trunk-Windows\solr\build\solr-core\test\J0\temp\solr.handler.TestReplicationHandlerBackup 10B6A7243CBE525A-001\solr-instance-001\collection1
   [junit4]    >    C:\Users\JenkinsSlave\workspace\Lucene-Solr-trunk-Windows\solr\build\solr-core\test\J0\temp\solr.handler.TestReplicationHandlerBackup 10B6A7243CBE525A-001\solr-instance-001: java.nio.file.DirectoryNotEmptyException: C:\Users\JenkinsSlave\workspace\Lucene-Solr-trunk-Windows\solr\build\solr-core\test\J0\temp\solr.handler.TestReplicationHandlerBackup 10B6A7243CBE525A-001\solr-instance-001
   [junit4]    > 	at __randomizedtesting.SeedInfo.seed([10B6A7243CBE525A:395E49CF4346EE43]:0)
   [junit4]    > 	at org.apache.lucene.util.IOUtils.rm(IOUtils.java:286)
   [junit4]    > 	at org.apache.solr.handler.TestReplicationHandler$SolrInstance.tearDown(TestReplicationHandler.java:1509)
   [junit4]    > 	at org.apache.solr.handler.TestReplicationHandlerBackup.tearDown(TestReplicationHandlerBackup.java:115)
   [junit4]    > 	at java.lang.Thread.run(Thread.java:745)
   [junit4]   2> 38371 T58 oas.SolrTestCaseJ4.setUp ###Starting doTestBackup
   [junit4]   2> 38374 T58 oas.SolrTestCaseJ4.writeCoreProperties Writing core.properties file to C:\Users\JenkinsSlave\workspace\Lucene-Solr-trunk-Windows\solr\build\solr-core\test\J0\temp\solr.handler.TestReplicationHandlerBackup 10B6A7243CBE525A-001\solr-instance-002\collection1
   [junit4]   2> 38396 T58 oejs.Server.doStart jetty-9.2.6.v20141205
   [junit4]   2> 38407 T58 oejsh.ContextHandler.doStart Started o.e.j.s.ServletContextHandler@cde86c4{/solr,null,AVAILABLE}
   [junit4]   2> 38408 T58 oejs.AbstractConnector.doStart Started ServerConnector@4096772c{HTTP/1.1}{127.0.0.1:53158}
   [junit4]   2> 38408 T58 oejs.Server.doStart Started @32087ms
   [junit4]   2> 38408 T58 oass.SolrDispatchFilter.init SolrDispatchFilter.init()sun.misc.Launcher$AppClassLoader@c387f44
   [junit4]   2> 38411 T58 oasc.SolrResourceLoader.locateSolrHome JNDI not configured for solr (NoInitialContextEx)
   [junit4]   2> 38411 T58 oasc.SolrResourceLoader.locateSolrHome using system property solr.solr.home: C:\Users\JenkinsSlave\workspace\Lucene-Solr-trunk-Windows\solr\build\solr-core\test\J0\temp\solr.handler.TestReplicationHandlerBackup 10B6A7243CBE525A-001\solr-instance-002
   [junit4]   2> 38411 T58 oasc.SolrResourceLoader.<init> new SolrResourceLoader for directory: 'C:\Users\JenkinsSlave\workspace\Lucene-Solr-trunk-Windows\solr\build\solr-core\test\J0\temp\solr.handler.TestReplicationHandlerBackup 10B6A7243CBE525A-001\solr-instance-002\'
   [junit4]   2> 38468 T58 oasc.ConfigSolr.fromFile Loading container configuration from C:\Users\JenkinsSlave\workspace\Lucene-Solr-trunk-Windows\solr\build\solr-core\test\J0\temp\solr.handler.TestReplicationHandlerBackup 10B6A7243CBE525A-001\solr-instance-002\solr.xml
   [junit4]   2> 38494 T58 oasc.CorePropertiesLocator.<init> Config-defined core root directory: C:\Users\JenkinsSlave\workspace\Lucene-Solr-trunk-Windows\solr\build\solr-core\test\J0\temp\solr.handler.TestReplicationHandlerBackup 10B6A7243CBE525A-001\solr-instance-002\.
   [junit4]   2> 38494 T58 oasc.CoreContainer.<init> New CoreContainer 792816679
   [junit4]   2> 38494 T58 oasc.CoreContainer.load Loading cores into CoreContainer [instanceDir=C:\Users\JenkinsSlave\workspace\Lucene-Solr-trunk-Windows\solr\build\solr-core\test\J0\temp\solr.handler.TestReplicationHandlerBackup 10B6A7243CBE525A-001\solr-instance-002\]
   [junit4]   2> 38495 T58 oashc.HttpShardHandlerFactory.getParameter Setting socketTimeout to: 90000
   [junit4]   2> 38496 T58 oashc.HttpShardHandlerFactory.getParameter Setting urlScheme to: 
   [junit4]   2> 38496 T58 oashc.HttpShardHandlerFactory.getParameter Setting connTimeout to: 15000
   [junit4]   2> 38496 T58 oashc.HttpShardHandlerFactory.getParameter Setting maxConnectionsPerHost to: 20
   [junit4]   2> 38496 T58 oashc.HttpShardHandlerFactory.getParameter Setting maxConnections to: 10000
   [junit4]   2> 38496 T58 oashc.HttpShardHandlerFactory.getParameter Setting corePoolSize to: 0
   [junit4]   2> 38496 T58 oashc.HttpShardHandlerFactory.getParameter Setting maximumPoolSize to: 2147483647
   [junit4]   2> 38499 T58 oashc.HttpShardHandlerFactory.getParameter Setting maxThreadIdleTime to: 5
   [junit4]   2> 38499 T58 oashc.HttpShardHandlerFactory.getParameter Setting sizeOfQueue to: -1
   [junit4]   2> 38499 T58 oashc.HttpShardHandlerFactory.getParameter Setting fairnessPolicy to: false
   [junit4]   2> 38499 T58 oashc.HttpShardHandlerFactory.getParameter Setting useRetries to: false
   [junit4]   2> 38499 T58 oasu.UpdateShardHandler.<init> Creating UpdateShardHandler HTTP client with params: socketTimeout=340000&connTimeout=45000&retry=true
   [junit4]   2> 38499 T58 oasl.LogWatcher.createWatcher SLF4J impl is org.slf4j.impl.Log4jLoggerFactory
   [junit4]   2> 38502 T58 oasl.LogWatcher.newRegisteredLogWatcher Registering Log Listener [Log4j (org.slf4j.impl.Log4jLoggerFactory)]
   [junit4]   2> 38502 T58 oasc.CoreContainer.load Host Name: 127.0.0.1
   [junit4]   2> 38509 T58 oasc.CorePropertiesLocator.discover Looking for core definitions underneath C:\Users\JenkinsSlave\workspace\Lucene-Solr-trunk-Windows\solr\build\solr-core\test\J0\temp\solr.handler.TestReplicationHandlerBackup 10B6A7243CBE525A-001\solr-instance-002\.
   [junit4]   2> 38514 T58 oasc.CorePropertiesLocator.discoverUnder Found core collection1 in C:\Users\JenkinsSlave\workspace\Lucene-Solr-trunk-Windows\solr\build\solr-core\test\J0\temp\solr.handler.TestReplicationHandlerBackup 10B6A7243CBE525A-001\solr-instance-002\.\collection1\
   [junit4]   2> 38515 T58 oasc.CorePropertiesLocator.discover Found 1 core definitions
   [junit4]   2> 38516 T87 oasc.SolrResourceLoader.<init> new SolrResourceLoader for directory: 'C:\Users\JenkinsSlave\workspace\Lucene-Solr-trunk-Windows\solr\build\solr-core\test\J0\temp\solr.handler.TestReplicationHandlerBackup 10B6A7243CBE525A-001\solr-instance-002\.\collection1\'
   [junit4]   2> 38619 T87 oasc.SolrConfig.refreshRequestParams current version of requestparams : -1
   [junit4]   2> 38624 T87 oasc.SolrConfig.<init> Using Lucene MatchVersion: 6.0.0
   [junit4]   2> 38677 T87 oasc.SolrConfig.<init> Loaded SolrConfig: solrconfig.xml
   [junit4]   2> 38678 T87 oass.IndexSchema.readSchema Reading Solr Schema from C:\Users\JenkinsSlave\workspace\Lucene-Solr-trunk-Windows\solr\build\solr-core\test\J0\temp\solr.handler.TestReplicationHandlerBackup 10B6A7243CBE525A-001\solr-instance-002\.\collection1\conf\schema.xml
   [junit4]   2> 38687 T87 oass.IndexSchema.readSchema [collection1] Schema name=test
   [junit4]   2> 38694 T87 oass.IndexSchema.readSchema unique key field: id
   [junit4]   2> 38694 T87 oasc.CoreContainer.create Creating SolrCore 'collection1' using configuration from instancedir C:\Users\JenkinsSlave\workspace\Lucene-Solr-trunk-Windows\solr\build\solr-core\test\J0\temp\solr.handler.TestReplicationHandlerBackup 10B6A7243CBE525A-001\solr-instance-002\.\collection1\
   [junit4]   2> 38694 T87 oasc.SolrCore.initDirectoryFactory org.apache.solr.core.MockDirectoryFactory
   [junit4]   2> 38699 T87 oasc.SolrCore.<init> [collection1] Opening new SolrCore at C:\Users\JenkinsSlave\workspace\Lucene-Solr-trunk-Windows\solr\build\solr-core\test\J0\temp\solr.handler.TestReplicationHandlerBackup 10B6A7243CBE525A-001\solr-instance-002\.\collection1\, dataDir=C:\Users\JenkinsSlave\workspace\Lucene-Solr-trunk-Windows\solr\build\solr-core\test\J0\temp\solr.handler.TestReplicationHandlerBackup 10B6A7243CBE525A-001\solr-instance-002\collection1\data\
   [junit4]   2> 38699 T87 oasc.SolrCore.<init> JMX monitoring not detected for core: collection1
   [junit4]   2> 38700 T87 oasc.CachingDirectoryFactory.get return new directory for C:\Users\JenkinsSlave\workspace\Lucene-Solr-trunk-Windows\solr\build\solr-core\test\J0\temp\solr.handler.TestReplicationHandlerBackup 10B6A7243CBE525A-001\solr-instance-002\collection1\data\
   [junit4]   2> 38700 T87 oasc.SolrCore.getNewIndexDir New index directory detected: old=null new=C:\Users\JenkinsSlave\workspace\Lucene-Solr-trunk-Windows\solr\build\solr-core\test\J0\temp\solr.handler.TestReplicationHandlerBackup 10B6A7243CBE525A-001\solr-instance-002\collection1\data\index/
   [junit4]   2> 38700 T87 oasc.SolrCore.initIndex WARN [collection1] Solr index directory 'C:\Users\JenkinsSlave\workspace\Lucene-Solr-trunk-Windows\solr\build\solr-core\test\J0\temp\solr.handler.TestReplicationHandlerBackup 10B6A7243CBE525A-001\solr-instance-002\collection1\data\index' doesn't exist. Creating new index...
   [junit4]   2> 38702 T87 oasc.CachingDirectoryFactory.get return new directory for C:\Users\JenkinsSlave\workspace\Lucene-Solr-trunk-Windows\solr\build\solr-core\test\J0\temp\solr.handler.TestReplicationHandlerBackup 10B6A7243CBE525A-001\solr-instance-002\collection1\data\index
   [junit4]   2> 38702 T87 oasu.RandomMergePolicy.<init> RandomMergePolicy wrapping class org.apache.lucene.index.LogByteSizeMergePolicy: [LogByteSizeMergePolicy: minMergeSize=1677721, mergeFactor=43, maxMergeSize=2147483648, maxMergeSizeForForcedMerge=9223372036854775807, calibrateSizeByDeletes=true, maxMergeDocs=2147483647, maxCFSSegmentSizeMB=8.796093022207999E12, noCFSRatio=0.0]
   [junit4]   2> 38703 T87 oasc.SolrDeletionPolicy.onCommit SolrDeletionPolicy.onCommit: commits: num=1
   [junit4]   2> 		commit{dir=MockDirectoryWrapper(RAMDirectory@3042289e lockFactory=org.apache.lucene.store.SingleInstanceLockFactory@7ad15563),segFN=segments_1,generation=1}
   [junit4]   2> 38703 T87 oasc.SolrDeletionPolicy.updateCommits newest commit generation = 1
   [junit4]   2> 38705 T87 oasc.SolrCore.loadUpdateProcessorChains no updateRequestProcessorChain defined as default, creating implicit default
   [junit4]   2> 38706 T87 oasc.RequestHandlers.initHandlersFromConfig created /update: solr.UpdateRequestHandler
   [junit4]   2> 38706 T87 oasc.RequestHandlers.initHandlersFromConfig created /update/json: org.apache.solr.handler.UpdateRequestHandler
   [junit4]   2> 38706 T87 oasc.RequestHandlers.initHandlersFromConfig created /update/csv: org.apache.solr.handler.UpdateRequestHandler
   [junit4]   2> 38706 T87 oasc.RequestHandlers.initHandlersFromConfig created /update/json/docs: org.apache.solr.handler.UpdateRequestHandler
   [junit4]   2> 38708 T87 oasc.RequestHandlers.initHandlersFromConfig created /config: org.apache.solr.handler.SolrConfigHandler
   [junit4]   2> 38709 T87 oasc.RequestHandlers.initHandlersFromConfig created /schema: org.apache.solr.handler.SchemaHandler
   [junit4]   2> 38709 T87 oasc.RequestHandlers.initHandlersFromConfig created /replication: solr.ReplicationHandler
   [junit4]   2> 38709 T87 oasc.RequestHandlers.initHandlersFromConfig created /get: org.apache.solr.handler.RealTimeGetHandler
   [junit4]   2> 38711 T87 oasc.RequestHandlers.initHandlersFromConfig created /admin/luke: org.apache.solr.handler.admin.LukeRequestHandler
   [junit4]   2> 38712 T87 oasc.RequestHandlers.initHandlersFromConfig created /admin/system: org.apache.solr.handler.admin.SystemInfoHandler
   [junit4]   2> 38712 T87 oasc.RequestHandlers.initHandlersFromConfig created /admin/mbeans: org.apache.solr.handler.admin.SolrInfoMBeanHandler
   [junit4]   2> 38713 T87 oasc.RequestHandlers.initHandlersFromConfig created /admin/plugins: org.apache.solr.handler.admin.PluginInfoHandler
   [junit4]   2> 38713 T87 oasc.RequestHandlers.initHandlersFromConfig created /admin/threads: org.apache.solr.handler.admin.ThreadDumpHandler
   [junit4]   2> 38713 T87 oasc.RequestHandlers.initHandlersFromConfig created /admin/properties: org.apache.solr.handler.admin.PropertiesRequestHandler
   [junit4]   2> 38715 T87 oasc.RequestHandlers.initHandlersFromConfig created /admin/logging: org.apache.solr.handler.admin.LoggingHandler
   [junit4]   2> 38715 T87 oasc.RequestHandlers.initHandlersFromConfig created /admin/file: org.apache.solr.handler.admin.ShowFileRequestHandler
   [junit4]   2> 38716 T87 oasc.RequestHandlers.initHandlersFromConfig created /admin/ping: org.apache.solr.handler.PingRequestHandler
   [junit4]   2> 38716 T87 oasc.RequestHandlers.initHandlersFromConfig created standard: solr.StandardRequestHandler
   [junit4]   2> 38716 T87 oasc.RequestHandlers.initHandlersFromConfig created defaults: solr.StandardRequestHandler
   [junit4]   2> 38716 T87 oasc.RequestHandlers.initHandlersFromConfig adding lazy requestHandler: solr.StandardRequestHandler
   [junit4]   2> 38716 T87 oasc.RequestHandlers.initHandlersFromConfig created lazy: solr.StandardRequestHandler
   [junit4]   2> 38727 T87 oashl.XMLLoader.init xsltCacheLifetimeSeconds=60
   [junit4]   2> 38730 T87 oashl.XMLLoader.init xsltCacheLifetimeSeconds=60
   [junit4]   2> 38733 T87 oashl.XMLLoader.init xsltCacheLifetimeSeconds=60
   [junit4]   2> 38734 T87 oashl.XMLLoader.init xsltCacheLifetimeSeconds=60
   [junit4]   2> 38734 T87 oasc.SolrCore.initStatsCache Using default statsCache cache: org.apache.solr.search.stats.LocalStatsCache
   [junit4]   2> 38737 T87 oasu.CommitTracker.<init> Hard AutoCommit: disabled
   [junit4]   2> 38737 T87 oasu.CommitTracker.<init> Soft AutoCommit: disabled
   [junit4]   2> 38738 T87 oasu.RandomMergePolicy.<init> RandomMergePolicy wrapping class org.apache.lucene.index.LogByteSizeMergePolicy: [LogByteSizeMergePolicy: minMergeSize=1677721, mergeFactor=22, maxMergeSize=2147483648, maxMergeSizeForForcedMerge=9223372036854775807, calibrateSizeByDeletes=true, maxMergeDocs=2147483647, maxCFSSegmentSizeMB=8.796093022207999E12, noCFSRatio=0.0]
   [junit4]   2> 38738 T87 oasc.SolrDeletionPolicy.onInit SolrDeletionPolicy.onInit: commits: num=1
   [junit4]   2> 		commit{dir=MockDirectoryWrapper(RAMDirectory@3042289e lockFactory=org.apache.lucene.store.SingleInstanceLockFactory@7ad15563),segFN=segments_1,generation=1}
   [junit4]   2> 38738 T87 oasc.SolrDeletionPolicy.updateCommits newest commit generation = 1
   [junit4]   2> 38740 T87 oass.SolrIndexSearcher.<init> Opening Searcher@2b17b8d3[collection1] main
   [junit4]   2> 38740 T87 oasr.ManagedResourceStorage$FileStorageIO.configure File-based storage initialized to use dir: C:\Users\JenkinsSlave\workspace\Lucene-Solr-trunk-Windows\solr\build\solr-core\test\J0\temp\solr.handler.TestReplicationHandlerBackup 10B6A7243CBE525A-001\solr-instance-002\.\collection1\conf
   [junit4]   2> 38740 T87 oasr.RestManager.init Initializing RestManager with initArgs: {storageDir=C:\Users\JenkinsSlave\workspace\Lucene-Solr-trunk-Windows\solr\build\solr-core\test\J0\temp\solr.handler.TestReplicationHandlerBackup 10B6A7243CBE525A-001\solr-instance-002\.\collection1\conf}
   [junit4]   2> 38740 T87 oasr.ManagedResourceStorage.load Reading _rest_managed.json using file:dir=C:\Users\JenkinsSlave\workspace\Lucene-Solr-trunk-Windows\solr\build\solr-core\test\J0\temp\solr.handler.TestReplicationHandlerBackup 10B6A7243CBE525A-001\solr-instance-002\.\collection1\conf
   [junit4]   2> 38741 T87 oasr.RestManager.init Initializing 0 registered ManagedResources
   [junit4]   2> 38741 T87 oash.ReplicationHandler.inform Replication enabled for following config files: schema-replication2.xml:schema.xml
   [junit4]   2> 38743 T87 oash.ReplicationHandler.inform Commits will be reserved for  10000
   [junit4]   2> 38743 T87 oasc.CoreContainer.registerCore registering core: collection1
   [junit4]   2> 38744 T58 oass.SolrDispatchFilter.init user.dir=C:\Users\JenkinsSlave\workspace\Lucene-Solr-trunk-Windows\solr\build\solr-core\test\J0
   [junit4]   2> 38744 T58 oass.SolrDispatchFilter.init SolrDispatchFilter.init() done
   [junit4]   2> 38755 T88 oasc.SolrCore.registerSearcher [collection1] Registered new searcher Searcher@2b17b8d3[collection1] main{ExitableDirectoryReader(UninvertingDirectoryReader())}
   [junit4]   2> ASYNC  NEW_CORE C3 name=collection1 org.apache.solr.core.SolrCore@46551cbc
   [junit4]   2> 38760 T82 C3 oasu.DirectUpdateHandler2.deleteAll [collection1] REMOVING ALL DOCUMENTS FROM INDEX
   [junit4]   2> 38763 T82 C3 oasup.LogUpdateProcessor.finish [collection1] webapp=/solr path=/update params={wt=javabin&version=2} {deleteByQuery=*:*} 0 4
   [junit4]   2> 38778 T84 C3 oasup.LogUpdateProcessor.finish [collection1] webapp=/solr path=/update params={wt=javabin&version=2} {add=[0]} 0 6
   [junit4]   2> 38816 T81 C3 oasup.LogUpdateProcessor.finish [collection1] webapp=/solr path=/update params={wt=javabin&version=2} {add=[1]} 0 20
   [junit4]   2> 38826 T79 C3 oasup.LogUpdateProcessor.finish [collection1] webapp=/solr path=/update params={wt=javabin&version=2} {add=[2]} 0 1
   [junit4]   2> 38859 T78 C3 oasup.LogUpdateProcessor.finish [collection1] webapp=/solr path=/update params={wt=javabin&version=2} {add=[3]} 0 2
   [junit4]   2> 38883 T80 C3 oasup.LogUpdateProcessor.finish [collection1] webapp=/solr path=/update params={wt=javabin&version=2} {add=[4]} 0 3
   [junit4]   2> 38898 T82 C3 oasup.LogUpdateProcessor.finish [collection1] webapp=/solr path=/update params={wt=javabin&version=2} {add=[5]} 0 1
   [junit4]   2> 38905 T84 C3 oasup.LogUpdateProcessor.finish [collection1] webapp=/solr path=/update params={wt=javabin&version=2} {add=[6]} 0 1
   [junit4]   2> 38913 T81 C3 oasup.LogUpdateProcessor.finish [collection1] webapp=/solr path=/update params={wt=javabin&version=2} {add=[7]} 0 2
   [junit4]   2> 38923 T79 C3 oasup.LogUpdateProcessor.finish [collection1] webapp=/solr path=/update params={wt=javabin&version=2} {add=[8]} 0 4
   [junit4]   2> 38930 T78 C3 oasup.LogUpdateProcessor.finish [collection1] webapp=/solr path=/update params={wt=javabin&version=2} {add=[9]} 0 1
   [junit4]   2> 38938 T80 C3 oasup.LogUpdateProcessor.finish [collection1] webapp=/solr path=/update params={wt=javabin&version=2} {add=[10]} 0 0
   [junit4]   2> 38945 T82 C3 oasup.LogUpdateProcessor.finish [collection1] webapp=/solr path=/update params={wt=javabin&version=2} {add=[11]} 0 2
   [junit4]   2> 38951 T84 C3 oasup.LogUpdateProcessor.finish [collection1] webapp=/solr path=/update params={wt=javabin&version=2} {add=[12]} 0 2
   [junit4]   2> 38960 T81 C3 oasup.LogUpdateProcessor.finish [collection1] webapp=/solr path=/update params={wt=javabin&version=2} {add=[13]} 0 3
   [junit4]   2> 38973 T79 C3 oasup.LogUpdateProcessor.finish [collection1] webapp=/solr path=/update params={wt=javabin&version=2} {add=[14]} 0 3
   [junit4]   2> 38980 T78 C3 oasup.LogUpdateProcessor.finish [collection1] webapp=/solr path=/update params={wt=javabin&version=2} {add=[15]} 0 1
   [junit4]   2> 38990 T80 C3 oasup.LogUpdateProcessor.finish [collection1] webapp=/solr path=/update params={wt=javabin&version=2} {add=[16]} 0 1
   [junit4]   2> 39008 T82 C3 oasup.LogUpdateProcessor.finish [collection1] webapp=/solr path=/update params={wt=javabin&version=2} {add=[17]} 0 0
   [junit4]   2> 39015 T84 C3 oasup.LogUpdateProcessor.finish [collection1] webapp=/solr path=/update params={wt=javabin&version=2} {add=[18]} 0 0
   [junit4]   2> 39021 T81 C3 oasup.LogUpdateProcessor.finish [collection1] webapp=/solr path=/update params={wt=javabin&version=2} {add=[19]} 0 0
   [junit4]   2> 39028 T79 C3 oasup.LogUpdateProcessor.finish [collection1] webapp=/solr path=/update params={wt=javabin&version=2} {add=[20]} 0 1
   [junit4]   2> 39040 T78 C3 oasup.LogUpdateProcessor.finish [collection1] webapp=/solr path=/update params={wt=javabin&version=2} {add=[21]} 0 4
   [junit4]   2> 39065 T80 C3 oasup.LogUpdateProcessor.finish [collection1] webapp=/solr path=/update params={wt=javabin&version=2} {add=[22]} 0 6
   [junit4]   2> 39074 T82 C3 oasup.LogUpdateProcessor.finish [collection1] webapp=/solr path=/update params={wt=javabin&version=2} {add=[23]} 0 0
   [junit4]   2> 39088 T84 C3 oasup.LogUpdateProcessor.finish [collection1] webapp=/solr path=/update params={wt=javabin&version=2} {add=[24]} 0 0
   [junit4]   2> 39108 T81 C3 oasu.DirectUpdateHandler2.commit start commit{,optimize=false,openSearcher=true,waitSearcher=true,expungeDeletes=false,softCommit=false,prepareCommit=false}
   [junit4]   2> 39121 T81 C3 oasc.SolrDeletionPolicy.onCommit SolrDeletionPolicy.onCommit: commits: num=2
   [junit4]   2> 		commit{dir=MockDirectoryWrapper(RAMDirectory@3042289e lockFactory=org.apache.lucene.store.SingleInstanceLockFactory@7ad15563),segFN=segments_1,generation=1}
   [junit4]   2> 		commit{dir=MockDirectoryWrapper(RAMDirectory@3042289e lockFactory=org.apache.lucene.store.SingleInstanceLockFactory@7ad15563),segFN=segments_2,generation=2}
   [junit4]   2> 39122 T81 C3 oasc.SolrDeletionPolicy.updateCommits newest commit generation = 2
   [junit4]   2> 39134 T81 C3 oass.SolrIndexSearcher.<init> Opening Searcher@7ab5233[collection1] main
   [junit4]   2> 39134 T81 C3 oasu.DirectUpdateHandler2.commit end_commit_flush
   [junit4]   2> 39135 T88 oasc.SolrCore.registerSearcher [collection1] Registered new searcher Searcher@7ab5233[collection1] main{ExitableDirectoryReader(UninvertingDirectoryReader(Uninverting(_0(6.0.0):c25)))}
   [junit4]   2> 39138 T91 oash.SnapShooter.createSnapshot Creating backup snapshot...
   [junit4]   2> 39150 T91 oash.SnapShooter.createSnapshot Done creating backup snapshot: <not named>
   [junit4]   2> 39151 T81 C3 oasup.LogUpdateProcessor.finish [collection1] webapp=/solr path=/update params={waitSearcher=true&commit=true&softCommit=false&wt=javabin&version=2} {commit=} 0 43
   [junit4]   2> 39207 T79 C3 oasc.SolrCore.execute [collection1] webapp=/solr path=/replication params={name=elikrumnefiaissjll&command=backup} status=0 QTime=3 
   [junit4]   2> 39209 T92 oash.SnapShooter.createSnapshot Creating backup snapshot...
   [junit4]   2> 39220 T92 oash.SnapShooter.createSnapshot Done creating backup snapshot: elikrumnefiaissjll
   [junit4]   2> 39245 T78 C3 oasc.SolrCore.execute [collection1] webapp=/solr path=/replication params={command=details} status=0 QTime=3 
   [junit4]   2> 40769 T80 C3 oasc.SolrCore.execute [collection1] webapp=/solr path=/replication params={name=dzxox&command=backup} status=0 QTime=3 
   [junit4]   2> 40769 T94 oash.SnapShooter.createSnapshot Creating backup snapshot...
   [junit4]   2> 40776 T82 C3 oasc.SolrCore.execute [collection1] webapp=/solr path=/replication params={command=details} status=0 QTime=2 
   [junit4]   2> 40782 T94 oash.SnapShooter.createSnapshot Done creating backup snapshot: dzxox
   [junit4]   2> 42307 T84 C3 oasc.SolrCore.execute [collection1] webapp=/solr path=/replication params={name=elikrumnefiaissjll&command=deletebackup} status=0 QTime=8 
   [junit4]   2> 42307 T95 oash.SnapShooter.deleteNamedSnapshot Deleting snapshot: elikrumnefiaissjll
   [junit4]   2> 42323 T81 C3 oasc.SolrCore.execute [collection1] webapp=/solr path=/replication params={command=details} status=0 QTime=2 
   [junit4]   2> 43830 T79 C3 oasc.SolrCore.execute [collection1] webapp=/solr path=/replication params={name=dzxox&command=deletebackup} status=0 QTime=1 
   [junit4]   2> 43830 T96 oash.SnapShooter.deleteNamedSnapshot Deleting snapshot: dzxox
   [junit4]   2> 43837 T79 C3 oasc.SolrCore.execute [collection1] webapp=/solr path=/replication params={command=details} status=0 QTime=1 
   [junit4]   2> 43840 T58 oas.SolrTestCaseJ4.tearDown ###Ending doTestBackup
   [junit4]   2> 43859 T58 oejs.AbstractConnector.doStop Stopped ServerConnector@4096772c{HTTP/1.1}{127.0.0.1:0}
   [junit4]   2> 43861 T58 oasc.CoreContainer.shutdown Shutting down CoreContainer instance=792816679
   [junit4]   2> 43862 T58 oasc.SolrCore.close [collection1]  CLOSING SolrCore org.apache.solr.core.SolrCore@46551cbc
   [junit4]   2> 43862 T58 oasu.DirectUpdateHandler2.close closing DirectUpdateHandler2{commits=1,autocommits=0,soft autocommits=0,optimizes=0,rollbacks=0,expungeDeletes=0,docsPending=0,adds=0,deletesById=0,deletesByQuery=0,errors=0,cumulative_adds=25,cumulative_deletesById=0,cumulative_deletesByQuery=1,cumulative_errors=0}
   [junit4]   2> 43864 T58 oasu.SolrCoreState.decrefSolrCoreState Closing SolrCoreState
   [junit4]   2> 43864 T58 oasu.DefaultSolrCoreState.closeIndexWriter SolrCoreState ref count has reached 0 - closing IndexWriter
   [junit4]   2> 43865 T58 oasu.DefaultSolrCoreState.closeIndexWriter closing IndexWriter with IndexWriterCloser
   [junit4]   2> 43867 T58 oasc.SolrCore.closeSearcher [collection1] Closing main searcher on request.
   [junit4]   2> 43871 T58 oasc.CachingDirectoryFactory.close Closing MockDirectoryFactory - 2 directories currently being tracked
   [junit4]   2> 43871 T58 oasc.CachingDirectoryFactory.closeCacheValue looking to close C:\Users\JenkinsSlave\workspace\Lucene-Solr-trunk-Windows\solr\build\solr-core\test\J0\temp\solr.handler.TestReplicationHandlerBackup 10B6A7243CBE525A-001\solr-instance-002\collection1\data\index [CachedDir<<refCount=0;path=C:\Users\JenkinsSlave\workspace\Lucene-Solr-trunk-Windows\solr\build\solr-core\test\J0\temp\solr.handler.TestReplicationHandlerBackup 10B6A7243CBE525A-001\solr-instance-002\collection1\data\index;done=false>>]
   [junit4]   2> 43873 T58 oasc.CachingDirectoryFactory.close Closing directory: C:\Users\JenkinsSlave\workspace\Lucene-Solr-trunk-Windows\solr\build\solr-core\test\J0\temp\solr.handler.TestReplicationHandlerBackup 10B6A7243CBE525A-001\solr-instance-002\collection1\data\index
   [junit4]   2> 43873 T58 oasc.CachingDirectoryFactory.closeCacheValue looking to close C:\Users\JenkinsSlave\workspace\Lucene-Solr-trunk-Windows\solr\build\solr-core\test\J0\temp\solr.handler.TestReplicationHandlerBackup 10B6A7243CBE525A-001\solr-instance-002\collection1\data\ [CachedDir<<refCount=0;path=C:\Users\JenkinsSlave\workspace\Lucene-Solr-trunk-Windows\solr\build\solr-core\test\J0\temp\solr.handler.TestReplicationHandlerBackup 10B6A7243CBE525A-001\solr-instance-002\collection1\data\;done=false>>]
   [junit4]   2> 43873 T58 oasc.CachingDirectoryFactory.close Closing directory: C:\Users\JenkinsSlave\workspace\Lucene-Solr-trunk-Windows\solr\build\solr-core\test\J0\temp\solr.handler.TestReplicationHandlerBackup 10B6A7243CBE525A-001\solr-instance-002\collection1\data\
   [junit4]   2> 43873 T58 oejsh.ContextHandler.doStop Stopped o.e.j.s.ServletContextHandler@cde86c4{/solr,null,UNAVAILABLE}
   [junit4]   2> NOTE: reproduce with: ant test  -Dtestcase=TestReplicationHandlerBackup -Dtests.method=doTestBackup -Dtests.seed=10B6A7243CBE525A -Dtests.slow=true -Dtests.locale= -Dtests.timezone=America/Mendoza -Dtests.asserts=true -Dtests.file.encoding=ISO-8859-1
   [junit4] ERROR   5.59s | TestReplicationHandlerBackup.doTestBackup <<<
   [junit4]    > Throwable #1: java.io.IOException: Could not remove the following files (in the order of attempts):
   [junit4]    >    C:\Users\JenkinsSlave\workspace\Lucene-Solr-trunk-Windows\solr\build\solr-core\test\J0\temp\solr.handler.TestReplicationHandlerBackup 10B6A7243CBE525A-001\solr-instance-002\collection1: java.nio.file.DirectoryNotEmptyException: C:\Users\JenkinsSlave\workspace\Lucene-Solr-trunk-Windows\solr\build\solr-core\test\J0\temp\solr.handler.TestReplicationHandlerBackup 10B6A7243CBE525A-001\solr-instance-002\collection1
   [junit4]    >    C:\Users\JenkinsSlave\workspace\Lucene-Solr-trunk-Windows\solr\build\solr-core\test\J0\temp\solr.handler.TestReplicationHandlerBackup 10B6A7243CBE525A-001\solr-instance-002: java.nio.file.DirectoryNotEmptyException: C:\Users\JenkinsSlave\workspace\Lucene-Solr-trunk-Windows\solr\build\solr-core\test\J0\temp\solr.handler.TestReplicationHandlerBackup 10B6A7243CBE525A-001\solr-instance-002
   [junit4]    > 	at __randomizedtesting.SeedInfo.seed([10B6A7243CBE525A:513D87411B00A115]:0)
   [junit4]    > 	at org.apache.lucene.util.IOUtils.rm(IOUtils.java:286)
   [junit4]    > 	at org.apache.solr.handler.TestReplicationHandler$SolrInstance.tearDown(TestReplicationHandler.java:1509)
   [junit4]    > 	at org.apache.solr.handler.TestReplicationHandlerBackup.tearDown(TestReplicationHandlerBackup.java:115)
   [junit4]    > 	at java.lang.Thread.run(Thread.java:745)
   [junit4]   2> 43946 T58 oas.SolrTestCaseJ4.deleteCore ###deleteCore
   [junit4]   2> NOTE: leaving temporary files on disk at: C:\Users\JenkinsSlave\workspace\Lucene-Solr-trunk-Windows\solr\build\solr-core\test\J0\temp\solr.handler.TestReplicationHandlerBackup 10B6A7243CBE525A-001
   [junit4]   2> NOTE: test params are: codec=FastCompressingStoredFields(storedFieldsFormat=CompressingStoredFieldsFormat(compressionMode=FAST, chunkSize=21717, maxDocsPerChunk=7, blockSize=6), termVectorsFormat=CompressingTermVectorsFormat(compressionMode=FAST, chunkSize=21717, blockSize=6)), sim=DefaultSimilarity, locale=, timezone=America/Mendoza
   [junit4]   2> NOTE: Windows 7 6.1 amd64/Oracle Corporation 1.8.0_31 (64-bit)/cpus=2,threads=1,free=86284536,total=213385216
   [junit4]   2> NOTE: All tests run in this JVM: [HdfsBasicDistributedZk2Test, PolyFieldTest, ZkStateWriterTest, TestCollationFieldDocValues, JSONWriterTest, TestReplicationHandlerBackup]
   [junit4] Completed in 11.39s, 2 tests, 2 errors <<< FAILURES!

[...truncated 334 lines...]
   [junit4] Suite: org.apache.solr.cloud.CollectionsAPIAsyncDistributedZkTest
   [junit4]   2> Creating dataDir: C:\Users\JenkinsSlave\workspace\Lucene-Solr-trunk-Windows\solr\build\solr-core\test\J0\temp\solr.cloud.CollectionsAPIAsyncDistributedZkTest 10B6A7243CBE525A-001\init-core-data-001
   [junit4]   2> 664486 T3173 oas.SolrTestCaseJ4.buildSSLConfig Randomized ssl (false) and clientAuth (false)
   [junit4]   2> 664492 T3173 oas.BaseDistributedSearchTestCase.initHostContext Setting hostContext system property: /
   [junit4]   2> 664499 T3173 oasc.ZkTestServer.run STARTING ZK TEST SERVER
   [junit4]   1> client port:0.0.0.0/0.0.0.0:0
   [junit4]   2> 664500 T3174 oasc.ZkTestServer$ZKServerMain.runFromConfig Starting server
   [junit4]   2> 664599 T3173 oasc.ZkTestServer.run start zk server on port:54318
   [junit4]   2> 664599 T3173 oascc.SolrZkClient.createZkCredentialsToAddAutomatically Using default ZkCredentialsProvider
   [junit4]   2> 664601 T3173 oascc.ConnectionManager.waitForConnected Waiting for client to connect to ZooKeeper
   [junit4]   2> 664607 T3181 oascc.ConnectionManager.process Watcher org.apache.solr.common.cloud.ConnectionManager@43a61f25 name:ZooKeeperConnection Watcher:127.0.0.1:54318 got event WatchedEvent state:SyncConnected type:None path:null path:null type:None
   [junit4]   2> 664607 T3173 oascc.ConnectionManager.waitForConnected Client is connected to ZooKeeper
   [junit4]   2> 664608 T3173 oascc.SolrZkClient.createZkACLProvider Using default ZkACLProvider
   [junit4]   2> 664608 T3173 oascc.SolrZkClient.makePath makePath: /solr
   [junit4]   2> 664613 T3173 oascc.SolrZkClient.createZkCredentialsToAddAutomatically Using default ZkCredentialsProvider
   [junit4]   2> 664615 T3173 oascc.ConnectionManager.waitForConnected Waiting for client to connect to ZooKeeper
   [junit4]   2> 664617 T3184 oascc.ConnectionManager.process Watcher org.apache.solr.common.cloud.ConnectionManager@4284acd1 name:ZooKeeperConnection Watcher:127.0.0.1:54318/solr got event WatchedEvent state:SyncConnected type:None path:null path:null type:None
   [junit4]   2> 664618 T3173 oascc.ConnectionManager.waitForConnected Client is connected to ZooKeeper
   [junit4]   2> 664618 T3173 oascc.SolrZkClient.createZkACLProvider Using default ZkACLProvider
   [junit4]   2> 664618 T3173 oascc.SolrZkClient.makePath makePath: /collections/collection1
   [junit4]   2> 664622 T3173 oascc.SolrZkClient.makePath makePath: /collections/collection1/shards
   [junit4]   2> 664626 T3173 oascc.SolrZkClient.makePath makePath: /collections/control_collection
   [junit4]   2> 664629 T3173 oascc.SolrZkClient.makePath makePath: /collections/control_collection/shards
   [junit4]   2> 664633 T3173 oasc.AbstractZkTestCase.putConfig put C:\Users\JenkinsSlave\workspace\Lucene-Solr-trunk-Windows\solr\core\src\test-files\solr\collection1\conf\solrconfig-tlog.xml to /configs/conf1/solrconfig.xml
   [junit4]   2> 664633 T3173 oascc.SolrZkClient.makePath makePath: /configs/conf1/solrconfig.xml
   [junit4]   2> 664638 T3173 oasc.AbstractZkTestCase.putConfig put C:\Users\JenkinsSlave\workspace\Lucene-Solr-trunk-Windows\solr\core\src\test-files\solr\collection1\conf\schema.xml to /configs/conf1/schema.xml
   [junit4]   2> 664640 T3173 oascc.SolrZkClient.makePath makePath: /configs/conf1/schema.xml
   [junit4]   2> 664645 T3173 oasc.AbstractZkTestCase.putConfig put C:\Users\JenkinsSlave\workspace\Lucene-Solr-trunk-Windows\solr\core\src\test-files\solr\collection1\conf\solrconfig.snippet.randomindexconfig.xml to /configs/conf1/solrconfig.snippet.randomindexconfig.xml
   [junit4]   2> 664646 T3173 oascc.SolrZkClient.makePath makePath: /configs/conf1/solrconfig.snippet.randomindexconfig.xml
   [junit4]   2> 664650 T3173 oasc.AbstractZkTestCase.putConfig put C:\Users\JenkinsSlave\workspace\Lucene-Solr-trunk-Windows\solr\core\src\test-files\solr\collection1\conf\stopwords.txt to /configs/conf1/stopwords.txt
   [junit4]   2> 664650 T3173 oascc.SolrZkClient.makePath makePath: /configs/conf1/stopwords.txt
   [junit4]   2> 664654 T3173 oasc.AbstractZkTestCase.putConfig put C:\Users\JenkinsSlave\workspace\Lucene-Solr-trunk-Windows\solr\core\src\test-files\solr\collection1\conf\protwords.txt to /configs/conf1/protwords.txt
   [junit4]   2> 664654 T3173 oascc.SolrZkClient.makePath makePath: /configs/conf1/protwords.txt
   [junit4]   2> 664659 T3173 oasc.AbstractZkTestCase.putConfig put C:\Users\JenkinsSlave\workspace\Lucene-Solr-trun

[...truncated too long message...]

PolyFieldTest, ZkStateWriterTest, TestCollationFieldDocValues, JSONWriterTest, TestReplicationHandlerBackup, DistributedSpellCheckComponentTest, TestAnalyzeInfixSuggestions, URLClassifyProcessorTest, HardAutoCommitTest, TestReload, SoftAutoCommitTest, TestShortCircuitedRequests, CSVRequestHandlerTest, BufferStoreTest, SpellingQueryConverterTest, MBeansHandlerTest, MigrateRouteKeyTest, TestSchemaResource, PreAnalyzedFieldTest, EnumFieldTest, TestRecovery, EchoParamsTest, HdfsChaosMonkeySafeLeaderTest, TestFiltering, CollectionsAPIDistributedZkTest, SampleTest, TestDynamicLoading, DocumentBuilderTest, TestRandomMergePolicy, SpellPossibilityIteratorTest, TestSolr4Spatial, RAMDirectoryFactoryTest, DefaultValueUpdateProcessorTest, OutOfBoxZkACLAndCredentialsProvidersTest, TestManagedSynonymFilterFactory, PingRequestHandlerTest, SolrPluginUtilsTest, IndexSchemaTest, TestMaxScoreQueryParser, TestFoldingMultitermQuery, SpellCheckComponentTest, TestOmitPositions, ClusterStateUpdateTest, TestNRTOpen, ResponseLogComponentTest, HdfsDirectoryFactoryTest, BlockDirectoryTest, TestCoreDiscovery, SynonymTokenizerTest, TestQuerySenderListener, TestComponentsName, TestSolrDeletionPolicy2, DirectSolrSpellCheckerTest, TestSolrDynamicMBean, TestRebalanceLeaders, SaslZkACLProviderTest, CloudExitableDirectoryReaderTest, DateRangeFieldTest, DocumentAnalysisRequestHandlerTest, TestUtils, TestNoOpRegenerator, UpdateParamsTest, TestSolrIndexConfig, CopyFieldTest, CoreMergeIndexesAdminHandlerTest, DeleteShardTest, ZkNodePropsTest, SolrCoreCheckLockOnStartupTest, TestMergePolicyConfig, SpellCheckCollatorTest, TestConfig, ZkSolrClientTest, ShardRoutingCustomTest, BasicFunctionalityTest, DistributedQueryElevationComponentTest, PreAnalyzedUpdateProcessorTest, ResponseHeaderTest, ExitableDirectoryReaderTest, BinaryUpdateRequestHandlerTest, TestFuzzyAnalyzedSuggestions, TestIndexSearcher, CoreAdminCreateDiscoverTest, CacheHeaderTest, TestFreeTextSuggestions, TestHighFrequencyDictionaryFactory, PeerSyncTest, DistributedQueueTest, HdfsRecoveryZkTest, MultiTermTest, DocExpirationUpdateProcessorFactoryTest, SchemaVersionSpecificBehaviorTest, DistributedQueryComponentOptimizationTest, TestWordDelimiterFilterFactory, TestPseudoReturnFields, SearchHandlerTest, TestManagedSchemaFieldTypeResource, TestValueSourceCache, TestSimpleQParserPlugin, TestDocSet, AnalyticsQueryTest, TestShardHandlerFactory, TestManagedResourceStorage, TestAddFieldRealTimeGet, CollectionsAPIAsyncDistributedZkTest, DistributedQueryComponentCustomSortTest, TestSerializedLuceneMatchVersion, AtomicUpdatesTest, ZkCLITest, RollingRestartTest, TestLeaderElectionZkExpiry, NumericFieldsTest, TestChildDocTransformer, ChaosMonkeyNothingIsSafeTest, TestSuggestSpellingConverter, TestLFUCache, CoreAdminRequestStatusTest, UniqFieldsUpdateProcessorFactoryTest, TestExpandComponent, DeleteInactiveReplicaTest, SSLMigrationTest, DistanceUnitsTest, CursorPagingTest, SimpleMLTQParserTest, InfoHandlerTest, SimpleFacetsTest, LoggingHandlerTest, QueryElevationComponentTest, TestDistribDocBasedVersion, MoreLikeThisHandlerTest, TestCodecSupport, TestManagedStopFilterFactory, AddBlockUpdateTest, DirectSolrConnectionTest, TestQuerySenderNoQuery, PrimUtilsTest, TestDistributedGrouping, AutoCommitTest, TestInitQParser, SharedFSAutoReplicaFailoverTest, AnalysisAfterCoreReloadTest, TermsComponentTest, SolrXmlInZkTest, TestFunctionQuery, UnloadDistributedZkTest, TestClusterStateMutator, TestMissingGroups, TestRemoteStreaming, TestRawResponseWriter, DisMaxRequestHandlerTest, TestSolrDeletionPolicy1, HighlighterTest, RequestLoggingTest, TestReplicationHandler, TestBinaryResponseWriter, MergeStrategyTest, DateMathParserTest, TestDefaultStatsCache, TestStressRecovery, TestCollapseQParserPlugin, ResourceLoaderTest, LukeRequestHandlerTest, DistribJoinFromCollectionTest, TestRangeQuery, OpenCloseCoreStressTest, NoCacheHeaderTest, TestStressLucene, HdfsUnloadDistributedZkTest, TestOverriddenPrefixQueryForCustomFieldType, MinimalSchemaTest, TestIBSimilarityFactory, TestSchemaVersionResource, TestHashPartitioner, TestFieldTypeCollectionResource, TestSolrConfigHandlerCloud, SolrCoreTest, XmlUpdateRequestHandlerTest, TestRecoveryHdfs, DocValuesMultiTest, TermVectorComponentDistributedTest, LeaderElectionIntegrationTest, BasicDistributedZk2Test, TestComplexPhraseQParserPlugin, FileUtilsTest, TestBM25SimilarityFactory, TestCloudInspectUtil, SpatialFilterTest, TestDFRSimilarityFactory, TestSort, RemoteQueryErrorTest, SliceStateTest, LeaderElectionTest, DistributedExpandComponentTest, SolrIndexSplitterTest, TestWriterPerf, TestDynamicFieldCollectionResource, AnalyticsMergeStrategyTest, SolrCmdDistributorTest, TestLRUCache, ShowFileRequestHandlerTest, CurrencyFieldOpenExchangeTest, TestRTGBase, XsltUpdateRequestHandlerTest, RankQueryTest, FacetPivotSmallTest, TestMiniSolrCloudCluster, TestIndexingPerformance, TestConfigOverlay, TestBulkSchemaConcurrent, TriLevelCompositeIdRoutingTest, TestConfigSets, TestFileDictionaryLookup, SortByFunctionTest, TestConfigReload, TestImplicitCoreProperties, TestLazyCores, TestSearchPerf, TestSolrQueryParser, TestCloudManagedSchema, PrimitiveFieldTypeTest, UUIDUpdateProcessorFallbackTest, TestReloadAndDeleteDocs, TestBadConfig, RequiredFieldsTest, OverseerTest, BasicDistributedZkTest, ChaosMonkeySafeLeaderTest, SyncSliceTest, ShardRoutingTest, BasicZkTest, RecoveryZkTest, FullSolrCloudDistribCmdsTest, TestRandomFaceting, TestZkChroot, TestRandomDVFaceting, TestDistributedSearch, TestFaceting, ZkControllerTest, TestRealTimeGet, TestStressReorder, TestJoin, TestStressVersions, DistributedTermsComponentTest, TestCoreContainer, StatsComponentTest, TestGroupingSearch, BadIndexSchemaTest, ConvertedLegacyTest, DirectUpdateHandlerTest, OverseerCollectionProcessorTest, CurrencyFieldXmlFileTest, SimplePostToolTest, SignatureUpdateProcessorFactoryTest, TestExtendedDismaxParser, SuggesterFSTTest, CoreAdminHandlerTest, SolrRequestParserTest, DocValuesTest, SuggesterTSTTest, SuggesterTest, TestTrie, SuggesterWFSTTest, TestCSVLoader, WordBreakSolrSpellCheckerTest, TestUpdate, FieldMutatingUpdateProcessorTest, TestAtomicUpdateErrorCases, QueryEqualityTest, DirectUpdateHandlerOptimizeTest, StatelessScriptUpdateProcessorFactoryTest, DistanceFunctionTest, SolrInfoMBeanTest, DebugComponentTest, IndexBasedSpellCheckerTest, TestSurroundQueryParser, TestQueryUtils, StandardRequestHandlerTest, TestReversedWildcardFilterFactory, TestQueryTypes, FileBasedSpellCheckerTest, RequestHandlersTest, PathHierarchyTokenizerFactoryTest, TermVectorComponentTest, FieldAnalysisRequestHandlerTest, TestArbitraryIndexDir, FastVectorHighlighterTest, IndexSchemaRuntimeFieldTest, RegexBoostProcessorTest, TestJmxIntegration, TestCollationField, ReturnFieldsTest, UpdateRequestProcessorFactoryTest, TestCSVResponseWriter, QueryParsingTest, TestAnalyzedSuggestions, JsonLoaderTest, TestPartialUpdateDeduplication, TestPHPSerializedResponseWriter, HighlighterConfigTest, SOLR749Test, AlternateDirectoryTest, SolrIndexConfigTest, BadComponentTest, TestBinaryField, TestElisionMultitermQuery, OutputWriterTest, ExternalFileFieldSortTest, TestSolrCoreProperties, TestPostingsSolrHighlighter, NotRequiredUniqueKeyTest, TestLuceneMatchVersion, TestPhraseSuggestions, TestCharFilters, TestXIncludeConfig, TestSweetSpotSimilarityFactory, TestPerFieldSimilarity, TestLMDirichletSimilarityFactory, TestLMJelinekMercerSimilarityFactory, TestDefaultSimilarityFactory, TestFastWriter, TestJmxMonitoredMap, TimeZoneUtilsTest, TestFastOutputStream, ScriptEngineTest, OpenExchangeRatesOrgProviderTest, PluginInfoTest, TestFastLRUCache, TestSystemIdResolver, DateFieldTest, DOMUtilTest, ClusterStateTest, TestSolrJ, TestDocumentBuilder, SystemInfoHandlerTest, UUIDFieldTest, CircularListTest, DistributedMLTComponentTest, DistributedIntervalFacetingTest, SolrTestCaseJ4Test, TestCursorMarkWithoutUniqueKey, TestDistributedMissingSort, TestHighlightDedupGrouping, TestTolerantSearch, AliasIntegrationTest, AssignTest, AsyncMigrateRouteKeyTest, ConnectionManagerTest, CustomCollectionTest, DeleteReplicaTest, DistribCursorPagingTest, DistribDocExpirationUpdateProcessorTest, ExternalCollectionsTest, HttpPartitionTest, LeaderFailoverAfterPartitionTest, LeaderInitiatedRecoveryOnCommitTest, MultiThreadedOCPTest, OverriddenZkACLAndCredentialsProvidersTest, OverseerRolesTest, OverseerStatusTest, RecoveryAfterSoftCommitTest, ReplicationFactorTest]
   [junit4] Completed in 63.39s, 1 test, 1 error <<< FAILURES!

[...truncated 290 lines...]
BUILD FAILED
C:\Users\JenkinsSlave\workspace\Lucene-Solr-trunk-Windows\build.xml:519: The following error occurred while executing this line:
C:\Users\JenkinsSlave\workspace\Lucene-Solr-trunk-Windows\build.xml:467: The following error occurred while executing this line:
C:\Users\JenkinsSlave\workspace\Lucene-Solr-trunk-Windows\build.xml:61: The following error occurred while executing this line:
C:\Users\JenkinsSlave\workspace\Lucene-Solr-trunk-Windows\extra-targets.xml:39: The following error occurred while executing this line:
C:\Users\JenkinsSlave\workspace\Lucene-Solr-trunk-Windows\solr\build.xml:191: The following error occurred while executing this line:
C:\Users\JenkinsSlave\workspace\Lucene-Solr-trunk-Windows\solr\common-build.xml:512: The following error occurred while executing this line:
C:\Users\JenkinsSlave\workspace\Lucene-Solr-trunk-Windows\lucene\common-build.xml:1348: The following error occurred while executing this line:
C:\Users\JenkinsSlave\workspace\Lucene-Solr-trunk-Windows\lucene\common-build.xml:956: There were test failures: 464 suites, 1854 tests, 1 suite-level error, 3 errors, 1 failure, 55 ignored (30 assumptions)

Total time: 117 minutes 58 seconds
Build step 'Invoke Ant' marked build as failure
[description-setter] Description set: Java: 64bit/jdk1.8.0_31 -XX:+UseCompressedOops -XX:+UseParallelGC
Archiving artifacts
Recording test results
Email was triggered for: Failure - Any
Sending email for trigger: Failure - Any



Mime
View raw message