lucene-dev mailing list archives

Site index · List index
Message view « Date » · « Thread »
Top « Date » · « Thread »
From Apache Jenkins Server <jenk...@builds.apache.org>
Subject [JENKINS] Lucene-Solr-Tests-5.x-Java7 - Build # 2592 - Still Failing
Date Thu, 05 Feb 2015 17:48:50 GMT
Build: https://builds.apache.org/job/Lucene-Solr-Tests-5.x-Java7/2592/

6 tests failed.
REGRESSION:  org.apache.solr.cloud.CollectionsAPIDistributedZkTest.test

Error Message:
some core start times did not change on reload

Stack Trace:
java.lang.AssertionError: some core start times did not change on reload
	at __randomizedtesting.SeedInfo.seed([A96A216EF4FF9BC1:213E1EB45A03F639]:0)
	at org.junit.Assert.fail(Assert.java:93)
	at org.junit.Assert.assertTrue(Assert.java:43)
	at org.apache.solr.cloud.CollectionsAPIDistributedZkTest.testCollectionsAPI(CollectionsAPIDistributedZkTest.java:741)
	at org.apache.solr.cloud.CollectionsAPIDistributedZkTest.test(CollectionsAPIDistributedZkTest.java:191)
	at sun.reflect.NativeMethodAccessorImpl.invoke0(Native Method)
	at sun.reflect.NativeMethodAccessorImpl.invoke(NativeMethodAccessorImpl.java:57)
	at sun.reflect.DelegatingMethodAccessorImpl.invoke(DelegatingMethodAccessorImpl.java:43)
	at java.lang.reflect.Method.invoke(Method.java:606)
	at com.carrotsearch.randomizedtesting.RandomizedRunner.invoke(RandomizedRunner.java:1618)
	at com.carrotsearch.randomizedtesting.RandomizedRunner$6.evaluate(RandomizedRunner.java:827)
	at com.carrotsearch.randomizedtesting.RandomizedRunner$7.evaluate(RandomizedRunner.java:863)
	at com.carrotsearch.randomizedtesting.RandomizedRunner$8.evaluate(RandomizedRunner.java:877)
	at org.apache.solr.BaseDistributedSearchTestCase$ShardsRepeatRule$ShardsFixedStatement.callStatement(BaseDistributedSearchTestCase.java:940)
	at org.apache.solr.BaseDistributedSearchTestCase$ShardsRepeatRule$ShardsStatement.evaluate(BaseDistributedSearchTestCase.java:915)
	at com.carrotsearch.randomizedtesting.rules.SystemPropertiesRestoreRule$1.evaluate(SystemPropertiesRestoreRule.java:53)
	at org.apache.lucene.util.TestRuleSetupTeardownChained$1.evaluate(TestRuleSetupTeardownChained.java:50)
	at org.apache.lucene.util.AbstractBeforeAfterRule$1.evaluate(AbstractBeforeAfterRule.java:46)
	at com.carrotsearch.randomizedtesting.rules.SystemPropertiesInvariantRule$1.evaluate(SystemPropertiesInvariantRule.java:55)
	at org.apache.lucene.util.TestRuleThreadAndTestName$1.evaluate(TestRuleThreadAndTestName.java:49)
	at org.apache.lucene.util.TestRuleIgnoreAfterMaxFailures$1.evaluate(TestRuleIgnoreAfterMaxFailures.java:65)
	at org.apache.lucene.util.TestRuleMarkFailure$1.evaluate(TestRuleMarkFailure.java:48)
	at com.carrotsearch.randomizedtesting.rules.StatementAdapter.evaluate(StatementAdapter.java:36)
	at com.carrotsearch.randomizedtesting.ThreadLeakControl$StatementRunner.run(ThreadLeakControl.java:365)
	at com.carrotsearch.randomizedtesting.ThreadLeakControl.forkTimeoutingTask(ThreadLeakControl.java:798)
	at com.carrotsearch.randomizedtesting.ThreadLeakControl$3.evaluate(ThreadLeakControl.java:458)
	at com.carrotsearch.randomizedtesting.RandomizedRunner.runSingleTest(RandomizedRunner.java:836)
	at com.carrotsearch.randomizedtesting.RandomizedRunner$3.evaluate(RandomizedRunner.java:738)
	at com.carrotsearch.randomizedtesting.RandomizedRunner$4.evaluate(RandomizedRunner.java:772)
	at com.carrotsearch.randomizedtesting.RandomizedRunner$5.evaluate(RandomizedRunner.java:783)
	at com.carrotsearch.randomizedtesting.rules.StatementAdapter.evaluate(StatementAdapter.java:36)
	at com.carrotsearch.randomizedtesting.rules.SystemPropertiesRestoreRule$1.evaluate(SystemPropertiesRestoreRule.java:53)
	at org.apache.lucene.util.AbstractBeforeAfterRule$1.evaluate(AbstractBeforeAfterRule.java:46)
	at org.apache.lucene.util.TestRuleStoreClassName$1.evaluate(TestRuleStoreClassName.java:42)
	at com.carrotsearch.randomizedtesting.rules.SystemPropertiesInvariantRule$1.evaluate(SystemPropertiesInvariantRule.java:55)
	at com.carrotsearch.randomizedtesting.rules.NoShadowingOrOverridesOnMethodsRule$1.evaluate(NoShadowingOrOverridesOnMethodsRule.java:39)
	at com.carrotsearch.randomizedtesting.rules.NoShadowingOrOverridesOnMethodsRule$1.evaluate(NoShadowingOrOverridesOnMethodsRule.java:39)
	at com.carrotsearch.randomizedtesting.rules.StatementAdapter.evaluate(StatementAdapter.java:36)
	at com.carrotsearch.randomizedtesting.rules.StatementAdapter.evaluate(StatementAdapter.java:36)
	at com.carrotsearch.randomizedtesting.rules.StatementAdapter.evaluate(StatementAdapter.java:36)
	at org.apache.lucene.util.TestRuleAssertionsRequired$1.evaluate(TestRuleAssertionsRequired.java:54)
	at org.apache.lucene.util.TestRuleMarkFailure$1.evaluate(TestRuleMarkFailure.java:48)
	at org.apache.lucene.util.TestRuleIgnoreAfterMaxFailures$1.evaluate(TestRuleIgnoreAfterMaxFailures.java:65)
	at org.apache.lucene.util.TestRuleIgnoreTestSuites$1.evaluate(TestRuleIgnoreTestSuites.java:55)
	at com.carrotsearch.randomizedtesting.rules.StatementAdapter.evaluate(StatementAdapter.java:36)
	at com.carrotsearch.randomizedtesting.ThreadLeakControl$StatementRunner.run(ThreadLeakControl.java:365)
	at java.lang.Thread.run(Thread.java:745)


FAILED:  org.apache.solr.cloud.HttpPartitionTest.test

Error Message:
org.apache.solr.client.solrj.SolrServerException: IOException occured when talking to server at: http://127.0.0.1:14647/c8n_1x2_shard1_replica1

Stack Trace:
org.apache.solr.client.solrj.SolrServerException: org.apache.solr.client.solrj.SolrServerException: IOException occured when talking to server at: http://127.0.0.1:14647/c8n_1x2_shard1_replica1
	at __randomizedtesting.SeedInfo.seed([A96A216EF4FF9BC1:213E1EB45A03F639]:0)
	at org.apache.solr.client.solrj.impl.CloudSolrClient.directUpdate(CloudSolrClient.java:575)
	at org.apache.solr.client.solrj.impl.CloudSolrClient.sendRequest(CloudSolrClient.java:884)
	at org.apache.solr.client.solrj.impl.CloudSolrClient.requestWithRetryOnStaleState(CloudSolrClient.java:787)
	at org.apache.solr.client.solrj.impl.CloudSolrClient.request(CloudSolrClient.java:730)
	at org.apache.solr.cloud.HttpPartitionTest.doSendDoc(HttpPartitionTest.java:484)
	at org.apache.solr.cloud.HttpPartitionTest.sendDoc(HttpPartitionTest.java:501)
	at org.apache.solr.cloud.HttpPartitionTest.testRf2(HttpPartitionTest.java:193)
	at org.apache.solr.cloud.HttpPartitionTest.test(HttpPartitionTest.java:106)
	at sun.reflect.NativeMethodAccessorImpl.invoke0(Native Method)
	at sun.reflect.NativeMethodAccessorImpl.invoke(NativeMethodAccessorImpl.java:57)
	at sun.reflect.DelegatingMethodAccessorImpl.invoke(DelegatingMethodAccessorImpl.java:43)
	at java.lang.reflect.Method.invoke(Method.java:606)
	at com.carrotsearch.randomizedtesting.RandomizedRunner.invoke(RandomizedRunner.java:1618)
	at com.carrotsearch.randomizedtesting.RandomizedRunner$6.evaluate(RandomizedRunner.java:827)
	at com.carrotsearch.randomizedtesting.RandomizedRunner$7.evaluate(RandomizedRunner.java:863)
	at com.carrotsearch.randomizedtesting.RandomizedRunner$8.evaluate(RandomizedRunner.java:877)
	at org.apache.solr.BaseDistributedSearchTestCase$ShardsRepeatRule$ShardsFixedStatement.callStatement(BaseDistributedSearchTestCase.java:940)
	at org.apache.solr.BaseDistributedSearchTestCase$ShardsRepeatRule$ShardsStatement.evaluate(BaseDistributedSearchTestCase.java:915)
	at com.carrotsearch.randomizedtesting.rules.SystemPropertiesRestoreRule$1.evaluate(SystemPropertiesRestoreRule.java:53)
	at org.apache.lucene.util.TestRuleSetupTeardownChained$1.evaluate(TestRuleSetupTeardownChained.java:50)
	at org.apache.lucene.util.AbstractBeforeAfterRule$1.evaluate(AbstractBeforeAfterRule.java:46)
	at com.carrotsearch.randomizedtesting.rules.SystemPropertiesInvariantRule$1.evaluate(SystemPropertiesInvariantRule.java:55)
	at org.apache.lucene.util.TestRuleThreadAndTestName$1.evaluate(TestRuleThreadAndTestName.java:49)
	at org.apache.lucene.util.TestRuleIgnoreAfterMaxFailures$1.evaluate(TestRuleIgnoreAfterMaxFailures.java:65)
	at org.apache.lucene.util.TestRuleMarkFailure$1.evaluate(TestRuleMarkFailure.java:48)
	at com.carrotsearch.randomizedtesting.rules.StatementAdapter.evaluate(StatementAdapter.java:36)
	at com.carrotsearch.randomizedtesting.ThreadLeakControl$StatementRunner.run(ThreadLeakControl.java:365)
	at com.carrotsearch.randomizedtesting.ThreadLeakControl.forkTimeoutingTask(ThreadLeakControl.java:798)
	at com.carrotsearch.randomizedtesting.ThreadLeakControl$3.evaluate(ThreadLeakControl.java:458)
	at com.carrotsearch.randomizedtesting.RandomizedRunner.runSingleTest(RandomizedRunner.java:836)
	at com.carrotsearch.randomizedtesting.RandomizedRunner$3.evaluate(RandomizedRunner.java:738)
	at com.carrotsearch.randomizedtesting.RandomizedRunner$4.evaluate(RandomizedRunner.java:772)
	at com.carrotsearch.randomizedtesting.RandomizedRunner$5.evaluate(RandomizedRunner.java:783)
	at com.carrotsearch.randomizedtesting.rules.StatementAdapter.evaluate(StatementAdapter.java:36)
	at com.carrotsearch.randomizedtesting.rules.SystemPropertiesRestoreRule$1.evaluate(SystemPropertiesRestoreRule.java:53)
	at org.apache.lucene.util.AbstractBeforeAfterRule$1.evaluate(AbstractBeforeAfterRule.java:46)
	at org.apache.lucene.util.TestRuleStoreClassName$1.evaluate(TestRuleStoreClassName.java:42)
	at com.carrotsearch.randomizedtesting.rules.SystemPropertiesInvariantRule$1.evaluate(SystemPropertiesInvariantRule.java:55)
	at com.carrotsearch.randomizedtesting.rules.NoShadowingOrOverridesOnMethodsRule$1.evaluate(NoShadowingOrOverridesOnMethodsRule.java:39)
	at com.carrotsearch.randomizedtesting.rules.NoShadowingOrOverridesOnMethodsRule$1.evaluate(NoShadowingOrOverridesOnMethodsRule.java:39)
	at com.carrotsearch.randomizedtesting.rules.StatementAdapter.evaluate(StatementAdapter.java:36)
	at com.carrotsearch.randomizedtesting.rules.StatementAdapter.evaluate(StatementAdapter.java:36)
	at com.carrotsearch.randomizedtesting.rules.StatementAdapter.evaluate(StatementAdapter.java:36)
	at org.apache.lucene.util.TestRuleAssertionsRequired$1.evaluate(TestRuleAssertionsRequired.java:54)
	at org.apache.lucene.util.TestRuleMarkFailure$1.evaluate(TestRuleMarkFailure.java:48)
	at org.apache.lucene.util.TestRuleIgnoreAfterMaxFailures$1.evaluate(TestRuleIgnoreAfterMaxFailures.java:65)
	at org.apache.lucene.util.TestRuleIgnoreTestSuites$1.evaluate(TestRuleIgnoreTestSuites.java:55)
	at com.carrotsearch.randomizedtesting.rules.StatementAdapter.evaluate(StatementAdapter.java:36)
	at com.carrotsearch.randomizedtesting.ThreadLeakControl$StatementRunner.run(ThreadLeakControl.java:365)
	at java.lang.Thread.run(Thread.java:745)
Caused by: org.apache.solr.client.solrj.SolrServerException: IOException occured when talking to server at: http://127.0.0.1:14647/c8n_1x2_shard1_replica1
	at org.apache.solr.client.solrj.impl.HttpSolrClient.executeMethod(HttpSolrClient.java:572)
	at org.apache.solr.client.solrj.impl.HttpSolrClient.request(HttpSolrClient.java:214)
	at org.apache.solr.client.solrj.impl.HttpSolrClient.request(HttpSolrClient.java:210)
	at org.apache.solr.client.solrj.impl.LBHttpSolrClient.doRequest(LBHttpSolrClient.java:370)
	at org.apache.solr.client.solrj.impl.LBHttpSolrClient.request(LBHttpSolrClient.java:325)
	at org.apache.solr.client.solrj.impl.CloudSolrClient.directUpdate(CloudSolrClient.java:572)
	... 49 more
Caused by: org.apache.http.NoHttpResponseException: The target server failed to respond
	at org.apache.http.impl.conn.DefaultHttpResponseParser.parseHead(DefaultHttpResponseParser.java:143)
	at org.apache.http.impl.conn.DefaultHttpResponseParser.parseHead(DefaultHttpResponseParser.java:57)
	at org.apache.http.impl.io.AbstractMessageParser.parse(AbstractMessageParser.java:260)
	at org.apache.http.impl.AbstractHttpClientConnection.receiveResponseHeader(AbstractHttpClientConnection.java:283)
	at org.apache.http.impl.conn.DefaultClientConnection.receiveResponseHeader(DefaultClientConnection.java:251)
	at org.apache.http.impl.conn.ManagedClientConnectionImpl.receiveResponseHeader(ManagedClientConnectionImpl.java:197)
	at org.apache.http.protocol.HttpRequestExecutor.doReceiveResponse(HttpRequestExecutor.java:271)
	at org.apache.http.protocol.HttpRequestExecutor.execute(HttpRequestExecutor.java:123)
	at org.apache.http.impl.client.DefaultRequestDirector.tryExecute(DefaultRequestDirector.java:682)
	at org.apache.http.impl.client.DefaultRequestDirector.execute(DefaultRequestDirector.java:486)
	at org.apache.http.impl.client.AbstractHttpClient.doExecute(AbstractHttpClient.java:863)
	at org.apache.http.impl.client.CloseableHttpClient.execute(CloseableHttpClient.java:82)
	at org.apache.http.impl.client.CloseableHttpClient.execute(CloseableHttpClient.java:106)
	at org.apache.http.impl.client.CloseableHttpClient.execute(CloseableHttpClient.java:57)
	at org.apache.solr.client.solrj.impl.HttpSolrClient.executeMethod(HttpSolrClient.java:464)
	... 54 more


FAILED:  org.apache.solr.cloud.LeaderFailoverAfterPartitionTest.test

Error Message:
org.apache.solr.client.solrj.SolrServerException: IOException occured when talking to server at: http://127.0.0.1:47717/cuv/kt/c8n_1x3_lf_shard1_replica1

Stack Trace:
org.apache.solr.client.solrj.SolrServerException: org.apache.solr.client.solrj.SolrServerException: IOException occured when talking to server at: http://127.0.0.1:47717/cuv/kt/c8n_1x3_lf_shard1_replica1
	at __randomizedtesting.SeedInfo.seed([A96A216EF4FF9BC1:213E1EB45A03F639]:0)
	at org.apache.solr.client.solrj.impl.CloudSolrClient.directUpdate(CloudSolrClient.java:575)
	at org.apache.solr.client.solrj.impl.CloudSolrClient.sendRequest(CloudSolrClient.java:884)
	at org.apache.solr.client.solrj.impl.CloudSolrClient.requestWithRetryOnStaleState(CloudSolrClient.java:787)
	at org.apache.solr.client.solrj.impl.CloudSolrClient.request(CloudSolrClient.java:730)
	at org.apache.solr.cloud.HttpPartitionTest.doSendDoc(HttpPartitionTest.java:484)
	at org.apache.solr.cloud.HttpPartitionTest.sendDoc(HttpPartitionTest.java:501)
	at org.apache.solr.cloud.LeaderFailoverAfterPartitionTest.testRf3WithLeaderFailover(LeaderFailoverAfterPartitionTest.java:78)
	at org.apache.solr.cloud.LeaderFailoverAfterPartitionTest.test(LeaderFailoverAfterPartitionTest.java:51)
	at sun.reflect.NativeMethodAccessorImpl.invoke0(Native Method)
	at sun.reflect.NativeMethodAccessorImpl.invoke(NativeMethodAccessorImpl.java:57)
	at sun.reflect.DelegatingMethodAccessorImpl.invoke(DelegatingMethodAccessorImpl.java:43)
	at java.lang.reflect.Method.invoke(Method.java:606)
	at com.carrotsearch.randomizedtesting.RandomizedRunner.invoke(RandomizedRunner.java:1618)
	at com.carrotsearch.randomizedtesting.RandomizedRunner$6.evaluate(RandomizedRunner.java:827)
	at com.carrotsearch.randomizedtesting.RandomizedRunner$7.evaluate(RandomizedRunner.java:863)
	at com.carrotsearch.randomizedtesting.RandomizedRunner$8.evaluate(RandomizedRunner.java:877)
	at org.apache.solr.BaseDistributedSearchTestCase$ShardsRepeatRule$ShardsFixedStatement.callStatement(BaseDistributedSearchTestCase.java:940)
	at org.apache.solr.BaseDistributedSearchTestCase$ShardsRepeatRule$ShardsStatement.evaluate(BaseDistributedSearchTestCase.java:915)
	at com.carrotsearch.randomizedtesting.rules.SystemPropertiesRestoreRule$1.evaluate(SystemPropertiesRestoreRule.java:53)
	at org.apache.lucene.util.TestRuleSetupTeardownChained$1.evaluate(TestRuleSetupTeardownChained.java:50)
	at org.apache.lucene.util.AbstractBeforeAfterRule$1.evaluate(AbstractBeforeAfterRule.java:46)
	at com.carrotsearch.randomizedtesting.rules.SystemPropertiesInvariantRule$1.evaluate(SystemPropertiesInvariantRule.java:55)
	at org.apache.lucene.util.TestRuleThreadAndTestName$1.evaluate(TestRuleThreadAndTestName.java:49)
	at org.apache.lucene.util.TestRuleIgnoreAfterMaxFailures$1.evaluate(TestRuleIgnoreAfterMaxFailures.java:65)
	at org.apache.lucene.util.TestRuleMarkFailure$1.evaluate(TestRuleMarkFailure.java:48)
	at com.carrotsearch.randomizedtesting.rules.StatementAdapter.evaluate(StatementAdapter.java:36)
	at com.carrotsearch.randomizedtesting.ThreadLeakControl$StatementRunner.run(ThreadLeakControl.java:365)
	at com.carrotsearch.randomizedtesting.ThreadLeakControl.forkTimeoutingTask(ThreadLeakControl.java:798)
	at com.carrotsearch.randomizedtesting.ThreadLeakControl$3.evaluate(ThreadLeakControl.java:458)
	at com.carrotsearch.randomizedtesting.RandomizedRunner.runSingleTest(RandomizedRunner.java:836)
	at com.carrotsearch.randomizedtesting.RandomizedRunner$3.evaluate(RandomizedRunner.java:738)
	at com.carrotsearch.randomizedtesting.RandomizedRunner$4.evaluate(RandomizedRunner.java:772)
	at com.carrotsearch.randomizedtesting.RandomizedRunner$5.evaluate(RandomizedRunner.java:783)
	at com.carrotsearch.randomizedtesting.rules.StatementAdapter.evaluate(StatementAdapter.java:36)
	at com.carrotsearch.randomizedtesting.rules.SystemPropertiesRestoreRule$1.evaluate(SystemPropertiesRestoreRule.java:53)
	at org.apache.lucene.util.AbstractBeforeAfterRule$1.evaluate(AbstractBeforeAfterRule.java:46)
	at org.apache.lucene.util.TestRuleStoreClassName$1.evaluate(TestRuleStoreClassName.java:42)
	at com.carrotsearch.randomizedtesting.rules.SystemPropertiesInvariantRule$1.evaluate(SystemPropertiesInvariantRule.java:55)
	at com.carrotsearch.randomizedtesting.rules.NoShadowingOrOverridesOnMethodsRule$1.evaluate(NoShadowingOrOverridesOnMethodsRule.java:39)
	at com.carrotsearch.randomizedtesting.rules.NoShadowingOrOverridesOnMethodsRule$1.evaluate(NoShadowingOrOverridesOnMethodsRule.java:39)
	at com.carrotsearch.randomizedtesting.rules.StatementAdapter.evaluate(StatementAdapter.java:36)
	at com.carrotsearch.randomizedtesting.rules.StatementAdapter.evaluate(StatementAdapter.java:36)
	at com.carrotsearch.randomizedtesting.rules.StatementAdapter.evaluate(StatementAdapter.java:36)
	at org.apache.lucene.util.TestRuleAssertionsRequired$1.evaluate(TestRuleAssertionsRequired.java:54)
	at org.apache.lucene.util.TestRuleMarkFailure$1.evaluate(TestRuleMarkFailure.java:48)
	at org.apache.lucene.util.TestRuleIgnoreAfterMaxFailures$1.evaluate(TestRuleIgnoreAfterMaxFailures.java:65)
	at org.apache.lucene.util.TestRuleIgnoreTestSuites$1.evaluate(TestRuleIgnoreTestSuites.java:55)
	at com.carrotsearch.randomizedtesting.rules.StatementAdapter.evaluate(StatementAdapter.java:36)
	at com.carrotsearch.randomizedtesting.ThreadLeakControl$StatementRunner.run(ThreadLeakControl.java:365)
	at java.lang.Thread.run(Thread.java:745)
Caused by: org.apache.solr.client.solrj.SolrServerException: IOException occured when talking to server at: http://127.0.0.1:47717/cuv/kt/c8n_1x3_lf_shard1_replica1
	at org.apache.solr.client.solrj.impl.HttpSolrClient.executeMethod(HttpSolrClient.java:572)
	at org.apache.solr.client.solrj.impl.HttpSolrClient.request(HttpSolrClient.java:214)
	at org.apache.solr.client.solrj.impl.HttpSolrClient.request(HttpSolrClient.java:210)
	at org.apache.solr.client.solrj.impl.LBHttpSolrClient.doRequest(LBHttpSolrClient.java:370)
	at org.apache.solr.client.solrj.impl.LBHttpSolrClient.request(LBHttpSolrClient.java:325)
	at org.apache.solr.client.solrj.impl.CloudSolrClient.directUpdate(CloudSolrClient.java:572)
	... 49 more
Caused by: org.apache.http.NoHttpResponseException: The target server failed to respond
	at org.apache.http.impl.conn.DefaultHttpResponseParser.parseHead(DefaultHttpResponseParser.java:143)
	at org.apache.http.impl.conn.DefaultHttpResponseParser.parseHead(DefaultHttpResponseParser.java:57)
	at org.apache.http.impl.io.AbstractMessageParser.parse(AbstractMessageParser.java:260)
	at org.apache.http.impl.AbstractHttpClientConnection.receiveResponseHeader(AbstractHttpClientConnection.java:283)
	at org.apache.http.impl.conn.DefaultClientConnection.receiveResponseHeader(DefaultClientConnection.java:251)
	at org.apache.http.impl.conn.ManagedClientConnectionImpl.receiveResponseHeader(ManagedClientConnectionImpl.java:197)
	at org.apache.http.protocol.HttpRequestExecutor.doReceiveResponse(HttpRequestExecutor.java:271)
	at org.apache.http.protocol.HttpRequestExecutor.execute(HttpRequestExecutor.java:123)
	at org.apache.http.impl.client.DefaultRequestDirector.tryExecute(DefaultRequestDirector.java:682)
	at org.apache.http.impl.client.DefaultRequestDirector.execute(DefaultRequestDirector.java:486)
	at org.apache.http.impl.client.AbstractHttpClient.doExecute(AbstractHttpClient.java:863)
	at org.apache.http.impl.client.CloseableHttpClient.execute(CloseableHttpClient.java:82)
	at org.apache.http.impl.client.CloseableHttpClient.execute(CloseableHttpClient.java:106)
	at org.apache.http.impl.client.CloseableHttpClient.execute(CloseableHttpClient.java:57)
	at org.apache.solr.client.solrj.impl.HttpSolrClient.executeMethod(HttpSolrClient.java:464)
	... 54 more


FAILED:  org.apache.solr.cloud.LeaderInitiatedRecoveryOnCommitTest.test

Error Message:
IOException occured when talking to server at: http://127.0.0.1:14536/jn_et/mc/c8n_1x3_commits_shard1_replica3

Stack Trace:
org.apache.solr.client.solrj.SolrServerException: IOException occured when talking to server at: http://127.0.0.1:14536/jn_et/mc/c8n_1x3_commits_shard1_replica3
	at __randomizedtesting.SeedInfo.seed([A96A216EF4FF9BC1:213E1EB45A03F639]:0)
	at org.apache.solr.client.solrj.impl.HttpSolrClient.executeMethod(HttpSolrClient.java:572)
	at org.apache.solr.client.solrj.impl.HttpSolrClient.request(HttpSolrClient.java:214)
	at org.apache.solr.client.solrj.impl.HttpSolrClient.request(HttpSolrClient.java:210)
	at org.apache.solr.client.solrj.request.AbstractUpdateRequest.process(AbstractUpdateRequest.java:124)
	at org.apache.solr.client.solrj.SolrClient.commit(SolrClient.java:176)
	at org.apache.solr.client.solrj.SolrClient.commit(SolrClient.java:154)
	at org.apache.solr.cloud.LeaderInitiatedRecoveryOnCommitTest.oneShardTest(LeaderInitiatedRecoveryOnCommitTest.java:130)
	at org.apache.solr.cloud.LeaderInitiatedRecoveryOnCommitTest.test(LeaderInitiatedRecoveryOnCommitTest.java:62)
	at sun.reflect.NativeMethodAccessorImpl.invoke0(Native Method)
	at sun.reflect.NativeMethodAccessorImpl.invoke(NativeMethodAccessorImpl.java:57)
	at sun.reflect.DelegatingMethodAccessorImpl.invoke(DelegatingMethodAccessorImpl.java:43)
	at java.lang.reflect.Method.invoke(Method.java:606)
	at com.carrotsearch.randomizedtesting.RandomizedRunner.invoke(RandomizedRunner.java:1618)
	at com.carrotsearch.randomizedtesting.RandomizedRunner$6.evaluate(RandomizedRunner.java:827)
	at com.carrotsearch.randomizedtesting.RandomizedRunner$7.evaluate(RandomizedRunner.java:863)
	at com.carrotsearch.randomizedtesting.RandomizedRunner$8.evaluate(RandomizedRunner.java:877)
	at org.apache.solr.BaseDistributedSearchTestCase$ShardsRepeatRule$ShardsFixedStatement.callStatement(BaseDistributedSearchTestCase.java:940)
	at org.apache.solr.BaseDistributedSearchTestCase$ShardsRepeatRule$ShardsStatement.evaluate(BaseDistributedSearchTestCase.java:915)
	at com.carrotsearch.randomizedtesting.rules.SystemPropertiesRestoreRule$1.evaluate(SystemPropertiesRestoreRule.java:53)
	at org.apache.lucene.util.TestRuleSetupTeardownChained$1.evaluate(TestRuleSetupTeardownChained.java:50)
	at org.apache.lucene.util.AbstractBeforeAfterRule$1.evaluate(AbstractBeforeAfterRule.java:46)
	at com.carrotsearch.randomizedtesting.rules.SystemPropertiesInvariantRule$1.evaluate(SystemPropertiesInvariantRule.java:55)
	at org.apache.lucene.util.TestRuleThreadAndTestName$1.evaluate(TestRuleThreadAndTestName.java:49)
	at org.apache.lucene.util.TestRuleIgnoreAfterMaxFailures$1.evaluate(TestRuleIgnoreAfterMaxFailures.java:65)
	at org.apache.lucene.util.TestRuleMarkFailure$1.evaluate(TestRuleMarkFailure.java:48)
	at com.carrotsearch.randomizedtesting.rules.StatementAdapter.evaluate(StatementAdapter.java:36)
	at com.carrotsearch.randomizedtesting.ThreadLeakControl$StatementRunner.run(ThreadLeakControl.java:365)
	at com.carrotsearch.randomizedtesting.ThreadLeakControl.forkTimeoutingTask(ThreadLeakControl.java:798)
	at com.carrotsearch.randomizedtesting.ThreadLeakControl$3.evaluate(ThreadLeakControl.java:458)
	at com.carrotsearch.randomizedtesting.RandomizedRunner.runSingleTest(RandomizedRunner.java:836)
	at com.carrotsearch.randomizedtesting.RandomizedRunner$3.evaluate(RandomizedRunner.java:738)
	at com.carrotsearch.randomizedtesting.RandomizedRunner$4.evaluate(RandomizedRunner.java:772)
	at com.carrotsearch.randomizedtesting.RandomizedRunner$5.evaluate(RandomizedRunner.java:783)
	at com.carrotsearch.randomizedtesting.rules.StatementAdapter.evaluate(StatementAdapter.java:36)
	at com.carrotsearch.randomizedtesting.rules.SystemPropertiesRestoreRule$1.evaluate(SystemPropertiesRestoreRule.java:53)
	at org.apache.lucene.util.AbstractBeforeAfterRule$1.evaluate(AbstractBeforeAfterRule.java:46)
	at org.apache.lucene.util.TestRuleStoreClassName$1.evaluate(TestRuleStoreClassName.java:42)
	at com.carrotsearch.randomizedtesting.rules.SystemPropertiesInvariantRule$1.evaluate(SystemPropertiesInvariantRule.java:55)
	at com.carrotsearch.randomizedtesting.rules.NoShadowingOrOverridesOnMethodsRule$1.evaluate(NoShadowingOrOverridesOnMethodsRule.java:39)
	at com.carrotsearch.randomizedtesting.rules.NoShadowingOrOverridesOnMethodsRule$1.evaluate(NoShadowingOrOverridesOnMethodsRule.java:39)
	at com.carrotsearch.randomizedtesting.rules.StatementAdapter.evaluate(StatementAdapter.java:36)
	at com.carrotsearch.randomizedtesting.rules.StatementAdapter.evaluate(StatementAdapter.java:36)
	at com.carrotsearch.randomizedtesting.rules.StatementAdapter.evaluate(StatementAdapter.java:36)
	at org.apache.lucene.util.TestRuleAssertionsRequired$1.evaluate(TestRuleAssertionsRequired.java:54)
	at org.apache.lucene.util.TestRuleMarkFailure$1.evaluate(TestRuleMarkFailure.java:48)
	at org.apache.lucene.util.TestRuleIgnoreAfterMaxFailures$1.evaluate(TestRuleIgnoreAfterMaxFailures.java:65)
	at org.apache.lucene.util.TestRuleIgnoreTestSuites$1.evaluate(TestRuleIgnoreTestSuites.java:55)
	at com.carrotsearch.randomizedtesting.rules.StatementAdapter.evaluate(StatementAdapter.java:36)
	at com.carrotsearch.randomizedtesting.ThreadLeakControl$StatementRunner.run(ThreadLeakControl.java:365)
	at java.lang.Thread.run(Thread.java:745)
Caused by: org.apache.http.NoHttpResponseException: The target server failed to respond
	at org.apache.http.impl.conn.DefaultHttpResponseParser.parseHead(DefaultHttpResponseParser.java:143)
	at org.apache.http.impl.conn.DefaultHttpResponseParser.parseHead(DefaultHttpResponseParser.java:57)
	at org.apache.http.impl.io.AbstractMessageParser.parse(AbstractMessageParser.java:260)
	at org.apache.http.impl.AbstractHttpClientConnection.receiveResponseHeader(AbstractHttpClientConnection.java:283)
	at org.apache.http.impl.conn.DefaultClientConnection.receiveResponseHeader(DefaultClientConnection.java:251)
	at org.apache.http.impl.conn.ManagedClientConnectionImpl.receiveResponseHeader(ManagedClientConnectionImpl.java:197)
	at org.apache.http.protocol.HttpRequestExecutor.doReceiveResponse(HttpRequestExecutor.java:271)
	at org.apache.http.protocol.HttpRequestExecutor.execute(HttpRequestExecutor.java:123)
	at org.apache.http.impl.client.DefaultRequestDirector.tryExecute(DefaultRequestDirector.java:682)
	at org.apache.http.impl.client.DefaultRequestDirector.execute(DefaultRequestDirector.java:486)
	at org.apache.http.impl.client.AbstractHttpClient.doExecute(AbstractHttpClient.java:863)
	at org.apache.http.impl.client.CloseableHttpClient.execute(CloseableHttpClient.java:82)
	at org.apache.http.impl.client.CloseableHttpClient.execute(CloseableHttpClient.java:106)
	at org.apache.http.impl.client.CloseableHttpClient.execute(CloseableHttpClient.java:57)
	at org.apache.solr.client.solrj.impl.HttpSolrClient.executeMethod(HttpSolrClient.java:464)
	... 49 more


FAILED:  org.apache.solr.cloud.RecoveryAfterSoftCommitTest.test

Error Message:
org.apache.solr.client.solrj.SolrServerException: IOException occured when talking to server at: http://127.0.0.1:26979/z_/collection1

Stack Trace:
org.apache.solr.client.solrj.SolrServerException: org.apache.solr.client.solrj.SolrServerException: IOException occured when talking to server at: http://127.0.0.1:26979/z_/collection1
	at __randomizedtesting.SeedInfo.seed([A96A216EF4FF9BC1:213E1EB45A03F639]:0)
	at org.apache.solr.client.solrj.impl.CloudSolrClient.directUpdate(CloudSolrClient.java:575)
	at org.apache.solr.client.solrj.impl.CloudSolrClient.sendRequest(CloudSolrClient.java:884)
	at org.apache.solr.client.solrj.impl.CloudSolrClient.requestWithRetryOnStaleState(CloudSolrClient.java:787)
	at org.apache.solr.client.solrj.impl.CloudSolrClient.request(CloudSolrClient.java:730)
	at org.apache.solr.client.solrj.request.AbstractUpdateRequest.process(AbstractUpdateRequest.java:124)
	at org.apache.solr.client.solrj.SolrClient.add(SolrClient.java:124)
	at org.apache.solr.client.solrj.SolrClient.add(SolrClient.java:110)
	at org.apache.solr.cloud.RecoveryAfterSoftCommitTest.test(RecoveryAfterSoftCommitTest.java:88)
	at sun.reflect.NativeMethodAccessorImpl.invoke0(Native Method)
	at sun.reflect.NativeMethodAccessorImpl.invoke(NativeMethodAccessorImpl.java:57)
	at sun.reflect.DelegatingMethodAccessorImpl.invoke(DelegatingMethodAccessorImpl.java:43)
	at java.lang.reflect.Method.invoke(Method.java:606)
	at com.carrotsearch.randomizedtesting.RandomizedRunner.invoke(RandomizedRunner.java:1618)
	at com.carrotsearch.randomizedtesting.RandomizedRunner$6.evaluate(RandomizedRunner.java:827)
	at com.carrotsearch.randomizedtesting.RandomizedRunner$7.evaluate(RandomizedRunner.java:863)
	at com.carrotsearch.randomizedtesting.RandomizedRunner$8.evaluate(RandomizedRunner.java:877)
	at org.apache.solr.BaseDistributedSearchTestCase$ShardsRepeatRule$ShardsFixedStatement.callStatement(BaseDistributedSearchTestCase.java:940)
	at org.apache.solr.BaseDistributedSearchTestCase$ShardsRepeatRule$ShardsStatement.evaluate(BaseDistributedSearchTestCase.java:915)
	at com.carrotsearch.randomizedtesting.rules.SystemPropertiesRestoreRule$1.evaluate(SystemPropertiesRestoreRule.java:53)
	at org.apache.lucene.util.TestRuleSetupTeardownChained$1.evaluate(TestRuleSetupTeardownChained.java:50)
	at org.apache.lucene.util.AbstractBeforeAfterRule$1.evaluate(AbstractBeforeAfterRule.java:46)
	at com.carrotsearch.randomizedtesting.rules.SystemPropertiesInvariantRule$1.evaluate(SystemPropertiesInvariantRule.java:55)
	at org.apache.lucene.util.TestRuleThreadAndTestName$1.evaluate(TestRuleThreadAndTestName.java:49)
	at org.apache.lucene.util.TestRuleIgnoreAfterMaxFailures$1.evaluate(TestRuleIgnoreAfterMaxFailures.java:65)
	at org.apache.lucene.util.TestRuleMarkFailure$1.evaluate(TestRuleMarkFailure.java:48)
	at com.carrotsearch.randomizedtesting.rules.StatementAdapter.evaluate(StatementAdapter.java:36)
	at com.carrotsearch.randomizedtesting.ThreadLeakControl$StatementRunner.run(ThreadLeakControl.java:365)
	at com.carrotsearch.randomizedtesting.ThreadLeakControl.forkTimeoutingTask(ThreadLeakControl.java:798)
	at com.carrotsearch.randomizedtesting.ThreadLeakControl$3.evaluate(ThreadLeakControl.java:458)
	at com.carrotsearch.randomizedtesting.RandomizedRunner.runSingleTest(RandomizedRunner.java:836)
	at com.carrotsearch.randomizedtesting.RandomizedRunner$3.evaluate(RandomizedRunner.java:738)
	at com.carrotsearch.randomizedtesting.RandomizedRunner$4.evaluate(RandomizedRunner.java:772)
	at com.carrotsearch.randomizedtesting.RandomizedRunner$5.evaluate(RandomizedRunner.java:783)
	at com.carrotsearch.randomizedtesting.rules.StatementAdapter.evaluate(StatementAdapter.java:36)
	at com.carrotsearch.randomizedtesting.rules.SystemPropertiesRestoreRule$1.evaluate(SystemPropertiesRestoreRule.java:53)
	at org.apache.lucene.util.AbstractBeforeAfterRule$1.evaluate(AbstractBeforeAfterRule.java:46)
	at org.apache.lucene.util.TestRuleStoreClassName$1.evaluate(TestRuleStoreClassName.java:42)
	at com.carrotsearch.randomizedtesting.rules.SystemPropertiesInvariantRule$1.evaluate(SystemPropertiesInvariantRule.java:55)
	at com.carrotsearch.randomizedtesting.rules.NoShadowingOrOverridesOnMethodsRule$1.evaluate(NoShadowingOrOverridesOnMethodsRule.java:39)
	at com.carrotsearch.randomizedtesting.rules.NoShadowingOrOverridesOnMethodsRule$1.evaluate(NoShadowingOrOverridesOnMethodsRule.java:39)
	at com.carrotsearch.randomizedtesting.rules.StatementAdapter.evaluate(StatementAdapter.java:36)
	at com.carrotsearch.randomizedtesting.rules.StatementAdapter.evaluate(StatementAdapter.java:36)
	at com.carrotsearch.randomizedtesting.rules.StatementAdapter.evaluate(StatementAdapter.java:36)
	at org.apache.lucene.util.TestRuleAssertionsRequired$1.evaluate(TestRuleAssertionsRequired.java:54)
	at org.apache.lucene.util.TestRuleMarkFailure$1.evaluate(TestRuleMarkFailure.java:48)
	at org.apache.lucene.util.TestRuleIgnoreAfterMaxFailures$1.evaluate(TestRuleIgnoreAfterMaxFailures.java:65)
	at org.apache.lucene.util.TestRuleIgnoreTestSuites$1.evaluate(TestRuleIgnoreTestSuites.java:55)
	at com.carrotsearch.randomizedtesting.rules.StatementAdapter.evaluate(StatementAdapter.java:36)
	at com.carrotsearch.randomizedtesting.ThreadLeakControl$StatementRunner.run(ThreadLeakControl.java:365)
	at java.lang.Thread.run(Thread.java:745)
Caused by: org.apache.solr.client.solrj.SolrServerException: IOException occured when talking to server at: http://127.0.0.1:26979/z_/collection1
	at org.apache.solr.client.solrj.impl.HttpSolrClient.executeMethod(HttpSolrClient.java:572)
	at org.apache.solr.client.solrj.impl.HttpSolrClient.request(HttpSolrClient.java:214)
	at org.apache.solr.client.solrj.impl.HttpSolrClient.request(HttpSolrClient.java:210)
	at org.apache.solr.client.solrj.impl.LBHttpSolrClient.doRequest(LBHttpSolrClient.java:370)
	at org.apache.solr.client.solrj.impl.LBHttpSolrClient.request(LBHttpSolrClient.java:325)
	at org.apache.solr.client.solrj.impl.CloudSolrClient.directUpdate(CloudSolrClient.java:572)
	... 49 more
Caused by: org.apache.http.NoHttpResponseException: The target server failed to respond
	at org.apache.http.impl.conn.DefaultHttpResponseParser.parseHead(DefaultHttpResponseParser.java:143)
	at org.apache.http.impl.conn.DefaultHttpResponseParser.parseHead(DefaultHttpResponseParser.java:57)
	at org.apache.http.impl.io.AbstractMessageParser.parse(AbstractMessageParser.java:260)
	at org.apache.http.impl.AbstractHttpClientConnection.receiveResponseHeader(AbstractHttpClientConnection.java:283)
	at org.apache.http.impl.conn.DefaultClientConnection.receiveResponseHeader(DefaultClientConnection.java:251)
	at org.apache.http.impl.conn.ManagedClientConnectionImpl.receiveResponseHeader(ManagedClientConnectionImpl.java:197)
	at org.apache.http.protocol.HttpRequestExecutor.doReceiveResponse(HttpRequestExecutor.java:271)
	at org.apache.http.protocol.HttpRequestExecutor.execute(HttpRequestExecutor.java:123)
	at org.apache.http.impl.client.DefaultRequestDirector.tryExecute(DefaultRequestDirector.java:682)
	at org.apache.http.impl.client.DefaultRequestDirector.execute(DefaultRequestDirector.java:486)
	at org.apache.http.impl.client.AbstractHttpClient.doExecute(AbstractHttpClient.java:863)
	at org.apache.http.impl.client.CloseableHttpClient.execute(CloseableHttpClient.java:82)
	at org.apache.http.impl.client.CloseableHttpClient.execute(CloseableHttpClient.java:106)
	at org.apache.http.impl.client.CloseableHttpClient.execute(CloseableHttpClient.java:57)
	at org.apache.solr.client.solrj.impl.HttpSolrClient.executeMethod(HttpSolrClient.java:464)
	... 54 more


FAILED:  org.apache.solr.cloud.ReplicationFactorTest.test

Error Message:
org.apache.solr.client.solrj.SolrServerException: IOException occured when talking to server at: http://127.0.0.1:43481/sk_s/g/repfacttest_c8n_1x3_shard1_replica2

Stack Trace:
org.apache.solr.client.solrj.SolrServerException: org.apache.solr.client.solrj.SolrServerException: IOException occured when talking to server at: http://127.0.0.1:43481/sk_s/g/repfacttest_c8n_1x3_shard1_replica2
	at __randomizedtesting.SeedInfo.seed([A96A216EF4FF9BC1:213E1EB45A03F639]:0)
	at org.apache.solr.client.solrj.impl.CloudSolrClient.directUpdate(CloudSolrClient.java:575)
	at org.apache.solr.client.solrj.impl.CloudSolrClient.sendRequest(CloudSolrClient.java:884)
	at org.apache.solr.client.solrj.impl.CloudSolrClient.requestWithRetryOnStaleState(CloudSolrClient.java:787)
	at org.apache.solr.client.solrj.impl.CloudSolrClient.request(CloudSolrClient.java:730)
	at org.apache.solr.cloud.ReplicationFactorTest.sendDoc(ReplicationFactorTest.java:319)
	at org.apache.solr.cloud.ReplicationFactorTest.testRf3(ReplicationFactorTest.java:233)
	at org.apache.solr.cloud.ReplicationFactorTest.test(ReplicationFactorTest.java:112)
	at sun.reflect.NativeMethodAccessorImpl.invoke0(Native Method)
	at sun.reflect.NativeMethodAccessorImpl.invoke(NativeMethodAccessorImpl.java:57)
	at sun.reflect.DelegatingMethodAccessorImpl.invoke(DelegatingMethodAccessorImpl.java:43)
	at java.lang.reflect.Method.invoke(Method.java:606)
	at com.carrotsearch.randomizedtesting.RandomizedRunner.invoke(RandomizedRunner.java:1618)
	at com.carrotsearch.randomizedtesting.RandomizedRunner$6.evaluate(RandomizedRunner.java:827)
	at com.carrotsearch.randomizedtesting.RandomizedRunner$7.evaluate(RandomizedRunner.java:863)
	at com.carrotsearch.randomizedtesting.RandomizedRunner$8.evaluate(RandomizedRunner.java:877)
	at org.apache.solr.BaseDistributedSearchTestCase$ShardsRepeatRule$ShardsFixedStatement.callStatement(BaseDistributedSearchTestCase.java:940)
	at org.apache.solr.BaseDistributedSearchTestCase$ShardsRepeatRule$ShardsStatement.evaluate(BaseDistributedSearchTestCase.java:915)
	at com.carrotsearch.randomizedtesting.rules.SystemPropertiesRestoreRule$1.evaluate(SystemPropertiesRestoreRule.java:53)
	at org.apache.lucene.util.TestRuleSetupTeardownChained$1.evaluate(TestRuleSetupTeardownChained.java:50)
	at org.apache.lucene.util.AbstractBeforeAfterRule$1.evaluate(AbstractBeforeAfterRule.java:46)
	at com.carrotsearch.randomizedtesting.rules.SystemPropertiesInvariantRule$1.evaluate(SystemPropertiesInvariantRule.java:55)
	at org.apache.lucene.util.TestRuleThreadAndTestName$1.evaluate(TestRuleThreadAndTestName.java:49)
	at org.apache.lucene.util.TestRuleIgnoreAfterMaxFailures$1.evaluate(TestRuleIgnoreAfterMaxFailures.java:65)
	at org.apache.lucene.util.TestRuleMarkFailure$1.evaluate(TestRuleMarkFailure.java:48)
	at com.carrotsearch.randomizedtesting.rules.StatementAdapter.evaluate(StatementAdapter.java:36)
	at com.carrotsearch.randomizedtesting.ThreadLeakControl$StatementRunner.run(ThreadLeakControl.java:365)
	at com.carrotsearch.randomizedtesting.ThreadLeakControl.forkTimeoutingTask(ThreadLeakControl.java:798)
	at com.carrotsearch.randomizedtesting.ThreadLeakControl$3.evaluate(ThreadLeakControl.java:458)
	at com.carrotsearch.randomizedtesting.RandomizedRunner.runSingleTest(RandomizedRunner.java:836)
	at com.carrotsearch.randomizedtesting.RandomizedRunner$3.evaluate(RandomizedRunner.java:738)
	at com.carrotsearch.randomizedtesting.RandomizedRunner$4.evaluate(RandomizedRunner.java:772)
	at com.carrotsearch.randomizedtesting.RandomizedRunner$5.evaluate(RandomizedRunner.java:783)
	at com.carrotsearch.randomizedtesting.rules.StatementAdapter.evaluate(StatementAdapter.java:36)
	at com.carrotsearch.randomizedtesting.rules.SystemPropertiesRestoreRule$1.evaluate(SystemPropertiesRestoreRule.java:53)
	at org.apache.lucene.util.AbstractBeforeAfterRule$1.evaluate(AbstractBeforeAfterRule.java:46)
	at org.apache.lucene.util.TestRuleStoreClassName$1.evaluate(TestRuleStoreClassName.java:42)
	at com.carrotsearch.randomizedtesting.rules.SystemPropertiesInvariantRule$1.evaluate(SystemPropertiesInvariantRule.java:55)
	at com.carrotsearch.randomizedtesting.rules.NoShadowingOrOverridesOnMethodsRule$1.evaluate(NoShadowingOrOverridesOnMethodsRule.java:39)
	at com.carrotsearch.randomizedtesting.rules.NoShadowingOrOverridesOnMethodsRule$1.evaluate(NoShadowingOrOverridesOnMethodsRule.java:39)
	at com.carrotsearch.randomizedtesting.rules.StatementAdapter.evaluate(StatementAdapter.java:36)
	at com.carrotsearch.randomizedtesting.rules.StatementAdapter.evaluate(StatementAdapter.java:36)
	at com.carrotsearch.randomizedtesting.rules.StatementAdapter.evaluate(StatementAdapter.java:36)
	at org.apache.lucene.util.TestRuleAssertionsRequired$1.evaluate(TestRuleAssertionsRequired.java:54)
	at org.apache.lucene.util.TestRuleMarkFailure$1.evaluate(TestRuleMarkFailure.java:48)
	at org.apache.lucene.util.TestRuleIgnoreAfterMaxFailures$1.evaluate(TestRuleIgnoreAfterMaxFailures.java:65)
	at org.apache.lucene.util.TestRuleIgnoreTestSuites$1.evaluate(TestRuleIgnoreTestSuites.java:55)
	at com.carrotsearch.randomizedtesting.rules.StatementAdapter.evaluate(StatementAdapter.java:36)
	at com.carrotsearch.randomizedtesting.ThreadLeakControl$StatementRunner.run(ThreadLeakControl.java:365)
	at java.lang.Thread.run(Thread.java:745)
Caused by: org.apache.solr.client.solrj.SolrServerException: IOException occured when talking to server at: http://127.0.0.1:43481/sk_s/g/repfacttest_c8n_1x3_shard1_replica2
	at org.apache.solr.client.solrj.impl.HttpSolrClient.executeMethod(HttpSolrClient.java:572)
	at org.apache.solr.client.solrj.impl.HttpSolrClient.request(HttpSolrClient.java:214)
	at org.apache.solr.client.solrj.impl.HttpSolrClient.request(HttpSolrClient.java:210)
	at org.apache.solr.client.solrj.impl.LBHttpSolrClient.doRequest(LBHttpSolrClient.java:370)
	at org.apache.solr.client.solrj.impl.LBHttpSolrClient.request(LBHttpSolrClient.java:325)
	at org.apache.solr.client.solrj.impl.CloudSolrClient.directUpdate(CloudSolrClient.java:572)
	... 48 more
Caused by: org.apache.http.NoHttpResponseException: The target server failed to respond
	at org.apache.http.impl.conn.DefaultHttpResponseParser.parseHead(DefaultHttpResponseParser.java:143)
	at org.apache.http.impl.conn.DefaultHttpResponseParser.parseHead(DefaultHttpResponseParser.java:57)
	at org.apache.http.impl.io.AbstractMessageParser.parse(AbstractMessageParser.java:260)
	at org.apache.http.impl.AbstractHttpClientConnection.receiveResponseHeader(AbstractHttpClientConnection.java:283)
	at org.apache.http.impl.conn.DefaultClientConnection.receiveResponseHeader(DefaultClientConnection.java:251)
	at org.apache.http.impl.conn.ManagedClientConnectionImpl.receiveResponseHeader(ManagedClientConnectionImpl.java:197)
	at org.apache.http.protocol.HttpRequestExecutor.doReceiveResponse(HttpRequestExecutor.java:271)
	at org.apache.http.protocol.HttpRequestExecutor.execute(HttpRequestExecutor.java:123)
	at org.apache.http.impl.client.DefaultRequestDirector.tryExecute(DefaultRequestDirector.java:682)
	at org.apache.http.impl.client.DefaultRequestDirector.execute(DefaultRequestDirector.java:486)
	at org.apache.http.impl.client.AbstractHttpClient.doExecute(AbstractHttpClient.java:863)
	at org.apache.http.impl.client.CloseableHttpClient.execute(CloseableHttpClient.java:82)
	at org.apache.http.impl.client.CloseableHttpClient.execute(CloseableHttpClient.java:106)
	at org.apache.http.impl.client.CloseableHttpClient.execute(CloseableHttpClient.java:57)
	at org.apache.solr.client.solrj.impl.HttpSolrClient.executeMethod(HttpSolrClient.java:464)
	... 53 more




Build Log:
[...truncated 9039 lines...]
   [junit4] Suite: org.apache.solr.cloud.ReplicationFactorTest
   [junit4]   2> log4j:WARN No such property [conversionPattern] in org.apache.solr.util.SolrLogLayout.
   [junit4]   2> Creating dataDir: /usr/home/jenkins/jenkins-slave/workspace/Lucene-Solr-Tests-5.x-Java7/solr/build/solr-core/test/J2/temp/solr.cloud.ReplicationFactorTest A96A216EF4FF9BC1-001/init-core-data-001
   [junit4]   2> 4420 T11 oas.BaseDistributedSearchTestCase.initHostContext Setting hostContext system property: /sk_s/g
   [junit4]   2> 4618 T11 oasc.ZkTestServer.run STARTING ZK TEST SERVER
   [junit4]   1> client port:0.0.0.0/0.0.0.0:0
   [junit4]   2> 4630 T12 oasc.ZkTestServer$ZKServerMain.runFromConfig Starting server
   [junit4]   2> 5031 T11 oasc.ZkTestServer.run start zk server on port:22635
   [junit4]   2> 5255 T11 oascc.SolrZkClient.createZkCredentialsToAddAutomatically Using default ZkCredentialsProvider
   [junit4]   2> 5582 T11 oascc.ConnectionManager.waitForConnected Waiting for client to connect to ZooKeeper
   [junit4]   2> 5872 T19 oascc.ConnectionManager.process Watcher org.apache.solr.common.cloud.ConnectionManager@4f957119 name:ZooKeeperConnection Watcher:127.0.0.1:22635 got event WatchedEvent state:SyncConnected type:None path:null path:null type:None
   [junit4]   2> 5873 T11 oascc.ConnectionManager.waitForConnected Client is connected to ZooKeeper
   [junit4]   2> 5897 T11 oascc.SolrZkClient.createZkACLProvider Using default ZkACLProvider
   [junit4]   2> 5917 T11 oascc.SolrZkClient.makePath makePath: /solr
   [junit4]   2> 6119 T11 oascc.SolrZkClient.createZkCredentialsToAddAutomatically Using default ZkCredentialsProvider
   [junit4]   2> 6120 T11 oascc.ConnectionManager.waitForConnected Waiting for client to connect to ZooKeeper
   [junit4]   2> 6123 T22 oascc.ConnectionManager.process Watcher org.apache.solr.common.cloud.ConnectionManager@c3b7044 name:ZooKeeperConnection Watcher:127.0.0.1:22635/solr got event WatchedEvent state:SyncConnected type:None path:null path:null type:None
   [junit4]   2> 6124 T11 oascc.ConnectionManager.waitForConnected Client is connected to ZooKeeper
   [junit4]   2> 6125 T11 oascc.SolrZkClient.createZkACLProvider Using default ZkACLProvider
   [junit4]   2> 6156 T11 oascc.SolrZkClient.makePath makePath: /collections/collection1
   [junit4]   2> 6163 T11 oascc.SolrZkClient.makePath makePath: /collections/collection1/shards
   [junit4]   2> 6168 T11 oascc.SolrZkClient.makePath makePath: /collections/control_collection
   [junit4]   2> 6171 T11 oascc.SolrZkClient.makePath makePath: /collections/control_collection/shards
   [junit4]   2> 6177 T11 oasc.AbstractZkTestCase.putConfig put /usr/home/jenkins/jenkins-slave/workspace/Lucene-Solr-Tests-5.x-Java7/solr/core/src/test-files/solr/collection1/conf/solrconfig-tlog.xml to /configs/conf1/solrconfig.xml
   [junit4]   2> 6245 T11 oascc.SolrZkClient.makePath makePath: /configs/conf1/solrconfig.xml
   [junit4]   2> 6253 T11 oasc.AbstractZkTestCase.putConfig put /usr/home/jenkins/jenkins-slave/workspace/Lucene-Solr-Tests-5.x-Java7/solr/core/src/test-files/solr/collection1/conf/schema.xml to /configs/conf1/schema.xml
   [junit4]   2> 6254 T11 oascc.SolrZkClient.makePath makePath: /configs/conf1/schema.xml
   [junit4]   2> 6359 T11 oasc.AbstractZkTestCase.putConfig put /usr/home/jenkins/jenkins-slave/workspace/Lucene-Solr-Tests-5.x-Java7/solr/core/src/test-files/solr/collection1/conf/solrconfig.snippet.randomindexconfig.xml to /configs/conf1/solrconfig.snippet.randomindexconfig.xml
   [junit4]   2> 6361 T11 oascc.SolrZkClient.makePath makePath: /configs/conf1/solrconfig.snippet.randomindexconfig.xml
   [junit4]   2> 6366 T11 oasc.AbstractZkTestCase.putConfig put /usr/home/jenkins/jenkins-slave/workspace/Lucene-Solr-Tests-5.x-Java7/solr/core/src/test-files/solr/collection1/conf/stopwords.txt to /configs/conf1/stopwords.txt
   [junit4]   2> 6367 T11 oascc.SolrZkClient.makePath makePath: /configs/conf1/stopwords.txt
   [junit4]   2> 6373 T11 oasc.AbstractZkTestCase.putConfig put /usr/home/jenkins/jenkins-slave/workspace/Lucene-Solr-Tests-5.x-Java7/solr/core/src/test-files/solr/collection1/conf/protwords.txt to /configs/conf1/protwords.txt
   [junit4]   2> 6374 T11 oascc.SolrZkClient.makePath makePath: /configs/conf1/protwords.txt
   [junit4]   2> 6379 T11 oasc.AbstractZkTestCase.putConfig put /usr/home/jenkins/jenkins-slave/workspace/Lucene-Solr-Tests-5.x-Java7/solr/core/src/test-files/solr/collection1/conf/currency.xml to /configs/conf1/currency.xml
   [junit4]   2> 6380 T11 oascc.SolrZkClient.makePath makePath: /configs/conf1/currency.xml
   [junit4]   2> 6385 T11 oasc.AbstractZkTestCase.putConfig put /usr/home/jenkins/jenkins-slave/workspace/Lucene-Solr-Tests-5.x-Java7/solr/core/src/test-files/solr/collection1/conf/enumsConfig.xml to /configs/conf1/enumsConfig.xml
   [junit4]   2> 6387 T11 oascc.SolrZkClient.makePath makePath: /configs/conf1/enumsConfig.xml
   [junit4]   2> 6392 T11 oasc.AbstractZkTestCase.putConfig put /usr/home/jenkins/jenkins-slave/workspace/Lucene-Solr-Tests-5.x-Java7/solr/core/src/test-files/solr/collection1/conf/open-exchange-rates.json to /configs/conf1/open-exchange-rates.json
   [junit4]   2> 6393 T11 oascc.SolrZkClient.makePath makePath: /configs/conf1/open-exchange-rates.json
   [junit4]   2> 6398 T11 oasc.AbstractZkTestCase.putConfig put /usr/home/jenkins/jenkins-slave/workspace/Lucene-Solr-Tests-5.x-Java7/solr/core/src/test-files/solr/collection1/conf/mapping-ISOLatin1Accent.txt to /configs/conf1/mapping-ISOLatin1Accent.txt
   [junit4]   2> 6399 T11 oascc.SolrZkClient.makePath makePath: /configs/conf1/mapping-ISOLatin1Accent.txt
   [junit4]   2> 6404 T11 oasc.AbstractZkTestCase.putConfig put /usr/home/jenkins/jenkins-slave/workspace/Lucene-Solr-Tests-5.x-Java7/solr/core/src/test-files/solr/collection1/conf/old_synonyms.txt to /configs/conf1/old_synonyms.txt
   [junit4]   2> 6406 T11 oascc.SolrZkClient.makePath makePath: /configs/conf1/old_synonyms.txt
   [junit4]   2> 6411 T11 oasc.AbstractZkTestCase.putConfig put /usr/home/jenkins/jenkins-slave/workspace/Lucene-Solr-Tests-5.x-Java7/solr/core/src/test-files/solr/collection1/conf/synonyms.txt to /configs/conf1/synonyms.txt
   [junit4]   2> 6412 T11 oascc.SolrZkClient.makePath makePath: /configs/conf1/synonyms.txt
   [junit4]   2> 10020 T11 oas.SolrTestCaseJ4.writeCoreProperties Writing core.properties file to /usr/home/jenkins/jenkins-slave/workspace/Lucene-Solr-Tests-5.x-Java7/solr/build/solr-core/test/J2/temp/solr.cloud.ReplicationFactorTest A96A216EF4FF9BC1-001/control-001/cores/collection1
   [junit4]   2> 11447 T11 oejs.Server.doStart jetty-8.1.10.v20130312
   [junit4]   2> 12182 T11 oejs.AbstractConnector.doStart Started SocketConnector@127.0.0.1:31919
   [junit4]   2> 12831 T11 oass.SolrDispatchFilter.init SolrDispatchFilter.init()sun.misc.Launcher$AppClassLoader@57bd06bf
   [junit4]   2> 13025 T11 oasc.SolrResourceLoader.locateSolrHome JNDI not configured for solr (NoInitialContextEx)
   [junit4]   2> 13025 T11 oasc.SolrResourceLoader.locateSolrHome using system property solr.solr.home: /usr/home/jenkins/jenkins-slave/workspace/Lucene-Solr-Tests-5.x-Java7/solr/build/solr-core/test/J2/temp/solr.cloud.ReplicationFactorTest A96A216EF4FF9BC1-001/control-001
   [junit4]   2> 13027 T11 oasc.SolrResourceLoader.<init> new SolrResourceLoader for directory: '/usr/home/jenkins/jenkins-slave/workspace/Lucene-Solr-Tests-5.x-Java7/solr/build/solr-core/test/J2/temp/solr.cloud.ReplicationFactorTest A96A216EF4FF9BC1-001/control-001/'
   [junit4]   2> 14606 T11 oasc.ConfigSolr.fromFile Loading container configuration from /usr/home/jenkins/jenkins-slave/workspace/Lucene-Solr-Tests-5.x-Java7/solr/build/solr-core/test/J2/temp/solr.cloud.ReplicationFactorTest A96A216EF4FF9BC1-001/control-001/solr.xml
   [junit4]   2> 14984 T11 oasc.CorePropertiesLocator.<init> Config-defined core root directory: /usr/home/jenkins/jenkins-slave/workspace/Lucene-Solr-Tests-5.x-Java7/solr/build/solr-core/test/J2/temp/solr.cloud.ReplicationFactorTest A96A216EF4FF9BC1-001/control-001/cores
   [junit4]   2> 15057 T11 oasc.CoreContainer.<init> New CoreContainer 537423620
   [junit4]   2> 15058 T11 oasc.CoreContainer.load Loading cores into CoreContainer [instanceDir=/usr/home/jenkins/jenkins-slave/workspace/Lucene-Solr-Tests-5.x-Java7/solr/build/solr-core/test/J2/temp/solr.cloud.ReplicationFactorTest A96A216EF4FF9BC1-001/control-001/]
   [junit4]   2> 15364 T11 oashc.HttpShardHandlerFactory.getParameter Setting socketTimeout to: 90000
   [junit4]   2> 15365 T11 oashc.HttpShardHandlerFactory.getParameter Setting urlScheme to: 
   [junit4]   2> 15377 T11 oashc.HttpShardHandlerFactory.getParameter Setting connTimeout to: 15000
   [junit4]   2> 15378 T11 oashc.HttpShardHandlerFactory.getParameter Setting maxConnectionsPerHost to: 20
   [junit4]   2> 15378 T11 oashc.HttpShardHandlerFactory.getParameter Setting maxConnections to: 10000
   [junit4]   2> 15379 T11 oashc.HttpShardHandlerFactory.getParameter Setting corePoolSize to: 0
   [junit4]   2> 15380 T11 oashc.HttpShardHandlerFactory.getParameter Setting maximumPoolSize to: 2147483647
   [junit4]   2> 15380 T11 oashc.HttpShardHandlerFactory.getParameter Setting maxThreadIdleTime to: 5
   [junit4]   2> 15381 T11 oashc.HttpShardHandlerFactory.getParameter Setting sizeOfQueue to: -1
   [junit4]   2> 15382 T11 oashc.HttpShardHandlerFactory.getParameter Setting fairnessPolicy to: false
   [junit4]   2> 15382 T11 oashc.HttpShardHandlerFactory.getParameter Setting useRetries to: false
   [junit4]   2> 16238 T11 oasu.UpdateShardHandler.<init> Creating UpdateShardHandler HTTP client with params: socketTimeout=340000&connTimeout=45000&retry=true
   [junit4]   2> 16265 T11 oasl.LogWatcher.createWatcher SLF4J impl is org.slf4j.impl.Log4jLoggerFactory
   [junit4]   2> 16275 T11 oasl.LogWatcher.newRegisteredLogWatcher Registering Log Listener [Log4j (org.slf4j.impl.Log4jLoggerFactory)]
   [junit4]   2> 16287 T11 oasc.CoreContainer.load Host Name: 127.0.0.1
   [junit4]   2> 16288 T11 oasc.ZkContainer.initZooKeeper Zookeeper client=127.0.0.1:22635/solr
   [junit4]   2> 16361 T11 oasc.ZkController.checkChrootPath zkHost includes chroot
   [junit4]   2> 16362 T11 oascc.SolrZkClient.createZkCredentialsToAddAutomatically Using default ZkCredentialsProvider
   [junit4]   2> 16363 T11 oascc.ConnectionManager.waitForConnected Waiting for client to connect to ZooKeeper
   [junit4]   2> 16368 T35 oascc.ConnectionManager.process Watcher org.apache.solr.common.cloud.ConnectionManager@4347154c name:ZooKeeperConnection Watcher:127.0.0.1:22635 got event WatchedEvent state:SyncConnected type:None path:null path:null type:None
   [junit4]   2> 16369 T11 oascc.ConnectionManager.waitForConnected Client is connected to ZooKeeper
   [junit4]   2> 16371 T11 oascc.SolrZkClient.createZkACLProvider Using default ZkACLProvider
   [junit4]   2> 16406 T11 oascc.ConnectionManager.waitForConnected Waiting for client to connect to ZooKeeper
   [junit4]   2> 16409 T38 oascc.ConnectionManager.process Watcher org.apache.solr.common.cloud.ConnectionManager@3787f275 name:ZooKeeperConnection Watcher:127.0.0.1:22635/solr got event WatchedEvent state:SyncConnected type:None path:null path:null type:None
   [junit4]   2> 16410 T11 oascc.ConnectionManager.waitForConnected Client is connected to ZooKeeper
   [junit4]   2> 16432 T11 oascc.SolrZkClient.makePath makePath: /overseer/queue
   [junit4]   2> 16455 T11 oascc.SolrZkClient.makePath makePath: /overseer/collection-queue-work
   [junit4]   2> 16468 T11 oascc.SolrZkClient.makePath makePath: /overseer/collection-map-running
   [junit4]   2> 16474 T11 oascc.SolrZkClient.makePath makePath: /overseer/collection-map-completed
   [junit4]   2> 16480 T11 oascc.SolrZkClient.makePath makePath: /overseer/collection-map-failure
   [junit4]   2> 16515 T11 oascc.SolrZkClient.makePath makePath: /live_nodes
   [junit4]   2> 16518 T11 oasc.ZkController.createEphemeralLiveNode Register node as live in ZooKeeper:/live_nodes/127.0.0.1:43481_sk_s%2Fg
   [junit4]   2> 16531 T11 oascc.SolrZkClient.makePath makePath: /live_nodes/127.0.0.1:43481_sk_s%2Fg
   [junit4]   2> 16537 T11 oascc.SolrZkClient.makePath makePath: /overseer_elect
   [junit4]   2> 16541 T11 oascc.SolrZkClient.makePath makePath: /overseer_elect/election
   [junit4]   2> 16544 T11 oasc.Overseer.close Overseer (id=null) closing
   [junit4]   2> 16580 T11 oasc.OverseerElectionContext.runLeaderProcess I am going to be the leader 127.0.0.1:43481_sk_s%2Fg
   [junit4]   2> 16581 T11 oascc.SolrZkClient.makePath makePath: /overseer_elect/leader
   [junit4]   2> 16587 T11 oasc.Overseer.start Overseer (id=93267920958586883-127.0.0.1:43481_sk_s%2Fg-n_0000000000) starting
   [junit4]   2> 16624 T11 oascc.SolrZkClient.makePath makePath: /overseer/queue-work
   [junit4]   2> 16862 T11 oasc.OverseerAutoReplicaFailoverThread.<init> Starting OverseerAutoReplicaFailoverThread autoReplicaFailoverWorkLoopDelay=10000 autoReplicaFailoverWaitAfterExpiration=30000 autoReplicaFailoverBadNodeExpiration=60000
   [junit4]   2> 17832 T40 oasc.OverseerCollectionProcessor.run Process current queue of collection creations
   [junit4]   2> 17834 T11 oascc.SolrZkClient.makePath makePath: /clusterstate.json
   [junit4]   2> 17840 T11 oascc.SolrZkClient.makePath makePath: /aliases.json
   [junit4]   2> 17844 T11 oascc.ZkStateReader.createClusterStateWatchersAndUpdate Updating cluster state from ZooKeeper... 
   [junit4]   2> 18103 T39 oasc.Overseer$ClusterStateUpdater.run Starting to work on the main queue
   [junit4]   2> 18442 T11 oasc.CorePropertiesLocator.discover Looking for core definitions underneath /usr/home/jenkins/jenkins-slave/workspace/Lucene-Solr-Tests-5.x-Java7/solr/build/solr-core/test/J2/temp/solr.cloud.ReplicationFactorTest A96A216EF4FF9BC1-001/control-001/cores
   [junit4]   2> 18696 T11 oasc.CorePropertiesLocator.discoverUnder Found core collection1 in /usr/home/jenkins/jenkins-slave/workspace/Lucene-Solr-Tests-5.x-Java7/solr/build/solr-core/test/J2/temp/solr.cloud.ReplicationFactorTest A96A216EF4FF9BC1-001/control-001/cores/collection1/
   [junit4]   2> 18697 T11 oasc.CorePropertiesLocator.discover Found 1 core definitions
   [junit4]   2> 18708 T42 oasc.ZkController.publish publishing core=collection1 state=down collection=control_collection
   [junit4]   2> 18709 T42 oasc.ZkController.publish numShards not found on descriptor - reading it from system property
   [junit4]   2> 18736 T38 oasc.DistributedQueue$LatchWatcher.process NodeChildrenChanged fired on path /overseer/queue state SyncConnected
   [junit4]   2> 18736 T42 oasc.ZkController.waitForCoreNodeName look for our core node name
   [junit4]   2> 18750 T39 oasc.Overseer$ClusterStateUpdater.run processMessage: queueSize: 0, message = {
   [junit4]   2> 	  "base_url":"http://127.0.0.1:43481/sk_s/g",
   [junit4]   2> 	  "operation":"state",
   [junit4]   2> 	  "roles":null,
   [junit4]   2> 	  "state":"down",
   [junit4]   2> 	  "numShards":"1",
   [junit4]   2> 	  "core":"collection1",
   [junit4]   2> 	  "collection":"control_collection",
   [junit4]   2> 	  "shard":null,
   [junit4]   2> 	  "node_name":"127.0.0.1:43481_sk_s%2Fg"} current state version: 0
   [junit4]   2> 18813 T39 oasco.ReplicaMutator.updateState Update state numShards=1 message={
   [junit4]   2> 	  "base_url":"http://127.0.0.1:43481/sk_s/g",
   [junit4]   2> 	  "operation":"state",
   [junit4]   2> 	  "roles":null,
   [junit4]   2> 	  "state":"down",
   [junit4]   2> 	  "numShards":"1",
   [junit4]   2> 	  "core":"collection1",
   [junit4]   2> 	  "collection":"control_collection",
   [junit4]   2> 	  "shard":null,
   [junit4]   2> 	  "node_name":"127.0.0.1:43481_sk_s%2Fg"}
   [junit4]   2> 18821 T39 oasco.ClusterStateMutator.createCollection building a new cName: control_collection
   [junit4]   2> 18874 T39 oasco.ReplicaMutator.updateState Assigning new node to shard shard=shard1
   [junit4]   2> 18896 T38 oascc.ZkStateReader$2.process A cluster state change: WatchedEvent state:SyncConnected type:NodeDataChanged path:/clusterstate.json, has occurred - updating... (live nodes size: 1)
   [junit4]   2> 19738 T42 oasc.ZkController.waitForShardId waiting to find shard id in clusterstate for collection1
   [junit4]   2> 19739 T42 oasc.ZkController.createCollectionZkNode Check for collection zkNode:control_collection
   [junit4]   2> 19740 T42 oasc.ZkController.createCollectionZkNode Collection zkNode exists
   [junit4]   2> 19741 T42 oascc.ZkStateReader.readConfigName Load collection config from:/collections/control_collection
   [junit4]   2> 19743 T42 oascc.ZkStateReader.readConfigName path=/collections/control_collection configName=conf1 specified config exists in ZooKeeper
   [junit4]   2> 19753 T42 oasc.SolrResourceLoader.<init> new SolrResourceLoader for directory: '/usr/home/jenkins/jenkins-slave/workspace/Lucene-Solr-Tests-5.x-Java7/solr/build/solr-core/test/J2/temp/solr.cloud.ReplicationFactorTest A96A216EF4FF9BC1-001/control-001/cores/collection1/'
   [junit4]   2> 19831 T42 oasc.ZkController.watchZKConfDir watch zkdir /configs/conf1
   [junit4]   2> 19983 T42 oasc.Config.<init> loaded config solrconfig.xml with version 0 
   [junit4]   2> 20083 T42 oasc.SolrConfig.refreshRequestParams current version of requestparams : -1
   [junit4]   2> 20276 T42 oasc.SolrConfig.<init> Using Lucene MatchVersion: 5.1.0
   [junit4]   2> 20664 T42 oasc.SolrConfig.<init> Loaded SolrConfig: solrconfig.xml
   [junit4]   2> 20819 T42 oass.IndexSchema.readSchema Reading Solr Schema from /configs/conf1/schema.xml
   [junit4]   2> 21017 T42 oass.IndexSchema.readSchema [collection1] Schema name=test
   [junit4]   2> 24041 T42 oass.OpenExchangeRatesOrgProvider.init Initialized with rates=open-exchange-rates.json, refreshInterval=1440.
   [junit4]   2> 24158 T42 oass.IndexSchema.readSchema default search field in schema is text
   [junit4]   2> 24163 T42 oass.IndexSchema.readSchema unique key field: id
   [junit4]   2> 25999 T42 oass.FileExchangeRateProvider.reload Reloading exchange rates from file currency.xml
   [junit4]   2> 26040 T42 oass.FileExchangeRateProvider.reload Reloading exchange rates from file currency.xml
   [junit4]   2> 26048 T42 oass.OpenExchangeRatesOrgProvider.reload Reloading exchange rates from open-exchange-rates.json
   [junit4]   2> 26057 T42 oass.OpenExchangeRatesOrgProvider$OpenExchangeRates.<init> WARN Unknown key IMPORTANT NOTE
   [junit4]   2> 26058 T42 oass.OpenExchangeRatesOrgProvider$OpenExchangeRates.<init> WARN Expected key, got STRING
   [junit4]   2> 26059 T42 oass.OpenExchangeRatesOrgProvider.reload Reloading exchange rates from open-exchange-rates.json
   [junit4]   2> 26060 T42 oass.OpenExchangeRatesOrgProvider$OpenExchangeRates.<init> WARN Unknown key IMPORTANT NOTE
   [junit4]   2> 26061 T42 oass.OpenExchangeRatesOrgProvider$OpenExchangeRates.<init> WARN Expected key, got STRING
   [junit4]   2> 26089 T42 oasc.CoreContainer.create Creating SolrCore 'collection1' using configuration from collection control_collection
   [junit4]   2> 26465 T42 oasc.SolrCore.initDirectoryFactory org.apache.solr.core.MockDirectoryFactory
   [junit4]   2> 26505 T42 oasc.SolrCore.<init> [collection1] Opening new SolrCore at /usr/home/jenkins/jenkins-slave/workspace/Lucene-Solr-Tests-5.x-Java7/solr/build/solr-core/test/J2/temp/solr.cloud.ReplicationFactorTest A96A216EF4FF9BC1-001/control-001/cores/collection1/, dataDir=/usr/home/jenkins/jenkins-slave/workspace/Lucene-Solr-Tests-5.x-Java7/solr/build/solr-core/test/J2/temp/solr.cloud.ReplicationFactorTest A96A216EF4FF9BC1-001/tempDir-001/control/data/
   [junit4]   2> 26523 T42 oasc.JmxMonitoredMap.<init> JMX monitoring is enabled. Adding Solr mbeans to JMX Server: com.sun.jmx.mbeanserver.JmxMBeanServer@42b097da
   [junit4]   2> 26970 T42 oasc.CachingDirectoryFactory.get return new directory for /usr/home/jenkins/jenkins-slave/workspace/Lucene-Solr-Tests-5.x-Java7/solr/build/solr-core/test/J2/temp/solr.cloud.ReplicationFactorTest A96A216EF4FF9BC1-001/tempDir-001/control/data
   [junit4]   2> 26971 T42 oasc.SolrCore.getNewIndexDir New index directory detected: old=null new=/usr/home/jenkins/jenkins-slave/workspace/Lucene-Solr-Tests-5.x-Java7/solr/build/solr-core/test/J2/temp/solr.cloud.ReplicationFactorTest A96A216EF4FF9BC1-001/tempDir-001/control/data/index/
   [junit4]   2> 26971 T42 oasc.SolrCore.initIndex WARN [collection1] Solr index directory '/usr/home/jenkins/jenkins-slave/workspace/Lucene-Solr-Tests-5.x-Java7/solr/build/solr-core/test/J2/temp/solr.cloud.ReplicationFactorTest A96A216EF4FF9BC1-001/tempDir-001/control/data/index' doesn't exist. Creating new index...
   [junit4]   2> 27005 T42 oasc.CachingDirectoryFactory.get return new directory for /usr/home/jenkins/jenkins-slave/workspace/Lucene-Solr-Tests-5.x-Java7/solr/build/solr-core/test/J2/temp/solr.cloud.ReplicationFactorTest A96A216EF4FF9BC1-001/tempDir-001/control/data/index
   [junit4]   2> 27008 T42 oasu.RandomMergePolicy.<init> RandomMergePolicy wrapping class org.apache.lucene.index.TieredMergePolicy: [TieredMergePolicy: maxMergeAtOnce=44, maxMergeAtOnceExplicit=50, maxMergedSegmentMB=9.0712890625, floorSegmentMB=2.115234375, forceMergeDeletesPctAllowed=18.809905461425313, segmentsPerTier=22.0, maxCFSSegmentSizeMB=8.796093022207999E12, noCFSRatio=0.0
   [junit4]   2> 27413 T42 oasc.SolrDeletionPolicy.onCommit SolrDeletionPolicy.onCommit: commits: num=1
   [junit4]   2> 		commit{dir=MockDirectoryWrapper(RAMDirectory@12da22e9 lockFactory=org.apache.lucene.store.SingleInstanceLockFactory@2f29f8aa),segFN=segments_1,generation=1}
   [junit4]   2> 27420 T42 oasc.SolrDeletionPolicy.updateCommits newest commit generation = 1
   [junit4]   2> 29469 T42 oasup.UpdateRequestProcessorChain.init creating updateRequestProcessorChain "nodistrib"
   [junit4]   2> 29699 T42 oasup.UpdateRequestProcessorChain.init creating updateRequestProcessorChain "dedupe"
   [junit4]   2> 29736 T42 oasup.UpdateRequestProcessorChain.init inserting DistributedUpdateProcessorFactory into updateRequestProcessorChain "dedupe"
   [junit4]   2> 29736 T42 oasup.UpdateRequestProcessorChain.init creating updateRequestProcessorChain "stored_sig"
   [junit4]   2> 29737 T42 oasup.UpdateRequestProcessorChain.init inserting DistributedUpdateProcessorFactory into updateRequestProcessorChain "stored_sig"
   [junit4]   2> 29737 T42 oasup.UpdateRequestProcessorChain.init creating updateRequestProcessorChain "distrib-dup-test-chain-explicit"
   [junit4]   2> 29975 T42 oasup.UpdateRequestProcessorChain.init creating updateRequestProcessorChain "distrib-dup-test-chain-implicit"
   [junit4]   2> 29976 T42 oasup.UpdateRequestProcessorChain.init inserting DistributedUpdateProcessorFactory into updateRequestProcessorChain "distrib-dup-test-chain-implicit"
   [junit4]   2> 29977 T42 oasc.SolrCore.loadUpdateProcessorChains no updateRequestProcessorChain defined as default, creating implicit default
   [junit4]   2> 30146 T42 oasc.RequestHandlers.initHandlersFromConfig created /update: org.apache.solr.handler.UpdateRequestHandler
   [junit4]   2> 30147 T42 oasc.RequestHandlers.initHandlersFromConfig created /update/json: org.apache.solr.handler.UpdateRequestHandler
   [junit4]   2> 30148 T42 oasc.RequestHandlers.initHandlersFromConfig created /update/csv: org.apache.solr.handler.UpdateRequestHandler
   [junit4]   2> 30150 T42 oasc.RequestHandlers.initHandlersFromConfig created /update/json/docs: org.apache.solr.handler.UpdateRequestHandler
   [junit4]   2> 30152 T42 oasc.RequestHandlers.initHandlersFromConfig created /config: org.apache.solr.handler.SolrConfigHandler
   [junit4]   2> 30153 T42 oasc.RequestHandlers.initHandlersFromConfig created /schema: org.apache.solr.handler.SchemaHandler
   [junit4]   2> 30201 T42 oasc.RequestHandlers.initHandlersFromConfig created /replication: org.apache.solr.handler.ReplicationHandler
   [junit4]   2> 30212 T42 oasc.RequestHandlers.initHandlersFromConfig created /get: org.apache.solr.handler.RealTimeGetHandler
   [junit4]   2> 30215 T42 oasc.RequestHandlers.initHandlersFromConfig created /admin/luke: org.apache.solr.handler.admin.LukeRequestHandler
   [junit4]   2> 30217 T42 oasc.RequestHandlers.initHandlersFromConfig created /admin/system: org.apache.solr.handler.admin.SystemInfoHandler
   [junit4]   2> 30219 T42 oasc.RequestHandlers.initHandlersFromConfig created /admin/mbeans: org.apache.solr.handler.admin.SolrInfoMBeanHandler
   [junit4]   2> 30220 T42 oasc.RequestHandlers.initHandlersFromConfig created /admin/plugins: org.apache.solr.handler.admin.PluginInfoHandler
   [junit4]   2> 30222 T42 oasc.RequestHandlers.initHandlersFromConfig created /admin/threads: org.apache.solr.handler.admin.ThreadDumpHandler
   [junit4]   2> 30223 T42 oasc.RequestHandlers.initHandlersFromConfig created /admin/properties: org.apache.solr.handler.admin.PropertiesRequestHandler
   [junit4]   2> 30225 T42 oasc.RequestHandlers.initHandlersFromConfig created /admin/logging: org.apache.solr.handler.admin.LoggingHandler
   [junit4]   2> 30226 T42 oasc.RequestHandlers.initHandlersFromConfig created /admin/ping: org.apache.solr.handler.PingRequestHandler
   [junit4]   2> 30278 T42 oasc.RequestHandlers.initHandlersFromConfig created standard: solr.StandardRequestHandler
   [junit4]   2> 30346 T42 oasc.RequestHandlers.initHandlersFromConfig created /admin/file: solr.admin.ShowFileRequestHandler
   [junit4]   2> 30673 T42 oashl.XMLLoader.init xsltCacheLifetimeSeconds=60
   [junit4]   2> 30722 T42 oashl.XMLLoader.init xsltCacheLifetimeSeconds=60
   [junit4]   2> 30725 T42 oashl.XMLLoader.init xsltCacheLifetimeSeconds=60
   [junit4]   2> 30727 T42 oashl.XMLLoader.init xsltCacheLifetimeSeconds=60
   [junit4]   2> 30738 T42 oasc.SolrCore.initStatsCache Using default statsCache cache: org.apache.solr.search.stats.LocalStatsCache
   [junit4]   2> 30944 T42 oasu.CommitTracker.<init> Hard AutoCommit: disabled
   [junit4]   2> 30944 T42 oasu.CommitTracker.<init> Soft AutoCommit: disabled
   [junit4]   2> 30946 T42 oasu.RandomMergePolicy.<init> RandomMergePolicy wrapping class org.apache.lucene.index.LogByteSizeMergePolicy: [LogByteSizeMergePolicy: minMergeSize=1677721, mergeFactor=45, maxMergeSize=2147483648, maxMergeSizeForForcedMerge=9223372036854775807, calibrateSizeByDeletes=true, maxMergeDocs=2147483647, maxCFSSegmentSizeMB=8.796093022207999E12, noCFSRatio=1.0]
   [junit4]   2> 30966 T42 oasc.SolrDeletionPolicy.onInit SolrDeletionPolicy.onInit: commits: num=1
   [junit4]   2> 		commit{dir=MockDirectoryWrapper(RAMDirectory@12da22e9 lockFactory=org.apache.lucene.store.SingleInstanceLockFactory@2f29f8aa),segFN=segments_1,generation=1}
   [junit4]   2> 30966 T42 oasc.SolrDeletionPolicy.updateCommits newest commit generation = 1
   [junit4]   2> 31147 T42 oass.SolrIndexSearcher.<init> Opening Searcher@150135c8[collection1] main
   [junit4]   2> 31235 T42 oascc.ZkStateReader.readConfigName Load collection config from:/collections/control_collection
   [junit4]   2> 31238 T42 oascc.ZkStateReader.readConfigName path=/collections/control_collection configName=conf1 specified config exists in ZooKeeper
   [junit4]   2> 31238 T42 oasr.ManagedResourceStorage.newStorageIO Setting up ZooKeeper-based storage for the RestManager with znodeBase: /configs/conf1
   [junit4]   2> 31268 T42 oasr.ManagedResourceStorage$ZooKeeperStorageIO.configure Configured ZooKeeperStorageIO with znodeBase: /configs/conf1
   [junit4]   2> 31269 T42 oasr.RestManager.init Initializing RestManager with initArgs: {}
   [junit4]   2> 31482 T42 oasr.ManagedResourceStorage.load Reading _rest_managed.json using ZooKeeperStorageIO:path=/configs/conf1
   [junit4]   2> 31484 T42 oasr.ManagedResourceStorage$ZooKeeperStorageIO.openInputStream No data found for znode /configs/conf1/_rest_managed.json
   [junit4]   2> 31485 T42 oasr.ManagedResourceStorage.load Loaded null at path _rest_managed.json using ZooKeeperStorageIO:path=/configs/conf1
   [junit4]   2> 31486 T42 oasr.RestManager.init Initializing 0 registered ManagedResources
   [junit4]   2> 31818 T42 oash.ReplicationHandler.inform Commits will be reserved for  10000
   [junit4]   2> 31833 T43 oasc.SolrCore.registerSearcher [collection1] Registered new searcher Searcher@150135c8[collection1] main{ExitableDirectoryReader(UninvertingDirectoryReader())}
   [junit4]   2> 31845 T42 oasc.CoreContainer.registerCore registering core: collection1
   [junit4]   2> 31856 T46 oasc.ZkController.register Register replica - core:collection1 address:http://127.0.0.1:43481/sk_s/g collection:control_collection shard:shard1
   [junit4]   2> 31857 T11 oass.SolrDispatchFilter.init user.dir=/usr/home/jenkins/jenkins-slave/workspace/Lucene-Solr-Tests-5.x-Java7/solr/build/solr-core/test/J2
   [junit4]   2> 31858 T11 oass.SolrDispatchFilter.init SolrDispatchFilter.init() done
   [junit4]   2> 31918 T46 oascc.SolrZkClient.makePath makePath: /collections/control_collection/leader_elect/shard1/election
   [junit4]   2> 31930 T46 oasc.ShardLeaderElectionContext.runLeaderProcess Running the leader process for shard shard1
   [junit4]   2> 31934 T38 oasc.DistributedQueue$LatchWatcher.process NodeChildrenChanged fired on path /overseer/queue state SyncConnected
   [junit4]   2> 31935 T46 oasc.ShardLeaderElectionContext.waitForReplicasToComeUp Enough replicas found to continue.
   [junit4]   2> 31936 T46 oasc.ShardLeaderElectionContext.runLeaderProcess I may be the new leader - try and sync
   [junit4]   2> 31937 T39 oasc.Overseer$ClusterStateUpdater.run processMessage: queueSize: 1, message = {
   [junit4]   2> 	  "operation":"leader",
   [junit4]   2> 	  "shard":"shard1",
   [junit4]   2> 	  "collection":"control_collection"} current state version: 1
   [junit4]   2> ASYNC  NEW_CORE C0 name=collection1 org.apache.solr.core.SolrCore@724af92e url=http://127.0.0.1:43481/sk_s/g/collection1 node=127.0.0.1:43481_sk_s%2Fg C0_STATE=coll:control_collection core:collection1 props:{base_url=http://127.0.0.1:43481/sk_s/g, state=down, core=collection1, node_name=127.0.0.1:43481_sk_s%2Fg}
   [junit4]   2> 31967 T46 C0 P43481 oasc.SyncStrategy.sync Sync replicas to http://127.0.0.1:43481/sk_s/g/collection1/
   [junit4]   2> 31970 T38 oascc.ZkStateReader$2.process A cluster state change: WatchedEvent state:SyncConnected type:NodeDataChanged path:/clusterstate.json, has occurred - updating... (live nodes size: 1)
   [junit4]   2> 31978 T46 C0 P43481 oasc.SyncStrategy.syncReplicas Sync Success - now sync replicas to me
   [junit4]   2> 31980 T46 C0 P43481 oasc.SyncStrategy.syncToMe http://127.0.0.1:43481/sk_s/g/collection1/ has no replicas
   [junit4]   2> 31980 T46 oasc.ShardLeaderElectionContext.runLeaderProcess I am the new leader: http://127.0.0.1:43481/sk_s/g/collection1/ shard1
   [junit4]   2> 32003 T46 oascc.SolrZkClient.makePath makePath: /collections/control_collection/leaders/shard1
   [junit4]   2> 32013 T48 oasc.DistributedQueue$LatchWatcher.process NodeChildrenChanged fired on path /overseer/queue state SyncConnected
   [junit4]   2> 32016 T39 oasc.Overseer$ClusterStateUpdater.run processMessage: queueSize: 1, message = {
   [junit4]   2> 	  "operation":"leader",
   [junit4]   2> 	  "shard":"shard1",
   [junit4]   2> 	  "collection":"control_collection",
   [junit4]   2> 	  "base_url":"http://127.0.0.1:43481/sk_s/g",
   [junit4]   2> 	  "core":"collection1",
   [junit4]   2> 	  "state":"active"} current state version: 2
   [junit4]   2> 32051 T11 oascc.SolrZkClient.createZkCredentialsToAddAutomatically Using default ZkCredentialsProvider
   [junit4]   2> 32053 T11 oascc.ConnectionManager.waitForConnected Waiting for client to connect to ZooKeeper
   [junit4]   2> 32055 T51 oascc.ConnectionManager.process Watcher org.apache.solr.common.cloud.ConnectionManager@c0c4929 name:ZooKeeperConnection Watcher:127.0.0.1:22635/solr got event WatchedEvent state:SyncConnected type:None path:null path:null type:None
   [junit4]   2> 32056 T11 oascc.ConnectionManager.waitForConnected Client is connected to ZooKeeper
   [junit4]   2> 32057 T11 oascc.SolrZkClient.createZkACLProvider Using default ZkACLProvider
   [junit4]   2> 32060 T11 oascc.ZkStateReader.createClusterStateWatchersAndUpdate Updating cluster state from ZooKeeper... 
   [junit4]   2> 32070 T11 oasc.ChaosMonkey.monkeyLog monkey: init - expire sessions:false cause connection loss:false
   [junit4]   2> 32071 T11 oasc.AbstractFullDistribZkTestBase.createJettys Creating collection1 with stateFormat=2
   [junit4]   2> 32072 T11 oascc.SolrZkClient.createZkCredentialsToAddAutomatically Using default ZkCredentialsProvider
   [junit4]   2> 32073 T11 oascc.ConnectionManager.waitForConnected Waiting for client to connect to ZooKeeper
   [junit4]   2> 32075 T54 oascc.ConnectionManager.process Watcher org.apache.solr.common.cloud.ConnectionManager@42838d2a name:ZooKeeperConnection Watcher:127.0.0.1:22635/solr got event WatchedEvent state:SyncConnected type:None path:null path:null type:None
   [junit4]   2> 32076 T11 oascc.ConnectionManager.waitForConnected Client is connected to ZooKeeper
   [junit4]   2> 32077 T11 oascc.SolrZkClient.createZkACLProvider Using default ZkACLProvider
   [junit4]   2> 32080 T48 oasc.DistributedQueue$LatchWatcher.process NodeChildrenChanged fired on path /overseer/queue state SyncConnected
   [junit4]   2> 32083 T39 oasc.Overseer$ClusterStateUpdater.run processMessage: queueSize: 1, message = {
   [junit4]   2> 	  "operation":"create",
   [junit4]   2> 	  "name":"collection1",
   [junit4]   2> 	  "numShards":"3",
   [junit4]   2> 	  "stateFormat":"2"} current state version: 2
   [junit4]   2> 32084 T39 oasco.ClusterStateMutator.createCollection building a new cName: collection1
   [junit4]   2> 32086 T51 oascc.ZkStateReader$2.process A cluster state change: WatchedEvent state:SyncConnected type:NodeDataChanged path:/clusterstate.json, has occurred - updating... (live nodes size: 1)
   [junit4]   2> 32197 T39 oasco.ZkStateWriter.writePendingUpdates going to create_collection /collections/collection1/state.json
   [junit4]   2> 32200 T51 oascc.ZkStateReader$2.process A cluster state change: WatchedEvent state:SyncConnected type:NodeDataChanged path:/clusterstate.json, has occurred - updating... (live nodes size: 1)
   [junit4]   2> 32218 T46 oasc.ZkController.register We are http://127.0.0.1:43481/sk_s/g/collection1/ and leader is http://127.0.0.1:43481/sk_s/g/collection1/
   [junit4]   2> 32230 T46 oasc.ZkController.register No LogReplay needed for core=collection1 baseURL=http://127.0.0.1:43481/sk_s/g
   [junit4]   2> 32231 T46 oasc.ZkController.checkRecovery I am the leader, no recovery necessary
   [junit4]   2> 32231 T46 oasc.ZkController.publish publishing core=collection1 state=active collection=control_collection
   [junit4]   2> 32232 T46 oasc.ZkController.publish numShards not found on descriptor - reading it from system property
   [junit4]   2> 32235 T38 oasc.DistributedQueue$LatchWatcher.process NodeChildrenChanged fired on path /overseer/queue state SyncConnected
   [junit4]   2> 32240 T39 oasc.Overseer$ClusterStateUpdater.run processMessage: queueSize: 1, message = {
   [junit4]   2> 	  "core_node_name":"core_node1",
   [junit4]   2> 	  "base_url":"http://127.0.0.1:43481/sk_s/g",
   [junit4]   2> 	  "operation":"state",
   [junit4]   2> 	  "roles":null,
   [junit4]   2> 	  "state":"active",
   [junit4]   2> 	  "numShards":"3",
   [junit4]   2> 	  "core":"collection1",
   [junit4]   2> 	  "collection":"control_collection",
   [junit4]   2> 	  "shard":"shard1",
   [junit4]   2> 	  "node_name":"127.0.0.1:43481_sk_s%2Fg"} current state version: 4
   [junit4]   2> 32241 T39 oasco.ReplicaMutator.updateState Update state numShards=3 message={
   [junit4]   2> 	  "core_node_name":"core_node1",
   [junit4]   2> 	  "base_url":"http://127.0.0.1:43481/sk_s/g",
   [junit4]   2> 	  "operation":"state",
   [junit4]   2> 	  "roles":null,
   [junit4]   2> 	  "state":"active",
   [junit4]   2> 	  "numShards":"3",
   [junit4]   2> 	  "core":"collection1",
   [junit4]   2> 	  "collection":"control_collection",
   [junit4]   2> 	  "shard":"shard1",
   [junit4]   2> 	  "node_name":"127.0.0.1:43481_sk_s%2Fg"}
   [junit4]   2> 32349 T51 oascc.ZkStateReader$2.process A cluster state change: WatchedEvent state:SyncConnected type:NodeDataChanged path:/clusterstate.json, has occurred - updating... (live nodes size: 1)
   [junit4]   2> 32349 T38 oascc.ZkStateReader$2.process A cluster state change: WatchedEvent state:SyncConnected type:NodeDataChanged path:/clusterstate.json, has occurred - updating... (live nodes size: 1)
   [junit4]   2> 33591 T11 oas.SolrTestCaseJ4.writeCoreProperties Writing core.properties file to /usr/home/jenkins/jenkins-slave/workspace/Lucene-Solr-Tests-5.x-Java7/solr/build/solr-core/test/J2/temp/solr.cloud.ReplicationFactorTest A96A216EF4FF9BC1-001/shard-1-001/cores/collection1
   [junit4]   2> 33594 T11 oasc.AbstractFullDistribZkTestBase.createJettys create jetty 1
   [junit4]   2> 33595 T11 oejs.Server.doStart jetty-8.1.10.v20130312
   [junit4]   2> 33597 T11 oejs.AbstractConnector.doStart Started SocketConnector@127.0.0.1:48478
   [junit4]   2> 33598 T11 oass.SolrDispatchFilter.init SolrDispatchFilter.init()sun.misc.Launcher$AppClassLoader@57bd06bf
   [junit4]   2> 33599 T11 oasc.SolrResourceLoader.locateSolrHome JNDI not configured for solr (NoInitialContextEx)
   [junit4]   2> 33599 T11 oasc.SolrResourceLoader.locateSolrHome using system property solr.solr.home: /usr/home/jenkins/jenkins-slave/workspace/Lucene-Solr-Tests-5.x-Java7/solr/build/solr-core/test/J2/temp/solr.cloud.ReplicationFactorTest A96A216EF4FF9BC1-001/shard-1-001
   [junit4]   2> 33600 T11 oasc.SolrResourceLoader.<init> new SolrResourceLoader for directory: '/usr/home/jenkins/jenkins-slave/workspace/Lucene-Solr-Tests-5.x-Java7/solr/build/solr-core/test/J2/temp/solr.cloud.ReplicationFactorTest A96A216EF4FF9BC1-001/shard-1-001/'
   [junit4]   2> 33633 T11 oasc.ConfigSolr.fromFile Loading container configuration from /usr/home/jenkins/jenkins-slave/workspace/Lucene-Solr-Tests-5.x-Java7/solr/build/solr-core/test/J2/temp/solr.cloud.ReplicationFactorTest A96A216EF4FF9BC1-001/shard-1-001/solr.xml
   [junit4]   2> 33681 T11 oasc.CorePropertiesLocator.<init> Config-defined core root directory: /usr/home/jenkins/jenkins-slave/workspace/Lucene-Solr-Tests-5.x-Java7/solr/build/solr-core/test/J2/temp/solr.cloud.ReplicationFactorTest A96A216EF4FF9BC1-001/shard-1-001/cores
   [junit4]   2> 33682 T11 oasc.CoreContainer.<init> New CoreContainer 544457890
   [junit4]   2> 33683 T11 oasc.CoreContainer.load Loading cores into CoreContainer [instanceDir=/usr/home/jenkins/jenkins-slave/workspace/Lucene-Solr-Tests-5.x-Java7/solr/build/solr-core/test/J2/temp/solr.cloud.ReplicationFactorTest A96A216EF4FF9BC1-001/shard-1-001/]
   [junit4]   2> 33684 T11 oashc.HttpShardHandlerFactory.getParameter Setting socketTimeout to: 90000
   [junit4]   2> 33685 T11 oashc.HttpShardHandlerFactory.getParameter Setting urlScheme to: 
   [junit4]   2> 33685 T11 oashc.HttpShardHandlerFactory.getParameter Setting connTimeout to: 15000
   [junit4]   2> 33686 T11 oashc.HttpShardHandlerFactory.getParameter Setting maxConnectionsPerHost to: 20
   [junit4]   2> 33686 T11 oashc.HttpShardHandlerFactory.getParameter Setting maxConnections to: 10000
   [junit4]   2> 33687 T11 oashc.HttpShardHandlerFactory.getParameter Setting corePoolSize to: 0
   [junit4]   2> 33687 T11 oashc.HttpShardHandlerFactory.getParameter Setting maximumPoolSize to: 2147483647
   [junit4]   2> 33688 T11 oashc.HttpShardHandlerFactory.getParameter Setting maxThreadIdleTime to: 5
   [junit4]   2> 33689 T11 oashc.HttpShardHandlerFactory.getParameter Setting sizeOfQueue to: -1
   [junit4]   2> 33689 T11 oashc.HttpShardHandlerFactory.getParameter Setting fairnessPolicy to: false
   [junit4]   2> 33690 T11 oashc.HttpShardHandlerFactory.getParameter Setting useRetries to: false
   [junit4]   2> 33691 T11 oasu.UpdateShardHandler.<init> Creating UpdateShardHandler HTTP client with params: socketTimeout=340000&connTimeout=45000&retry=true
   [junit4]   2> 33691 T11 oasl.LogWatcher.createWatcher SLF4J impl is org.slf4j.impl.Log4jLoggerFactory
   [junit4]   2> 33692 T11 oasl.LogWatcher.newRegisteredLogWatcher Registering Log Listener [Log4j (org.slf4j.impl.Log4jLoggerFactory)]
   [junit4]   2> 33692 T11 oasc.CoreContainer.load Host Name: 127.0.0.1
   [junit4]   2> 33693 T11 oasc.ZkContainer.initZooKeeper Zookeeper client=127.0.0.1:22635/solr
   [junit4]   2> 33693 T11 oasc.ZkController.checkChrootPath zkHost includes chroot
   [junit4]   2> 33694 T11 oascc.SolrZkClient.createZkCredentialsToAddAutomatically Using default ZkCredentialsProvider
   [junit4]   2> 33695 T11 oascc.ConnectionManager.waitForConnected Waiting for client to connect to ZooKeeper
   [junit4]   2> 33697 T66 oascc.ConnectionManager.process Watcher org.apache.solr.common.cloud.ConnectionManager@75dafc0b name:ZooKeeperConnection Watcher:127.0.0.1:22635 got event WatchedEvent state:SyncConnected type:None path:null path:null type:None
   [junit4]   2> 33698 T11 oascc.ConnectionManager.waitForConnected Client is connected to ZooKeeper
   [junit4]   2> 33699 T11 oascc.SolrZkClient.createZkACLProvider Using default ZkACLProvider
   [junit4]   2> 33702 T11 oascc.ConnectionManager.waitForConnected Waiting for client to connect to ZooKeeper
   [junit4]   2> 33704 T69 oascc.ConnectionManager.process Watcher org.apache.solr.common.cloud.ConnectionManager@4bb488d0 name:ZooKeeperConnection Watcher:127.0.0.1:22635/solr got event WatchedEvent state:SyncConnected type:None path:null path:null type:None
   [junit4]   2> 33704 T11 oascc.ConnectionManager.waitForConnected Client is connected to ZooKeeper
   [junit4]   2> 33713 T11 oascc.ZkStateReader.createClusterStateWatchersAndUpdate Updating cluster state from ZooKeeper... 
   [junit4]   2> 34723 T11 oasc.ZkController.createEphemeralLiveNode Register node as live in ZooKeeper:/live_nodes/127.0.0.1:63820_sk_s%2Fg
   [junit4]   2> 34734 T11 oascc.SolrZkClient.makePath makePath: /live_nodes/127.0.0.1:63820_sk_s%2Fg
   [junit4]   2> 34741 T11 oasc.Overseer.close Overseer (id=null) closing
   [junit4]   2> 34751 T11 oasc.CorePropertiesLocator.discover Looking for core definitions underneath /usr/home/jenkins/jenkins-slave/workspace/Lucene-Solr-Tests-5.x-Java7/solr/build/solr-core/test/J2/temp/solr.cloud.ReplicationFactorTest A96A216EF4FF9BC1-001/shard-1-001/cores
   [junit4]   2> 34753 T11 oasc.CorePropertiesLocator.discoverUnder Found core collection1 in /usr/home/jenkins/jenkins-slave/workspace/Lucene-Solr-Tests-5.x-Java7/solr/build/solr-core/test/J2/temp/solr.cloud.ReplicationFactorTest A96A216EF4FF9BC1-001/shard-1-001/cores/collection1/
   [junit4]   2> 34754 T11 oasc.CorePropertiesLocator.discover Found 1 core definitions
   [junit4]   2> 34758 T70 oasc.ZkController.publish publishing core=collection1 state=down collection=collection1
   [junit4]   2> 34758 T70 oasc.ZkController.publish numShards not found on descriptor - reading it from system property
   [junit4]   2> 34761 T38 oasc.DistributedQueue$LatchWatcher.process NodeChildrenChanged fired on path /overseer/queue state SyncConnected
   [junit4]   2> 34762 T70 oasc.ZkController.preRegister Registering watch for external collection collection1
   [junit4]   2> 34763 T39 oasc.Overseer$ClusterStateUpdater.run processMessage: queueSize: 1, message = {
   [junit4]   2> 	  "base_url":"http://127.0.0.1:63820/sk_s/g",
   [junit4]   2> 	  "operation":"state",
   [junit4]   2> 	  "roles":null,
   [junit4]   2> 	  "state":"down",
   [junit4]   2> 	  "numShards":"3",
   [junit4]   2> 	  "core":"collection1",
   [junit4]   2> 	  "collection":"collection1",
   [junit4]   2> 	  "shard":null,
   [junit4]   2> 	  "node_name":"127.0.0.1:63820_sk_s%2Fg"} current state version: 5
   [junit4]   2> 34763 T70 oascc.ZkStateReader.addZkWatch addZkWatch collection1
   [junit4]   2> 34764 T39 oasco.ReplicaMutator.updateState Update state numShards=3 message={
   [junit4]   2> 	  "base_url":"http://127.0.0.1:63820/sk_s/g",
   [junit4]   2> 	  "operation":"state",
   [junit4]   2> 	  "roles":null,
   [junit4]   2> 	  "state":"down",
   [junit4]   2> 	  "numShards":"3",
   [junit4]   2> 	  "core":"collection1",
   [junit4]   2> 	  "collection":"collection1",
   [junit4]   2> 	  "shard":null,
   [junit4]   2> 	  "node_name":"127.0.0.1:63820_sk_s%2Fg"}
   [junit4]   2> 34764 T70 oascc.ZkStateReader.addZkWatch Updating collection state at /collections/collection1/state.json from ZooKeeper... 
   [junit4]   2> 34764 T39 oasco.ReplicaMutator.updateState Collection already exists with numShards=3
   [junit4]   2> 34765 T39 oasco.ReplicaMutator.updateState Assigning new node to shard shard=shard2
   [junit4]   2> 34768 T39 oasco.ZkStateWriter.writePendingUpdates going to update_collection /collections/collection1/state.json version: 0
   [junit4]   2> 34772 T70 oascc.ZkStateReader.updateWatchedCollection Updating data for collection1 to ver 1 
   [junit4]   2> 34773 T70 oasc.ZkController.waitForCoreNodeName look for our core node name
   [junit4]   2> 34773 T70 oasc.ZkController.waitForShardId waiting to find shard id in clusterstate for collection1
   [junit4]   2> 34773 T70 oasc.ZkController.createCollectionZkNode Check for collection zkNode:collection1
   [junit4]   2> 34774 T70 oasc.ZkController.createCollectionZkNode Collection zkNode exists
   [junit4]   2> 34775 T70 oascc.ZkStateReader.readConfigName Load collection config from:/collections/collection1
   [junit4]   2> 34776 T70 oascc.ZkStateReader.readConfigName path=/collections/collection1 configName=conf1 specified config exists in ZooKeeper
   [junit4]   2> 34777 T70 oasc.SolrResourceLoader.<init> new SolrResourceLoader for directory: '/usr/home/jenkins/jenkins-slave/workspace/Lucene-Solr-Tests-5.x-Java7/solr/build/solr-core/test/J2/temp/solr.cloud.ReplicationFactorTest A96A216EF4FF9BC1-001/shard-1-001/cores/collection1/'
   [junit4]   2> 34793 T70 oasc.ZkController.watchZKConfDir watch zkdir /configs/conf1
   [junit4]   2> 34797 T70 oasc.Config.<init> loaded config solrconfig.xml with version 0 
   [junit4]   2> 34821 T70 oasc.SolrConfig.refreshRequestParams current version of requestparams : -1
   [junit4]   2> 34881 T70 oasc.SolrConfig.<init> Using Lucene MatchVersion: 5.1.0
   [junit4]   2> 34971 T70 oasc.SolrConfig.<init> Loaded SolrConfig: solrconfig.xml
   [junit4]   2> 35073 T70 oass.IndexSchema.readSchema Reading Solr Schema from /configs/conf1/schema.xml
   [junit4]   2> 35158 T70 oass.IndexSchema.readSchema [collection1] Schema name=test
   [junit4]   2> 35748 T70 oass.OpenExchangeRatesOrgProvider.init Initialized with rates=open-exchange-rates.json, refreshInterval=1440.
   [junit4]   2> 35774 T70 oass.IndexSchema.readSchema default search field in schema is text
   [junit4]   2> 35778 T70 oass.IndexSchema.readSchema unique key field: id
   [junit4]   2> 35831 T70 oass.FileExchangeRateProvider.reload Reloading exchange rates from file currency.xml
   [junit4]   2> 35841 T70 oass.FileExchangeRateProvider.reload Reloading exchange rates from file currency.xml
   [junit4]   2> 35851 T70 oass.OpenExchangeRatesOrgProvider.reload Reloading exchange rates from open-exchange-rates.json
   [junit4]   2> 35853 T70 oass.OpenExchangeRatesOrgProvider$OpenExchangeRates.<init> WARN Unknown key IMPORTANT NOTE
   [junit4

[...truncated too long message...]

rWord connecting to 127.0.0.1:26956 26956
   [junit4]   2> 1169206 T3190 oasc.ZkTestServer.send4LetterWord connecting to 127.0.0.1:26956 26956
   [junit4]   2> 1169208 T3190 oasc.ZkTestServer$ZKServerMain.runFromConfig WARN Watch limit violations: 
   [junit4]   2> 	Maximum concurrent create/delete watches above limit:
   [junit4]   2> 	
   [junit4]   2> 		4	/solr/clusterstate.json
   [junit4]   2> 		4	/solr/aliases.json
   [junit4]   2> 		3	/solr/configs/conf1
   [junit4]   2> 		2	/solr/collections/collection1/state.json
   [junit4]   2> 	
   [junit4]   2> 	Maximum concurrent children watches above limit:
   [junit4]   2> 	
   [junit4]   2> 		4	/solr/live_nodes
   [junit4]   2> 		3	/solr/overseer/collection-queue-work
   [junit4]   2> 		3	/solr/overseer/queue
   [junit4]   2> 	
   [junit4]   2> 1169208 T3189 oasc.SocketProxy.close WARN Closing 0 connections to: http://127.0.0.1:27010/z_
   [junit4]   2> 1169208 T3189 oasc.SocketProxy.close WARN Closing 0 connections to: http://127.0.0.1:26964/z_
   [junit4]   2> 1169209 T3189 oasc.SocketProxy.close WARN Closing 5 connections to: http://127.0.0.1:26979/z_
   [junit4]   2> NOTE: reproduce with: ant test  -Dtestcase=RecoveryAfterSoftCommitTest -Dtests.method=test -Dtests.seed=A96A216EF4FF9BC1 -Dtests.multiplier=2 -Dtests.slow=true -Dtests.locale=es_EC -Dtests.timezone=Iceland -Dtests.asserts=true -Dtests.file.encoding=US-ASCII
   [junit4] ERROR   65.1s J0 | RecoveryAfterSoftCommitTest.test <<<
   [junit4]    > Throwable #1: org.apache.solr.client.solrj.SolrServerException: org.apache.solr.client.solrj.SolrServerException: IOException occured when talking to server at: http://127.0.0.1:26979/z_/collection1
   [junit4]    > 	at __randomizedtesting.SeedInfo.seed([A96A216EF4FF9BC1:213E1EB45A03F639]:0)
   [junit4]    > 	at org.apache.solr.client.solrj.impl.CloudSolrClient.directUpdate(CloudSolrClient.java:575)
   [junit4]    > 	at org.apache.solr.client.solrj.impl.CloudSolrClient.sendRequest(CloudSolrClient.java:884)
   [junit4]    > 	at org.apache.solr.client.solrj.impl.CloudSolrClient.requestWithRetryOnStaleState(CloudSolrClient.java:787)
   [junit4]    > 	at org.apache.solr.client.solrj.impl.CloudSolrClient.request(CloudSolrClient.java:730)
   [junit4]    > 	at org.apache.solr.client.solrj.request.AbstractUpdateRequest.process(AbstractUpdateRequest.java:124)
   [junit4]    > 	at org.apache.solr.client.solrj.SolrClient.add(SolrClient.java:124)
   [junit4]    > 	at org.apache.solr.client.solrj.SolrClient.add(SolrClient.java:110)
   [junit4]    > 	at org.apache.solr.cloud.RecoveryAfterSoftCommitTest.test(RecoveryAfterSoftCommitTest.java:88)
   [junit4]    > 	at org.apache.solr.BaseDistributedSearchTestCase$ShardsRepeatRule$ShardsFixedStatement.callStatement(BaseDistributedSearchTestCase.java:940)
   [junit4]    > 	at org.apache.solr.BaseDistributedSearchTestCase$ShardsRepeatRule$ShardsStatement.evaluate(BaseDistributedSearchTestCase.java:915)
   [junit4]    > 	at java.lang.Thread.run(Thread.java:745)
   [junit4]    > Caused by: org.apache.solr.client.solrj.SolrServerException: IOException occured when talking to server at: http://127.0.0.1:26979/z_/collection1
   [junit4]    > 	at org.apache.solr.client.solrj.impl.HttpSolrClient.executeMethod(HttpSolrClient.java:572)
   [junit4]    > 	at org.apache.solr.client.solrj.impl.HttpSolrClient.request(HttpSolrClient.java:214)
   [junit4]    > 	at org.apache.solr.client.solrj.impl.HttpSolrClient.request(HttpSolrClient.java:210)
   [junit4]    > 	at org.apache.solr.client.solrj.impl.LBHttpSolrClient.doRequest(LBHttpSolrClient.java:370)
   [junit4]    > 	at org.apache.solr.client.solrj.impl.LBHttpSolrClient.request(LBHttpSolrClient.java:325)
   [junit4]    > 	at org.apache.solr.client.solrj.impl.CloudSolrClient.directUpdate(CloudSolrClient.java:572)
   [junit4]    > 	... 49 more
   [junit4]    > Caused by: org.apache.http.NoHttpResponseException: The target server failed to respond
   [junit4]    > 	at org.apache.http.impl.conn.DefaultHttpResponseParser.parseHead(DefaultHttpResponseParser.java:143)
   [junit4]    > 	at org.apache.http.impl.conn.DefaultHttpResponseParser.parseHead(DefaultHttpResponseParser.java:57)
   [junit4]    > 	at org.apache.http.impl.io.AbstractMessageParser.parse(AbstractMessageParser.java:260)
   [junit4]    > 	at org.apache.http.impl.AbstractHttpClientConnection.receiveResponseHeader(AbstractHttpClientConnection.java:283)
   [junit4]    > 	at org.apache.http.impl.conn.DefaultClientConnection.receiveResponseHeader(DefaultClientConnection.java:251)
   [junit4]    > 	at org.apache.http.impl.conn.ManagedClientConnectionImpl.receiveResponseHeader(ManagedClientConnectionImpl.java:197)
   [junit4]    > 	at org.apache.http.protocol.HttpRequestExecutor.doReceiveResponse(HttpRequestExecutor.java:271)
   [junit4]    > 	at org.apache.http.protocol.HttpRequestExecutor.execute(HttpRequestExecutor.java:123)
   [junit4]    > 	at org.apache.http.impl.client.DefaultRequestDirector.tryExecute(DefaultRequestDirector.java:682)
   [junit4]    > 	at org.apache.http.impl.client.DefaultRequestDirector.execute(DefaultRequestDirector.java:486)
   [junit4]    > 	at org.apache.http.impl.client.AbstractHttpClient.doExecute(AbstractHttpClient.java:863)
   [junit4]    > 	at org.apache.http.impl.client.CloseableHttpClient.execute(CloseableHttpClient.java:82)
   [junit4]    > 	at org.apache.http.impl.client.CloseableHttpClient.execute(CloseableHttpClient.java:106)
   [junit4]    > 	at org.apache.http.impl.client.CloseableHttpClient.execute(CloseableHttpClient.java:57)
   [junit4]    > 	at org.apache.solr.client.solrj.impl.HttpSolrClient.executeMethod(HttpSolrClient.java:464)
   [junit4]    > 	... 54 more
   [junit4]   2> 1169223 T3189 oas.SolrTestCaseJ4.deleteCore ###deleteCore
   [junit4]   2> NOTE: leaving temporary files on disk at: /usr/home/jenkins/jenkins-slave/workspace/Lucene-Solr-Tests-5.x-Java7/solr/build/solr-core/test/J0/temp/solr.cloud.RecoveryAfterSoftCommitTest A96A216EF4FF9BC1-001
   [junit4]   2> NOTE: test params are: codec=Asserting(Lucene50): {_version_=TestBloomFilteredLucenePostings(BloomFilteringPostingsFormat(Lucene50(blocksize=128))), id=PostingsFormat(name=LuceneVarGapFixedInterval), intDefault=TestBloomFilteredLucenePostings(BloomFilteringPostingsFormat(Lucene50(blocksize=128))), text=PostingsFormat(name=Direct), range_facet_l=PostingsFormat(name=LuceneFixedGap), a_t=PostingsFormat(name=LuceneFixedGap), timestamp=PostingsFormat(name=LuceneFixedGap), multiDefault=PostingsFormat(name=LuceneFixedGap)}, docValues:{timestamp=DocValuesFormat(name=Lucene50)}, sim=RandomSimilarityProvider(queryNorm=false,coord=crazy): {}, locale=es_EC, timezone=Iceland
   [junit4]   2> NOTE: FreeBSD 9.1-RELEASE-p3 amd64/Oracle Corporation 1.7.0_65 (64-bit)/cpus=16,threads=1,free=132543240,total=291504128
   [junit4]   2> NOTE: All tests run in this JVM: [TestRebalanceLeaders, SOLR749Test, TestComponentsName, TestFuzzyAnalyzedSuggestions, TestQueryUtils, SyncSliceTest, ExternalFileFieldSortTest, ChaosMonkeyNothingIsSafeTest, RequiredFieldsTest, DistanceUnitsTest, ZkSolrClientTest, TestPostingsSolrHighlighter, DocValuesMultiTest, MBeansHandlerTest, MergeStrategyTest, CoreAdminCreateDiscoverTest, SolrInfoMBeanTest, TestPartialUpdateDeduplication, TestDocBasedVersionConstraints, AtomicUpdatesTest, TestStressUserVersions, TestCollationField, TestLazyCores, DistributedTermsComponentTest, PingRequestHandlerTest, LoggingHandlerTest, TestSimpleQParserPlugin, TestCloudManagedSchema, PreAnalyzedUpdateProcessorTest, JsonLoaderTest, TestDocSet, BinaryUpdateRequestHandlerTest, AnalyticsMergeStrategyTest, SpellCheckCollatorTest, TestSolr4Spatial, JSONWriterTest, RequestHandlersTest, BadIndexSchemaTest, NumericFieldsTest, RemoteQueryErrorTest, DistributedSpellCheckComponentTest, TestQueryTypes, AsyncMigrateRouteKeyTest, TestSweetSpotSimilarityFactory, BufferStoreTest, TestPseudoReturnFields, ExitableDirectoryReaderTest, TestJoin, ShowFileRequestHandlerTest, TestMaxScoreQueryParser, TestBlendedInfixSuggestions, LeaderInitiatedRecoveryOnCommitTest, TestSolrDeletionPolicy1, DistributedMLTComponentTest, UUIDUpdateProcessorFallbackTest, TestManagedResource, TestSolrDynamicMBean, BasicDistributedZkTest, DistribDocExpirationUpdateProcessorTest, RecoveryAfterSoftCommitTest]
   [junit4] Completed on J0 in 65.17s, 1 test, 1 error <<< FAILURES!

[...truncated 680 lines...]
BUILD FAILED
/usr/home/jenkins/jenkins-slave/workspace/Lucene-Solr-Tests-5.x-Java7/build.xml:529: The following error occurred while executing this line:
/usr/home/jenkins/jenkins-slave/workspace/Lucene-Solr-Tests-5.x-Java7/build.xml:477: The following error occurred while executing this line:
/usr/home/jenkins/jenkins-slave/workspace/Lucene-Solr-Tests-5.x-Java7/build.xml:61: The following error occurred while executing this line:
/usr/home/jenkins/jenkins-slave/workspace/Lucene-Solr-Tests-5.x-Java7/extra-targets.xml:39: The following error occurred while executing this line:
/usr/home/jenkins/jenkins-slave/workspace/Lucene-Solr-Tests-5.x-Java7/solr/build.xml:191: The following error occurred while executing this line:
/usr/home/jenkins/jenkins-slave/workspace/Lucene-Solr-Tests-5.x-Java7/solr/common-build.xml:508: The following error occurred while executing this line:
/usr/home/jenkins/jenkins-slave/workspace/Lucene-Solr-Tests-5.x-Java7/lucene/common-build.xml:1363: The following error occurred while executing this line:
/usr/home/jenkins/jenkins-slave/workspace/Lucene-Solr-Tests-5.x-Java7/lucene/common-build.xml:970: There were test failures: 462 suites, 1852 tests, 5 errors, 1 failure, 60 ignored (22 assumptions)

Total time: 45 minutes 7 seconds
Build step 'Invoke Ant' marked build as failure
Archiving artifacts
Sending artifact delta relative to Lucene-Solr-Tests-5.x-Java7 #2431
Archived 5 artifacts
Archive block size is 32768
Received 0 blocks and 171574603 bytes
Compression is 0.0%
Took 29 sec
Recording test results
Email was triggered for: Failure
Sending email for trigger: Failure



Mime
View raw message