lucene-dev mailing list archives

Site index · List index
Message view « Date » · « Thread »
Top « Date » · « Thread »
From Policeman Jenkins Server <jenk...@thetaphi.de>
Subject [JENKINS] Lucene-Solr-5.x-Windows (64bit/jdk1.7.0_76) - Build # 4390 - Still Failing!
Date Wed, 18 Feb 2015 09:38:32 GMT
Build: http://jenkins.thetaphi.de/job/Lucene-Solr-5.x-Windows/4390/
Java: 64bit/jdk1.7.0_76 -XX:-UseCompressedOops -XX:+UseSerialGC

3 tests failed.
FAILED:  junit.framework.TestSuite.org.apache.solr.cloud.BasicDistributedZk2Test

Error Message:
Could not remove the following files (in the order of attempts):    C:\Users\JenkinsSlave\workspace\Lucene-Solr-5.x-Windows\solr\build\solr-core\test\J0\temp\solr.cloud.BasicDistributedZk2Test 10D1CB67BF098A67-001\tempDir-002: java.nio.file.AccessDeniedException: C:\Users\JenkinsSlave\workspace\Lucene-Solr-5.x-Windows\solr\build\solr-core\test\J0\temp\solr.cloud.BasicDistributedZk2Test 10D1CB67BF098A67-001\tempDir-002    C:\Users\JenkinsSlave\workspace\Lucene-Solr-5.x-Windows\solr\build\solr-core\test\J0\temp\solr.cloud.BasicDistributedZk2Test 10D1CB67BF098A67-001: java.nio.file.DirectoryNotEmptyException: C:\Users\JenkinsSlave\workspace\Lucene-Solr-5.x-Windows\solr\build\solr-core\test\J0\temp\solr.cloud.BasicDistributedZk2Test 10D1CB67BF098A67-001 

Stack Trace:
java.io.IOException: Could not remove the following files (in the order of attempts):
   C:\Users\JenkinsSlave\workspace\Lucene-Solr-5.x-Windows\solr\build\solr-core\test\J0\temp\solr.cloud.BasicDistributedZk2Test 10D1CB67BF098A67-001\tempDir-002: java.nio.file.AccessDeniedException: C:\Users\JenkinsSlave\workspace\Lucene-Solr-5.x-Windows\solr\build\solr-core\test\J0\temp\solr.cloud.BasicDistributedZk2Test 10D1CB67BF098A67-001\tempDir-002
   C:\Users\JenkinsSlave\workspace\Lucene-Solr-5.x-Windows\solr\build\solr-core\test\J0\temp\solr.cloud.BasicDistributedZk2Test 10D1CB67BF098A67-001: java.nio.file.DirectoryNotEmptyException: C:\Users\JenkinsSlave\workspace\Lucene-Solr-5.x-Windows\solr\build\solr-core\test\J0\temp\solr.cloud.BasicDistributedZk2Test 10D1CB67BF098A67-001

	at __randomizedtesting.SeedInfo.seed([10D1CB67BF098A67]:0)
	at org.apache.lucene.util.IOUtils.rm(IOUtils.java:294)
	at org.apache.lucene.util.TestRuleTemporaryFilesCleanup.afterAlways(TestRuleTemporaryFilesCleanup.java:170)
	at com.carrotsearch.randomizedtesting.rules.TestRuleAdapter$1.afterAlways(TestRuleAdapter.java:31)
	at com.carrotsearch.randomizedtesting.rules.StatementAdapter.evaluate(StatementAdapter.java:43)
	at com.carrotsearch.randomizedtesting.rules.StatementAdapter.evaluate(StatementAdapter.java:36)
	at org.apache.lucene.util.TestRuleAssertionsRequired$1.evaluate(TestRuleAssertionsRequired.java:54)
	at org.apache.lucene.util.TestRuleMarkFailure$1.evaluate(TestRuleMarkFailure.java:48)
	at org.apache.lucene.util.TestRuleIgnoreAfterMaxFailures$1.evaluate(TestRuleIgnoreAfterMaxFailures.java:65)
	at org.apache.lucene.util.TestRuleIgnoreTestSuites$1.evaluate(TestRuleIgnoreTestSuites.java:55)
	at com.carrotsearch.randomizedtesting.rules.StatementAdapter.evaluate(StatementAdapter.java:36)
	at com.carrotsearch.randomizedtesting.ThreadLeakControl$StatementRunner.run(ThreadLeakControl.java:365)
	at java.lang.Thread.run(Thread.java:745)


FAILED:  org.apache.solr.cloud.ReplicationFactorTest.test

Error Message:
org.apache.solr.client.solrj.SolrServerException: IOException occured when talking to server at: http://127.0.0.1:64767/vi_/wu/repfacttest_c8n_1x3_shard1_replica2

Stack Trace:
org.apache.solr.client.solrj.SolrServerException: org.apache.solr.client.solrj.SolrServerException: IOException occured when talking to server at: http://127.0.0.1:64767/vi_/wu/repfacttest_c8n_1x3_shard1_replica2
	at org.apache.solr.client.solrj.impl.CloudSolrClient.directUpdate(CloudSolrClient.java:575)
	at org.apache.solr.client.solrj.impl.CloudSolrClient.sendRequest(CloudSolrClient.java:884)
	at org.apache.solr.client.solrj.impl.CloudSolrClient.requestWithRetryOnStaleState(CloudSolrClient.java:787)
	at org.apache.solr.client.solrj.impl.CloudSolrClient.request(CloudSolrClient.java:730)
	at org.apache.solr.cloud.ReplicationFactorTest.testRf3(ReplicationFactorTest.java:283)
	at org.apache.solr.cloud.ReplicationFactorTest.test(ReplicationFactorTest.java:112)
	at sun.reflect.NativeMethodAccessorImpl.invoke0(Native Method)
	at sun.reflect.NativeMethodAccessorImpl.invoke(NativeMethodAccessorImpl.java:57)
	at sun.reflect.DelegatingMethodAccessorImpl.invoke(DelegatingMethodAccessorImpl.java:43)
	at java.lang.reflect.Method.invoke(Method.java:606)
	at com.carrotsearch.randomizedtesting.RandomizedRunner.invoke(RandomizedRunner.java:1618)
	at com.carrotsearch.randomizedtesting.RandomizedRunner$6.evaluate(RandomizedRunner.java:827)
	at com.carrotsearch.randomizedtesting.RandomizedRunner$7.evaluate(RandomizedRunner.java:863)
	at com.carrotsearch.randomizedtesting.RandomizedRunner$8.evaluate(RandomizedRunner.java:877)
	at org.apache.solr.BaseDistributedSearchTestCase$ShardsRepeatRule$ShardsFixedStatement.callStatement(BaseDistributedSearchTestCase.java:940)
	at org.apache.solr.BaseDistributedSearchTestCase$ShardsRepeatRule$ShardsStatement.evaluate(BaseDistributedSearchTestCase.java:915)
	at com.carrotsearch.randomizedtesting.rules.SystemPropertiesRestoreRule$1.evaluate(SystemPropertiesRestoreRule.java:53)
	at org.apache.lucene.util.TestRuleSetupTeardownChained$1.evaluate(TestRuleSetupTeardownChained.java:50)
	at org.apache.lucene.util.AbstractBeforeAfterRule$1.evaluate(AbstractBeforeAfterRule.java:46)
	at com.carrotsearch.randomizedtesting.rules.SystemPropertiesInvariantRule$1.evaluate(SystemPropertiesInvariantRule.java:55)
	at org.apache.lucene.util.TestRuleThreadAndTestName$1.evaluate(TestRuleThreadAndTestName.java:49)
	at org.apache.lucene.util.TestRuleIgnoreAfterMaxFailures$1.evaluate(TestRuleIgnoreAfterMaxFailures.java:65)
	at org.apache.lucene.util.TestRuleMarkFailure$1.evaluate(TestRuleMarkFailure.java:48)
	at com.carrotsearch.randomizedtesting.rules.StatementAdapter.evaluate(StatementAdapter.java:36)
	at com.carrotsearch.randomizedtesting.ThreadLeakControl$StatementRunner.run(ThreadLeakControl.java:365)
	at com.carrotsearch.randomizedtesting.ThreadLeakControl.forkTimeoutingTask(ThreadLeakControl.java:798)
	at com.carrotsearch.randomizedtesting.ThreadLeakControl$3.evaluate(ThreadLeakControl.java:458)
	at com.carrotsearch.randomizedtesting.RandomizedRunner.runSingleTest(RandomizedRunner.java:836)
	at com.carrotsearch.randomizedtesting.RandomizedRunner$3.evaluate(RandomizedRunner.java:738)
	at com.carrotsearch.randomizedtesting.RandomizedRunner$4.evaluate(RandomizedRunner.java:772)
	at com.carrotsearch.randomizedtesting.RandomizedRunner$5.evaluate(RandomizedRunner.java:783)
	at com.carrotsearch.randomizedtesting.rules.StatementAdapter.evaluate(StatementAdapter.java:36)
	at com.carrotsearch.randomizedtesting.rules.SystemPropertiesRestoreRule$1.evaluate(SystemPropertiesRestoreRule.java:53)
	at org.apache.lucene.util.AbstractBeforeAfterRule$1.evaluate(AbstractBeforeAfterRule.java:46)
	at org.apache.lucene.util.TestRuleStoreClassName$1.evaluate(TestRuleStoreClassName.java:42)
	at com.carrotsearch.randomizedtesting.rules.SystemPropertiesInvariantRule$1.evaluate(SystemPropertiesInvariantRule.java:55)
	at com.carrotsearch.randomizedtesting.rules.NoShadowingOrOverridesOnMethodsRule$1.evaluate(NoShadowingOrOverridesOnMethodsRule.java:39)
	at com.carrotsearch.randomizedtesting.rules.NoShadowingOrOverridesOnMethodsRule$1.evaluate(NoShadowingOrOverridesOnMethodsRule.java:39)
	at com.carrotsearch.randomizedtesting.rules.StatementAdapter.evaluate(StatementAdapter.java:36)
	at com.carrotsearch.randomizedtesting.rules.StatementAdapter.evaluate(StatementAdapter.java:36)
	at com.carrotsearch.randomizedtesting.rules.StatementAdapter.evaluate(StatementAdapter.java:36)
	at org.apache.lucene.util.TestRuleAssertionsRequired$1.evaluate(TestRuleAssertionsRequired.java:54)
	at org.apache.lucene.util.TestRuleMarkFailure$1.evaluate(TestRuleMarkFailure.java:48)
	at org.apache.lucene.util.TestRuleIgnoreAfterMaxFailures$1.evaluate(TestRuleIgnoreAfterMaxFailures.java:65)
	at org.apache.lucene.util.TestRuleIgnoreTestSuites$1.evaluate(TestRuleIgnoreTestSuites.java:55)
	at com.carrotsearch.randomizedtesting.rules.StatementAdapter.evaluate(StatementAdapter.java:36)
	at com.carrotsearch.randomizedtesting.ThreadLeakControl$StatementRunner.run(ThreadLeakControl.java:365)
	at java.lang.Thread.run(Thread.java:745)
Caused by: org.apache.solr.client.solrj.SolrServerException: IOException occured when talking to server at: http://127.0.0.1:64767/vi_/wu/repfacttest_c8n_1x3_shard1_replica2
	at org.apache.solr.client.solrj.impl.HttpSolrClient.executeMethod(HttpSolrClient.java:572)
	at org.apache.solr.client.solrj.impl.HttpSolrClient.request(HttpSolrClient.java:214)
	at org.apache.solr.client.solrj.impl.HttpSolrClient.request(HttpSolrClient.java:210)
	at org.apache.solr.client.solrj.impl.LBHttpSolrClient.doRequest(LBHttpSolrClient.java:370)
	at org.apache.solr.client.solrj.impl.LBHttpSolrClient.request(LBHttpSolrClient.java:325)
	at org.apache.solr.client.solrj.impl.CloudSolrClient.directUpdate(CloudSolrClient.java:572)
	... 47 more
Caused by: org.apache.http.NoHttpResponseException: The target server failed to respond
	at org.apache.http.impl.conn.DefaultHttpResponseParser.parseHead(DefaultHttpResponseParser.java:143)
	at org.apache.http.impl.conn.DefaultHttpResponseParser.parseHead(DefaultHttpResponseParser.java:57)
	at org.apache.http.impl.io.AbstractMessageParser.parse(AbstractMessageParser.java:260)
	at org.apache.http.impl.AbstractHttpClientConnection.receiveResponseHeader(AbstractHttpClientConnection.java:283)
	at org.apache.http.impl.conn.DefaultClientConnection.receiveResponseHeader(DefaultClientConnection.java:251)
	at org.apache.http.impl.conn.ManagedClientConnectionImpl.receiveResponseHeader(ManagedClientConnectionImpl.java:197)
	at org.apache.http.protocol.HttpRequestExecutor.doReceiveResponse(HttpRequestExecutor.java:271)
	at org.apache.http.protocol.HttpRequestExecutor.execute(HttpRequestExecutor.java:123)
	at org.apache.http.impl.client.DefaultRequestDirector.tryExecute(DefaultRequestDirector.java:682)
	at org.apache.http.impl.client.DefaultRequestDirector.execute(DefaultRequestDirector.java:486)
	at org.apache.http.impl.client.AbstractHttpClient.doExecute(AbstractHttpClient.java:863)
	at org.apache.http.impl.client.CloseableHttpClient.execute(CloseableHttpClient.java:82)
	at org.apache.http.impl.client.CloseableHttpClient.execute(CloseableHttpClient.java:106)
	at org.apache.http.impl.client.CloseableHttpClient.execute(CloseableHttpClient.java:57)
	at org.apache.solr.client.solrj.impl.HttpSolrClient.executeMethod(HttpSolrClient.java:464)
	... 52 more


FAILED:  junit.framework.TestSuite.org.apache.solr.handler.TestReplicationHandlerBackup

Error Message:
Could not remove the following files (in the order of attempts):    C:\Users\JenkinsSlave\workspace\Lucene-Solr-5.x-Windows\solr\build\solr-core\test\J0\temp\solr.handler.TestReplicationHandlerBackup 10D1CB67BF098A67-001\solr-instance-002\collection1: java.nio.file.DirectoryNotEmptyException: C:\Users\JenkinsSlave\workspace\Lucene-Solr-5.x-Windows\solr\build\solr-core\test\J0\temp\solr.handler.TestReplicationHandlerBackup 10D1CB67BF098A67-001\solr-instance-002\collection1    C:\Users\JenkinsSlave\workspace\Lucene-Solr-5.x-Windows\solr\build\solr-core\test\J0\temp\solr.handler.TestReplicationHandlerBackup 10D1CB67BF098A67-001\solr-instance-002: java.nio.file.DirectoryNotEmptyException: C:\Users\JenkinsSlave\workspace\Lucene-Solr-5.x-Windows\solr\build\solr-core\test\J0\temp\solr.handler.TestReplicationHandlerBackup 10D1CB67BF098A67-001\solr-instance-002    C:\Users\JenkinsSlave\workspace\Lucene-Solr-5.x-Windows\solr\build\solr-core\test\J0\temp\solr.handler.TestReplicationHandlerBackup 10D1CB67BF098A67-001\solr-instance-001\collection1: java.nio.file.DirectoryNotEmptyException: C:\Users\JenkinsSlave\workspace\Lucene-Solr-5.x-Windows\solr\build\solr-core\test\J0\temp\solr.handler.TestReplicationHandlerBackup 10D1CB67BF098A67-001\solr-instance-001\collection1    C:\Users\JenkinsSlave\workspace\Lucene-Solr-5.x-Windows\solr\build\solr-core\test\J0\temp\solr.handler.TestReplicationHandlerBackup 10D1CB67BF098A67-001\solr-instance-001: java.nio.file.DirectoryNotEmptyException: C:\Users\JenkinsSlave\workspace\Lucene-Solr-5.x-Windows\solr\build\solr-core\test\J0\temp\solr.handler.TestReplicationHandlerBackup 10D1CB67BF098A67-001\solr-instance-001    C:\Users\JenkinsSlave\workspace\Lucene-Solr-5.x-Windows\solr\build\solr-core\test\J0\temp\solr.handler.TestReplicationHandlerBackup 10D1CB67BF098A67-001\solr-instance-001\collection1\data: java.nio.file.AccessDeniedException: C:\Users\JenkinsSlave\workspace\Lucene-Solr-5.x-Windows\solr\build\solr-core\test\J0\temp\solr.handler.TestReplicationHandlerBackup 10D1CB67BF098A67-001\solr-instance-001\collection1\data    C:\Users\JenkinsSlave\workspace\Lucene-Solr-5.x-Windows\solr\build\solr-core\test\J0\temp\solr.handler.TestReplicationHandlerBackup 10D1CB67BF098A67-001\solr-instance-001: java.nio.file.DirectoryNotEmptyException: C:\Users\JenkinsSlave\workspace\Lucene-Solr-5.x-Windows\solr\build\solr-core\test\J0\temp\solr.handler.TestReplicationHandlerBackup 10D1CB67BF098A67-001\solr-instance-001    C:\Users\JenkinsSlave\workspace\Lucene-Solr-5.x-Windows\solr\build\solr-core\test\J0\temp\solr.handler.TestReplicationHandlerBackup 10D1CB67BF098A67-001\solr-instance-002\collection1\data: java.nio.file.AccessDeniedException: C:\Users\JenkinsSlave\workspace\Lucene-Solr-5.x-Windows\solr\build\solr-core\test\J0\temp\solr.handler.TestReplicationHandlerBackup 10D1CB67BF098A67-001\solr-instance-002\collection1\data    C:\Users\JenkinsSlave\workspace\Lucene-Solr-5.x-Windows\solr\build\solr-core\test\J0\temp\solr.handler.TestReplicationHandlerBackup 10D1CB67BF098A67-001\solr-instance-002: java.nio.file.DirectoryNotEmptyException: C:\Users\JenkinsSlave\workspace\Lucene-Solr-5.x-Windows\solr\build\solr-core\test\J0\temp\solr.handler.TestReplicationHandlerBackup 10D1CB67BF098A67-001\solr-instance-002    C:\Users\JenkinsSlave\workspace\Lucene-Solr-5.x-Windows\solr\build\solr-core\test\J0\temp\solr.handler.TestReplicationHandlerBackup 10D1CB67BF098A67-001: java.nio.file.DirectoryNotEmptyException: C:\Users\JenkinsSlave\workspace\Lucene-Solr-5.x-Windows\solr\build\solr-core\test\J0\temp\solr.handler.TestReplicationHandlerBackup 10D1CB67BF098A67-001 

Stack Trace:
java.io.IOException: Could not remove the following files (in the order of attempts):
   C:\Users\JenkinsSlave\workspace\Lucene-Solr-5.x-Windows\solr\build\solr-core\test\J0\temp\solr.handler.TestReplicationHandlerBackup 10D1CB67BF098A67-001\solr-instance-002\collection1: java.nio.file.DirectoryNotEmptyException: C:\Users\JenkinsSlave\workspace\Lucene-Solr-5.x-Windows\solr\build\solr-core\test\J0\temp\solr.handler.TestReplicationHandlerBackup 10D1CB67BF098A67-001\solr-instance-002\collection1
   C:\Users\JenkinsSlave\workspace\Lucene-Solr-5.x-Windows\solr\build\solr-core\test\J0\temp\solr.handler.TestReplicationHandlerBackup 10D1CB67BF098A67-001\solr-instance-002: java.nio.file.DirectoryNotEmptyException: C:\Users\JenkinsSlave\workspace\Lucene-Solr-5.x-Windows\solr\build\solr-core\test\J0\temp\solr.handler.TestReplicationHandlerBackup 10D1CB67BF098A67-001\solr-instance-002
   C:\Users\JenkinsSlave\workspace\Lucene-Solr-5.x-Windows\solr\build\solr-core\test\J0\temp\solr.handler.TestReplicationHandlerBackup 10D1CB67BF098A67-001\solr-instance-001\collection1: java.nio.file.DirectoryNotEmptyException: C:\Users\JenkinsSlave\workspace\Lucene-Solr-5.x-Windows\solr\build\solr-core\test\J0\temp\solr.handler.TestReplicationHandlerBackup 10D1CB67BF098A67-001\solr-instance-001\collection1
   C:\Users\JenkinsSlave\workspace\Lucene-Solr-5.x-Windows\solr\build\solr-core\test\J0\temp\solr.handler.TestReplicationHandlerBackup 10D1CB67BF098A67-001\solr-instance-001: java.nio.file.DirectoryNotEmptyException: C:\Users\JenkinsSlave\workspace\Lucene-Solr-5.x-Windows\solr\build\solr-core\test\J0\temp\solr.handler.TestReplicationHandlerBackup 10D1CB67BF098A67-001\solr-instance-001
   C:\Users\JenkinsSlave\workspace\Lucene-Solr-5.x-Windows\solr\build\solr-core\test\J0\temp\solr.handler.TestReplicationHandlerBackup 10D1CB67BF098A67-001\solr-instance-001\collection1\data: java.nio.file.AccessDeniedException: C:\Users\JenkinsSlave\workspace\Lucene-Solr-5.x-Windows\solr\build\solr-core\test\J0\temp\solr.handler.TestReplicationHandlerBackup 10D1CB67BF098A67-001\solr-instance-001\collection1\data
   C:\Users\JenkinsSlave\workspace\Lucene-Solr-5.x-Windows\solr\build\solr-core\test\J0\temp\solr.handler.TestReplicationHandlerBackup 10D1CB67BF098A67-001\solr-instance-001: java.nio.file.DirectoryNotEmptyException: C:\Users\JenkinsSlave\workspace\Lucene-Solr-5.x-Windows\solr\build\solr-core\test\J0\temp\solr.handler.TestReplicationHandlerBackup 10D1CB67BF098A67-001\solr-instance-001
   C:\Users\JenkinsSlave\workspace\Lucene-Solr-5.x-Windows\solr\build\solr-core\test\J0\temp\solr.handler.TestReplicationHandlerBackup 10D1CB67BF098A67-001\solr-instance-002\collection1\data: java.nio.file.AccessDeniedException: C:\Users\JenkinsSlave\workspace\Lucene-Solr-5.x-Windows\solr\build\solr-core\test\J0\temp\solr.handler.TestReplicationHandlerBackup 10D1CB67BF098A67-001\solr-instance-002\collection1\data
   C:\Users\JenkinsSlave\workspace\Lucene-Solr-5.x-Windows\solr\build\solr-core\test\J0\temp\solr.handler.TestReplicationHandlerBackup 10D1CB67BF098A67-001\solr-instance-002: java.nio.file.DirectoryNotEmptyException: C:\Users\JenkinsSlave\workspace\Lucene-Solr-5.x-Windows\solr\build\solr-core\test\J0\temp\solr.handler.TestReplicationHandlerBackup 10D1CB67BF098A67-001\solr-instance-002
   C:\Users\JenkinsSlave\workspace\Lucene-Solr-5.x-Windows\solr\build\solr-core\test\J0\temp\solr.handler.TestReplicationHandlerBackup 10D1CB67BF098A67-001: java.nio.file.DirectoryNotEmptyException: C:\Users\JenkinsSlave\workspace\Lucene-Solr-5.x-Windows\solr\build\solr-core\test\J0\temp\solr.handler.TestReplicationHandlerBackup 10D1CB67BF098A67-001

	at __randomizedtesting.SeedInfo.seed([10D1CB67BF098A67]:0)
	at org.apache.lucene.util.IOUtils.rm(IOUtils.java:294)
	at org.apache.lucene.util.TestRuleTemporaryFilesCleanup.afterAlways(TestRuleTemporaryFilesCleanup.java:170)
	at com.carrotsearch.randomizedtesting.rules.TestRuleAdapter$1.afterAlways(TestRuleAdapter.java:31)
	at com.carrotsearch.randomizedtesting.rules.StatementAdapter.evaluate(StatementAdapter.java:43)
	at com.carrotsearch.randomizedtesting.rules.StatementAdapter.evaluate(StatementAdapter.java:36)
	at org.apache.lucene.util.TestRuleAssertionsRequired$1.evaluate(TestRuleAssertionsRequired.java:54)
	at org.apache.lucene.util.TestRuleMarkFailure$1.evaluate(TestRuleMarkFailure.java:48)
	at org.apache.lucene.util.TestRuleIgnoreAfterMaxFailures$1.evaluate(TestRuleIgnoreAfterMaxFailures.java:65)
	at org.apache.lucene.util.TestRuleIgnoreTestSuites$1.evaluate(TestRuleIgnoreTestSuites.java:55)
	at com.carrotsearch.randomizedtesting.rules.StatementAdapter.evaluate(StatementAdapter.java:36)
	at com.carrotsearch.randomizedtesting.ThreadLeakControl$StatementRunner.run(ThreadLeakControl.java:365)
	at java.lang.Thread.run(Thread.java:745)




Build Log:
[...truncated 9617 lines...]
   [junit4] Suite: org.apache.solr.cloud.ReplicationFactorTest
   [junit4]   2> Creating dataDir: C:\Users\JenkinsSlave\workspace\Lucene-Solr-5.x-Windows\solr\build\solr-core\test\J0\temp\solr.cloud.ReplicationFactorTest 10D1CB67BF098A67-001\init-core-data-001
   [junit4]   2> 2705394 T10609 oas.BaseDistributedSearchTestCase.initHostContext Setting hostContext system property: /vi_/wu
   [junit4]   2> 2705402 T10609 oasc.ZkTestServer.run STARTING ZK TEST SERVER
   [junit4]   1> client port:0.0.0.0/0.0.0.0:0
   [junit4]   2> 2705404 T10610 oasc.ZkTestServer$ZKServerMain.runFromConfig Starting server
   [junit4]   2> 2705555 T10609 oasc.ZkTestServer.run start zk server on port:64734
   [junit4]   2> 2705555 T10609 oascc.SolrZkClient.createZkCredentialsToAddAutomatically Using default ZkCredentialsProvider
   [junit4]   2> 2705558 T10609 oascc.ConnectionManager.waitForConnected Waiting for client to connect to ZooKeeper
   [junit4]   2> 2705565 T10617 oascc.ConnectionManager.process Watcher org.apache.solr.common.cloud.ConnectionManager@5fe1419e name:ZooKeeperConnection Watcher:127.0.0.1:64734 got event WatchedEvent state:SyncConnected type:None path:null path:null type:None
   [junit4]   2> 2705565 T10609 oascc.ConnectionManager.waitForConnected Client is connected to ZooKeeper
   [junit4]   2> 2705565 T10609 oascc.SolrZkClient.createZkACLProvider Using default ZkACLProvider
   [junit4]   2> 2705565 T10609 oascc.SolrZkClient.makePath makePath: /solr
   [junit4]   2> 2705572 T10609 oascc.SolrZkClient.createZkCredentialsToAddAutomatically Using default ZkCredentialsProvider
   [junit4]   2> 2705575 T10609 oascc.ConnectionManager.waitForConnected Waiting for client to connect to ZooKeeper
   [junit4]   2> 2705578 T10620 oascc.ConnectionManager.process Watcher org.apache.solr.common.cloud.ConnectionManager@14e1c556 name:ZooKeeperConnection Watcher:127.0.0.1:64734/solr got event WatchedEvent state:SyncConnected type:None path:null path:null type:None
   [junit4]   2> 2705578 T10609 oascc.ConnectionManager.waitForConnected Client is connected to ZooKeeper
   [junit4]   2> 2705580 T10609 oascc.SolrZkClient.createZkACLProvider Using default ZkACLProvider
   [junit4]   2> 2705580 T10609 oascc.SolrZkClient.makePath makePath: /collections/collection1
   [junit4]   2> 2705585 T10609 oascc.SolrZkClient.makePath makePath: /collections/collection1/shards
   [junit4]   2> 2705591 T10609 oascc.SolrZkClient.makePath makePath: /collections/control_collection
   [junit4]   2> 2705596 T10609 oascc.SolrZkClient.makePath makePath: /collections/control_collection/shards
   [junit4]   2> 2705600 T10609 oasc.AbstractZkTestCase.putConfig put C:\Users\JenkinsSlave\workspace\Lucene-Solr-5.x-Windows\solr\core\src\test-files\solr\collection1\conf\solrconfig-tlog.xml to /configs/conf1/solrconfig.xml
   [junit4]   2> 2705602 T10609 oascc.SolrZkClient.makePath makePath: /configs/conf1/solrconfig.xml
   [junit4]   2> 2705609 T10609 oasc.AbstractZkTestCase.putConfig put C:\Users\JenkinsSlave\workspace\Lucene-Solr-5.x-Windows\solr\core\src\test-files\solr\collection1\conf\schema.xml to /configs/conf1/schema.xml
   [junit4]   2> 2705610 T10609 oascc.SolrZkClient.makePath makePath: /configs/conf1/schema.xml
   [junit4]   2> 2705616 T10609 oasc.AbstractZkTestCase.putConfig put C:\Users\JenkinsSlave\workspace\Lucene-Solr-5.x-Windows\solr\core\src\test-files\solr\collection1\conf\solrconfig.snippet.randomindexconfig.xml to /configs/conf1/solrconfig.snippet.randomindexconfig.xml
   [junit4]   2> 2705618 T10609 oascc.SolrZkClient.makePath makePath: /configs/conf1/solrconfig.snippet.randomindexconfig.xml
   [junit4]   2> 2705623 T10609 oasc.AbstractZkTestCase.putConfig put C:\Users\JenkinsSlave\workspace\Lucene-Solr-5.x-Windows\solr\core\src\test-files\solr\collection1\conf\stopwords.txt to /configs/conf1/stopwords.txt
   [junit4]   2> 2705623 T10609 oascc.SolrZkClient.makePath makePath: /configs/conf1/stopwords.txt
   [junit4]   2> 2705629 T10609 oasc.AbstractZkTestCase.putConfig put C:\Users\JenkinsSlave\workspace\Lucene-Solr-5.x-Windows\solr\core\src\test-files\solr\collection1\conf\protwords.txt to /configs/conf1/protwords.txt
   [junit4]   2> 2705631 T10609 oascc.SolrZkClient.makePath makePath: /configs/conf1/protwords.txt
   [junit4]   2> 2705637 T10609 oasc.AbstractZkTestCase.putConfig put C:\Users\JenkinsSlave\workspace\Lucene-Solr-5.x-Windows\solr\core\src\test-files\solr\collection1\conf\currency.xml to /configs/conf1/currency.xml
   [junit4]   2> 2705637 T10609 oascc.SolrZkClient.makePath makePath: /configs/conf1/currency.xml
   [junit4]   2> 2705643 T10609 oasc.AbstractZkTestCase.putConfig put C:\Users\JenkinsSlave\workspace\Lucene-Solr-5.x-Windows\solr\core\src\test-files\solr\collection1\conf\enumsConfig.xml to /configs/conf1/enumsConfig.xml
   [junit4]   2> 2705644 T10609 oascc.SolrZkClient.makePath makePath: /configs/conf1/enumsConfig.xml
   [junit4]   2> 2705648 T10609 oasc.AbstractZkTestCase.putConfig put C:\Users\JenkinsSlave\workspace\Lucene-Solr-5.x-Windows\solr\core\src\test-files\solr\collection1\conf\open-exchange-rates.json to /configs/conf1/open-exchange-rates.json
   [junit4]   2> 2705650 T10609 oascc.SolrZkClient.makePath makePath: /configs/conf1/open-exchange-rates.json
   [junit4]   2> 2705656 T10609 oasc.AbstractZkTestCase.putConfig put C:\Users\JenkinsSlave\workspace\Lucene-Solr-5.x-Windows\solr\core\src\test-files\solr\collection1\conf\mapping-ISOLatin1Accent.txt to /configs/conf1/mapping-ISOLatin1Accent.txt
   [junit4]   2> 2705656 T10609 oascc.SolrZkClient.makePath makePath: /configs/conf1/mapping-ISOLatin1Accent.txt
   [junit4]   2> 2705662 T10609 oasc.AbstractZkTestCase.putConfig put C:\Users\JenkinsSlave\workspace\Lucene-Solr-5.x-Windows\solr\core\src\test-files\solr\collection1\conf\old_synonyms.txt to /configs/conf1/old_synonyms.txt
   [junit4]   2> 2705663 T10609 oascc.SolrZkClient.makePath makePath: /configs/conf1/old_synonyms.txt
   [junit4]   2> 2705669 T10609 oasc.AbstractZkTestCase.putConfig put C:\Users\JenkinsSlave\workspace\Lucene-Solr-5.x-Windows\solr\core\src\test-files\solr\collection1\conf\synonyms.txt to /configs/conf1/synonyms.txt
   [junit4]   2> 2705669 T10609 oascc.SolrZkClient.makePath makePath: /configs/conf1/synonyms.txt
   [junit4]   2> 2707875 T10609 oas.SolrTestCaseJ4.writeCoreProperties Writing core.properties file to C:\Users\JenkinsSlave\workspace\Lucene-Solr-5.x-Windows\solr\build\solr-core\test\J0\temp\solr.cloud.ReplicationFactorTest 10D1CB67BF098A67-001\control-001\cores\collection1
   [junit4]   2> 2707882 T10609 oejs.Server.doStart jetty-8.1.10.v20130312
   [junit4]   2> 2707887 T10609 oejs.AbstractConnector.doStart Started SelectChannelConnector@127.0.0.1:64742
   [junit4]   2> 2707888 T10609 oass.SolrDispatchFilter.init SolrDispatchFilter.init()sun.misc.Launcher$AppClassLoader@5f186fab
   [junit4]   2> 2707888 T10609 oasc.SolrResourceLoader.locateSolrHome JNDI not configured for solr (NoInitialContextEx)
   [junit4]   2> 2707888 T10609 oasc.SolrResourceLoader.locateSolrHome using system property solr.solr.home: C:\Users\JenkinsSlave\workspace\Lucene-Solr-5.x-Windows\solr\build\solr-core\test\J0\temp\solr.cloud.ReplicationFactorTest 10D1CB67BF098A67-001\control-001
   [junit4]   2> 2707888 T10609 oasc.SolrResourceLoader.<init> new SolrResourceLoader for directory: 'C:\Users\JenkinsSlave\workspace\Lucene-Solr-5.x-Windows\solr\build\solr-core\test\J0\temp\solr.cloud.ReplicationFactorTest 10D1CB67BF098A67-001\control-001\'
   [junit4]   2> 2707941 T10609 oasc.ConfigSolr.fromFile Loading container configuration from C:\Users\JenkinsSlave\workspace\Lucene-Solr-5.x-Windows\solr\build\solr-core\test\J0\temp\solr.cloud.ReplicationFactorTest 10D1CB67BF098A67-001\control-001\solr.xml
   [junit4]   2> 2707989 T10609 oasc.CorePropertiesLocator.<init> Config-defined core root directory: C:\Users\JenkinsSlave\workspace\Lucene-Solr-5.x-Windows\solr\build\solr-core\test\J0\temp\solr.cloud.ReplicationFactorTest 10D1CB67BF098A67-001\control-001\cores
   [junit4]   2> 2707989 T10609 oasc.CoreContainer.<init> New CoreContainer 1298247336
   [junit4]   2> 2707989 T10609 oasc.CoreContainer.load Loading cores into CoreContainer [instanceDir=C:\Users\JenkinsSlave\workspace\Lucene-Solr-5.x-Windows\solr\build\solr-core\test\J0\temp\solr.cloud.ReplicationFactorTest 10D1CB67BF098A67-001\control-001\]
   [junit4]   2> 2707992 T10609 oashc.HttpShardHandlerFactory.getParameter Setting socketTimeout to: 90000
   [junit4]   2> 2707992 T10609 oashc.HttpShardHandlerFactory.getParameter Setting urlScheme to: 
   [junit4]   2> 2707992 T10609 oashc.HttpShardHandlerFactory.getParameter Setting connTimeout to: 15000
   [junit4]   2> 2707992 T10609 oashc.HttpShardHandlerFactory.getParameter Setting maxConnectionsPerHost to: 20
   [junit4]   2> 2707992 T10609 oashc.HttpShardHandlerFactory.getParameter Setting maxConnections to: 10000
   [junit4]   2> 2707992 T10609 oashc.HttpShardHandlerFactory.getParameter Setting corePoolSize to: 0
   [junit4]   2> 2707992 T10609 oashc.HttpShardHandlerFactory.getParameter Setting maximumPoolSize to: 2147483647
   [junit4]   2> 2707992 T10609 oashc.HttpShardHandlerFactory.getParameter Setting maxThreadIdleTime to: 5
   [junit4]   2> 2707995 T10609 oashc.HttpShardHandlerFactory.getParameter Setting sizeOfQueue to: -1
   [junit4]   2> 2707995 T10609 oashc.HttpShardHandlerFactory.getParameter Setting fairnessPolicy to: false
   [junit4]   2> 2707995 T10609 oashc.HttpShardHandlerFactory.getParameter Setting useRetries to: false
   [junit4]   2> 2707995 T10609 oasu.UpdateShardHandler.<init> Creating UpdateShardHandler HTTP client with params: socketTimeout=340000&connTimeout=45000&retry=true
   [junit4]   2> 2707995 T10609 oasl.LogWatcher.createWatcher SLF4J impl is org.slf4j.impl.Log4jLoggerFactory
   [junit4]   2> 2707995 T10609 oasl.LogWatcher.newRegisteredLogWatcher Registering Log Listener [Log4j (org.slf4j.impl.Log4jLoggerFactory)]
   [junit4]   2> 2707998 T10609 oasc.CoreContainer.load Host Name: 127.0.0.1
   [junit4]   2> 2707998 T10609 oasc.ZkContainer.initZooKeeper Zookeeper client=127.0.0.1:64734/solr
   [junit4]   2> 2707998 T10609 oasc.ZkController.checkChrootPath zkHost includes chroot
   [junit4]   2> 2707999 T10609 oascc.SolrZkClient.createZkCredentialsToAddAutomatically Using default ZkCredentialsProvider
   [junit4]   2> 2708002 T10609 oascc.ConnectionManager.waitForConnected Waiting for client to connect to ZooKeeper
   [junit4]   2> 2708005 T10632 oascc.ConnectionManager.process Watcher org.apache.solr.common.cloud.ConnectionManager@39d081a6 name:ZooKeeperConnection Watcher:127.0.0.1:64734 got event WatchedEvent state:SyncConnected type:None path:null path:null type:None
   [junit4]   2> 2708007 T10609 oascc.ConnectionManager.waitForConnected Client is connected to ZooKeeper
   [junit4]   2> 2708007 T10609 oascc.SolrZkClient.createZkACLProvider Using default ZkACLProvider
   [junit4]   2> 2708010 T10611 oazs.NIOServerCnxn.doIO WARN caught end of stream exception EndOfStreamException: Unable to read additional data from client sessionid 0x14b9be1aec40002, likely client has closed socket
   [junit4]   2> 	at org.apache.zookeeper.server.NIOServerCnxn.doIO(NIOServerCnxn.java:228)
   [junit4]   2> 	at org.apache.zookeeper.server.NIOServerCnxnFactory.run(NIOServerCnxnFactory.java:208)
   [junit4]   2> 	at java.lang.Thread.run(Thread.java:745)
   [junit4]   2> 
   [junit4]   2> 2708013 T10609 oascc.ConnectionManager.waitForConnected Waiting for client to connect to ZooKeeper
   [junit4]   2> 2708016 T10635 oascc.ConnectionManager.process Watcher org.apache.solr.common.cloud.ConnectionManager@350325d7 name:ZooKeeperConnection Watcher:127.0.0.1:64734/solr got event WatchedEvent state:SyncConnected type:None path:null path:null type:None
   [junit4]   2> 2708016 T10609 oascc.ConnectionManager.waitForConnected Client is connected to ZooKeeper
   [junit4]   2> 2708020 T10609 oascc.SolrZkClient.makePath makePath: /overseer/queue
   [junit4]   2> 2708026 T10609 oascc.SolrZkClient.makePath makePath: /overseer/collection-queue-work
   [junit4]   2> 2708033 T10609 oascc.SolrZkClient.makePath makePath: /overseer/collection-map-running
   [junit4]   2> 2708040 T10609 oascc.SolrZkClient.makePath makePath: /overseer/collection-map-completed
   [junit4]   2> 2708049 T10609 oascc.SolrZkClient.makePath makePath: /overseer/collection-map-failure
   [junit4]   2> 2708057 T10609 oascc.SolrZkClient.makePath makePath: /live_nodes
   [junit4]   2> 2708061 T10609 oasc.ZkController.createEphemeralLiveNode Register node as live in ZooKeeper:/live_nodes/127.0.0.1:64741_vi_%2Fwu
   [junit4]   2> 2708062 T10609 oascc.SolrZkClient.makePath makePath: /live_nodes/127.0.0.1:64741_vi_%2Fwu
   [junit4]   2> 2708068 T10609 oascc.SolrZkClient.makePath makePath: /overseer_elect
   [junit4]   2> 2708074 T10609 oascc.SolrZkClient.makePath makePath: /overseer_elect/election
   [junit4]   2> 2708078 T10609 oasc.Overseer.close Overseer (id=null) closing
   [junit4]   2> 2708081 T10609 oasc.OverseerElectionContext.runLeaderProcess I am going to be the leader 127.0.0.1:64741_vi_%2Fwu
   [junit4]   2> 2708083 T10609 oascc.SolrZkClient.makePath makePath: /overseer_elect/leader
   [junit4]   2> 2708087 T10609 oasc.Overseer.start Overseer (id=93339610893254659-127.0.0.1:64741_vi_%2Fwu-n_0000000000) starting
   [junit4]   2> 2708093 T10609 oascc.SolrZkClient.makePath makePath: /overseer/queue-work
   [junit4]   2> 2708114 T10609 oasc.OverseerAutoReplicaFailoverThread.<init> Starting OverseerAutoReplicaFailoverThread autoReplicaFailoverWorkLoopDelay=10000 autoReplicaFailoverWaitAfterExpiration=30000 autoReplicaFailoverBadNodeExpiration=60000
   [junit4]   2> 2708115 T10637 oasc.OverseerCollectionProcessor.run Process current queue of collection creations
   [junit4]   2> 2708117 T10636 oasc.Overseer$ClusterStateUpdater.run Starting to work on the main queue
   [junit4]   2> 2708118 T10609 oascc.SolrZkClient.makePath makePath: /clusterstate.json
   [junit4]   2> 2708124 T10609 oascc.SolrZkClient.makePath makePath: /aliases.json
   [junit4]   2> 2708128 T10609 oascc.ZkStateReader.createClusterStateWatchersAndUpdate Updating cluster state from ZooKeeper... 
   [junit4]   2> 2708141 T10609 oasc.CorePropertiesLocator.discover Looking for core definitions underneath C:\Users\JenkinsSlave\workspace\Lucene-Solr-5.x-Windows\solr\build\solr-core\test\J0\temp\solr.cloud.ReplicationFactorTest 10D1CB67BF098A67-001\control-001\cores
   [junit4]   2> 2708144 T10609 oasc.CorePropertiesLocator.discoverUnder Found core collection1 in C:\Users\JenkinsSlave\workspace\Lucene-Solr-5.x-Windows\solr\build\solr-core\test\J0\temp\solr.cloud.ReplicationFactorTest 10D1CB67BF098A67-001\control-001\cores\collection1\
   [junit4]   2> 2708144 T10609 oasc.CorePropertiesLocator.discover Found 1 core definitions
   [junit4]   2> 2708149 T10639 oasc.ZkController.publish publishing core=collection1 state=down collection=control_collection
   [junit4]   2> 2708149 T10639 oasc.ZkController.publish numShards not found on descriptor - reading it from system property
   [junit4]   2> 2708150 T10635 oasc.DistributedQueue$LatchWatcher.process NodeChildrenChanged fired on path /overseer/queue state SyncConnected
   [junit4]   2> 2708150 T10639 oasc.ZkController.waitForCoreNodeName look for our core node name
   [junit4]   2> 2708153 T10636 oasc.Overseer$ClusterStateUpdater.run processMessage: queueSize: 1, message = {
   [junit4]   2> 	  "numShards":"1",
   [junit4]   2> 	  "shard":null,
   [junit4]   2> 	  "base_url":"http://127.0.0.1:64741/vi_/wu",
   [junit4]   2> 	  "node_name":"127.0.0.1:64741_vi_%2Fwu",
   [junit4]   2> 	  "state":"down",
   [junit4]   2> 	  "operation":"state",
   [junit4]   2> 	  "roles":null,
   [junit4]   2> 	  "core":"collection1",
   [junit4]   2> 	  "collection":"control_collection"} current state version: 0
   [junit4]   2> 2708155 T10636 oasco.ReplicaMutator.updateState Update state numShards=1 message={
   [junit4]   2> 	  "numShards":"1",
   [junit4]   2> 	  "shard":null,
   [junit4]   2> 	  "base_url":"http://127.0.0.1:64741/vi_/wu",
   [junit4]   2> 	  "node_name":"127.0.0.1:64741_vi_%2Fwu",
   [junit4]   2> 	  "state":"down",
   [junit4]   2> 	  "operation":"state",
   [junit4]   2> 	  "roles":null,
   [junit4]   2> 	  "core":"collection1",
   [junit4]   2> 	  "collection":"control_collection"}
   [junit4]   2> 2708155 T10636 oasco.ClusterStateMutator.createCollection building a new cName: control_collection
   [junit4]   2> 2708155 T10636 oasco.ReplicaMutator.updateState Assigning new node to shard shard=shard1
   [junit4]   2> 2708158 T10635 oascc.ZkStateReader$2.process A cluster state change: WatchedEvent state:SyncConnected type:NodeDataChanged path:/clusterstate.json, has occurred - updating... (live nodes size: 1)
   [junit4]   2> 2709650 T10639 oasc.ZkController.waitForShardId waiting to find shard id in clusterstate for collection1
   [junit4]   2> 2709650 T10639 oasc.ZkController.createCollectionZkNode Check for collection zkNode:control_collection
   [junit4]   2> 2709652 T10639 oasc.ZkController.createCollectionZkNode Collection zkNode exists
   [junit4]   2> 2709652 T10639 oascc.ZkStateReader.readConfigName Load collection config from:/collections/control_collection
   [junit4]   2> 2709655 T10639 oascc.ZkStateReader.readConfigName path=/collections/control_collection configName=conf1 specified config exists in ZooKeeper
   [junit4]   2> 2709655 T10639 oasc.SolrResourceLoader.<init> new SolrResourceLoader for directory: 'C:\Users\JenkinsSlave\workspace\Lucene-Solr-5.x-Windows\solr\build\solr-core\test\J0\temp\solr.cloud.ReplicationFactorTest 10D1CB67BF098A67-001\control-001\cores\collection1\'
   [junit4]   2> 2709710 T10639 oasc.ZkController.watchZKConfDir watch zkdir /configs/conf1
   [junit4]   2> 2709716 T10639 oasc.Config.<init> loaded config solrconfig.xml with version 0 
   [junit4]   2> 2709732 T10639 oasc.SolrConfig.refreshRequestParams current version of requestparams : -1
   [junit4]   2> 2709769 T10639 oasc.SolrConfig.<init> Using Lucene MatchVersion: 5.1.0
   [junit4]   2> 2709847 T10639 oasc.SolrConfig.<init> Loaded SolrConfig: solrconfig.xml
   [junit4]   2> 2709851 T10639 oass.IndexSchema.readSchema Reading Solr Schema from /configs/conf1/schema.xml
   [junit4]   2> 2709864 T10639 oass.IndexSchema.readSchema [collection1] Schema name=test
   [junit4]   2> 2710420 T10639 oass.OpenExchangeRatesOrgProvider.init Initialized with rates=open-exchange-rates.json, refreshInterval=1440.
   [junit4]   2> 2710432 T10639 oass.IndexSchema.readSchema default search field in schema is text
   [junit4]   2> 2710435 T10639 oass.IndexSchema.readSchema unique key field: id
   [junit4]   2> 2710457 T10639 oass.FileExchangeRateProvider.reload Reloading exchange rates from file currency.xml
   [junit4]   2> 2710464 T10639 oass.FileExchangeRateProvider.reload Reloading exchange rates from file currency.xml
   [junit4]   2> 2710469 T10639 oass.OpenExchangeRatesOrgProvider.reload Reloading exchange rates from open-exchange-rates.json
   [junit4]   2> 2710471 T10639 oass.OpenExchangeRatesOrgProvider$OpenExchangeRates.<init> WARN Unknown key IMPORTANT NOTE
   [junit4]   2> 2710472 T10639 oass.OpenExchangeRatesOrgProvider$OpenExchangeRates.<init> WARN Expected key, got STRING
   [junit4]   2> 2710472 T10639 oass.OpenExchangeRatesOrgProvider.reload Reloading exchange rates from open-exchange-rates.json
   [junit4]   2> 2710474 T10639 oass.OpenExchangeRatesOrgProvider$OpenExchangeRates.<init> WARN Unknown key IMPORTANT NOTE
   [junit4]   2> 2710474 T10639 oass.OpenExchangeRatesOrgProvider$OpenExchangeRates.<init> WARN Expected key, got STRING
   [junit4]   2> 2710474 T10639 oasc.CoreContainer.create Creating SolrCore 'collection1' using configuration from collection control_collection
   [junit4]   2> 2710474 T10639 oasc.SolrCore.initDirectoryFactory org.apache.solr.core.MockDirectoryFactory
   [junit4]   2> 2710476 T10639 oasc.SolrCore.<init> [collection1] Opening new SolrCore at C:\Users\JenkinsSlave\workspace\Lucene-Solr-5.x-Windows\solr\build\solr-core\test\J0\temp\solr.cloud.ReplicationFactorTest 10D1CB67BF098A67-001\control-001\cores\collection1\, dataDir=C:\Users\JenkinsSlave\workspace\Lucene-Solr-5.x-Windows\solr\build\solr-core\test\J0\temp\solr.cloud.ReplicationFactorTest 10D1CB67BF098A67-001\tempDir-001/control/data\
   [junit4]   2> 2710476 T10639 oasc.JmxMonitoredMap.<init> JMX monitoring is enabled. Adding Solr mbeans to JMX Server: com.sun.jmx.mbeanserver.JmxMBeanServer@797f3214
   [junit4]   2> 2710477 T10639 oasc.CachingDirectoryFactory.get return new directory for C:\Users\JenkinsSlave\workspace\Lucene-Solr-5.x-Windows\solr\build\solr-core\test\J0\temp\solr.cloud.ReplicationFactorTest 10D1CB67BF098A67-001\tempDir-001/control/data\
   [junit4]   2> 2710477 T10639 oasc.SolrCore.getNewIndexDir New index directory detected: old=null new=C:\Users\JenkinsSlave\workspace\Lucene-Solr-5.x-Windows\solr\build\solr-core\test\J0\temp\solr.cloud.ReplicationFactorTest 10D1CB67BF098A67-001\tempDir-001/control/data\index/
   [junit4]   2> 2710477 T10639 oasc.SolrCore.initIndex WARN [collection1] Solr index directory 'C:\Users\JenkinsSlave\workspace\Lucene-Solr-5.x-Windows\solr\build\solr-core\test\J0\temp\solr.cloud.ReplicationFactorTest 10D1CB67BF098A67-001\tempDir-001\control\data\index' doesn't exist. Creating new index...
   [junit4]   2> 2710477 T10639 oasc.CachingDirectoryFactory.get return new directory for C:\Users\JenkinsSlave\workspace\Lucene-Solr-5.x-Windows\solr\build\solr-core\test\J0\temp\solr.cloud.ReplicationFactorTest 10D1CB67BF098A67-001\tempDir-001/control/data\index
   [junit4]   2> 2710478 T10639 oasu.RandomMergePolicy.<init> RandomMergePolicy wrapping class org.apache.lucene.index.LogDocMergePolicy: [LogDocMergePolicy: minMergeSize=1000, mergeFactor=33, maxMergeSize=9223372036854775807, maxMergeSizeForForcedMerge=9223372036854775807, calibrateSizeByDeletes=true, maxMergeDocs=2147483647, maxCFSSegmentSizeMB=8.796093022207999E12, noCFSRatio=1.0]
   [junit4]   2> 2710478 T10639 oasc.SolrDeletionPolicy.onCommit SolrDeletionPolicy.onCommit: commits: num=1
   [junit4]   2> 		commit{dir=MockDirectoryWrapper(RAMDirectory@58f85315 lockFactory=org.apache.lucene.store.SingleInstanceLockFactory@1716b555),segFN=segments_1,generation=1}
   [junit4]   2> 2710480 T10639 oasc.SolrDeletionPolicy.updateCommits newest commit generation = 1
   [junit4]   2> 2710484 T10639 oasup.UpdateRequestProcessorChain.init creating updateRequestProcessorChain "nodistrib"
   [junit4]   2> 2710484 T10639 oasup.UpdateRequestProcessorChain.init creating updateRequestProcessorChain "dedupe"
   [junit4]   2> 2710485 T10639 oasup.UpdateRequestProcessorChain.init inserting DistributedUpdateProcessorFactory into updateRequestProcessorChain "dedupe"
   [junit4]   2> 2710485 T10639 oasup.UpdateRequestProcessorChain.init creating updateRequestProcessorChain "stored_sig"
   [junit4]   2> 2710485 T10639 oasup.UpdateRequestProcessorChain.init inserting DistributedUpdateProcessorFactory into updateRequestProcessorChain "stored_sig"
   [junit4]   2> 2710485 T10639 oasup.UpdateRequestProcessorChain.init creating updateRequestProcessorChain "distrib-dup-test-chain-explicit"
   [junit4]   2> 2710486 T10639 oasup.UpdateRequestProcessorChain.init creating updateRequestProcessorChain "distrib-dup-test-chain-implicit"
   [junit4]   2> 2710486 T10639 oasup.UpdateRequestProcessorChain.init inserting DistributedUpdateProcessorFactory into updateRequestProcessorChain "distrib-dup-test-chain-implicit"
   [junit4]   2> 2710486 T10639 oasc.SolrCore.loadUpdateProcessorChains no updateRequestProcessorChain defined as default, creating implicit default
   [junit4]   2> 2710488 T10639 oasc.RequestHandlers.initHandlersFromConfig created /update: org.apache.solr.handler.UpdateRequestHandler
   [junit4]   2> 2710488 T10639 oasc.RequestHandlers.initHandlersFromConfig created /update/json: org.apache.solr.handler.UpdateRequestHandler
   [junit4]   2> 2710489 T10639 oasc.RequestHandlers.initHandlersFromConfig created /update/csv: org.apache.solr.handler.UpdateRequestHandler
   [junit4]   2> 2710489 T10639 oasc.RequestHandlers.initHandlersFromConfig created /update/json/docs: org.apache.solr.handler.UpdateRequestHandler
   [junit4]   2> 2710489 T10639 oasc.RequestHandlers.initHandlersFromConfig created /config: org.apache.solr.handler.SolrConfigHandler
   [junit4]   2> 2710490 T10639 oasc.RequestHandlers.initHandlersFromConfig created /schema: org.apache.solr.handler.SchemaHandler
   [junit4]   2> 2710490 T10639 oasc.RequestHandlers.initHandlersFromConfig created /replication: org.apache.solr.handler.ReplicationHandler
   [junit4]   2> 2710492 T10639 oasc.RequestHandlers.initHandlersFromConfig created /get: org.apache.solr.handler.RealTimeGetHandler
   [junit4]   2> 2710492 T10639 oasc.RequestHandlers.initHandlersFromConfig created /admin/luke: org.apache.solr.handler.admin.LukeRequestHandler
   [junit4]   2> 2710493 T10639 oasc.RequestHandlers.initHandlersFromConfig created /admin/system: org.apache.solr.handler.admin.SystemInfoHandler
   [junit4]   2> 2710494 T10639 oasc.RequestHandlers.initHandlersFromConfig created /admin/mbeans: org.apache.solr.handler.admin.SolrInfoMBeanHandler
   [junit4]   2> 2710494 T10639 oasc.RequestHandlers.initHandlersFromConfig created /admin/plugins: org.apache.solr.handler.admin.PluginInfoHandler
   [junit4]   2> 2710496 T10639 oasc.RequestHandlers.initHandlersFromConfig created /admin/threads: org.apache.solr.handler.admin.ThreadDumpHandler
   [junit4]   2> 2710496 T10639 oasc.RequestHandlers.initHandlersFromConfig created /admin/properties: org.apache.solr.handler.admin.PropertiesRequestHandler
   [junit4]   2> 2710496 T10639 oasc.RequestHandlers.initHandlersFromConfig created /admin/logging: org.apache.solr.handler.admin.LoggingHandler
   [junit4]   2> 2710497 T10639 oasc.RequestHandlers.initHandlersFromConfig created /admin/file: solr.admin.ShowFileRequestHandler
   [junit4]   2> 2710497 T10639 oasc.RequestHandlers.initHandlersFromConfig created /admin/ping: org.apache.solr.handler.PingRequestHandler
   [junit4]   2> 2710500 T10639 oasc.RequestHandlers.initHandlersFromConfig created standard: solr.StandardRequestHandler
   [junit4]   2> 2710505 T10639 oashl.XMLLoader.init xsltCacheLifetimeSeconds=60
   [junit4]   2> 2710507 T10639 oashl.XMLLoader.init xsltCacheLifetimeSeconds=60
   [junit4]   2> 2710509 T10639 oashl.XMLLoader.init xsltCacheLifetimeSeconds=60
   [junit4]   2> 2710511 T10639 oashl.XMLLoader.init xsltCacheLifetimeSeconds=60
   [junit4]   2> 2710515 T10639 oasc.SolrCore.initStatsCache Using default statsCache cache: org.apache.solr.search.stats.LocalStatsCache
   [junit4]   2> 2710519 T10639 oasu.CommitTracker.<init> Hard AutoCommit: disabled
   [junit4]   2> 2710519 T10639 oasu.CommitTracker.<init> Soft AutoCommit: disabled
   [junit4]   2> 2710521 T10639 oasu.RandomMergePolicy.<init> RandomMergePolicy wrapping class org.apache.lucene.index.LogByteSizeMergePolicy: [LogByteSizeMergePolicy: minMergeSize=1677721, mergeFactor=40, maxMergeSize=2147483648, maxMergeSizeForForcedMerge=9223372036854775807, calibrateSizeByDeletes=false, maxMergeDocs=2147483647, maxCFSSegmentSizeMB=8.796093022207999E12, noCFSRatio=1.0]
   [junit4]   2> 2710521 T10639 oasc.SolrDeletionPolicy.onInit SolrDeletionPolicy.onInit: commits: num=1
   [junit4]   2> 		commit{dir=MockDirectoryWrapper(RAMDirectory@58f85315 lockFactory=org.apache.lucene.store.SingleInstanceLockFactory@1716b555),segFN=segments_1,generation=1}
   [junit4]   2> 2710522 T10639 oasc.SolrDeletionPolicy.updateCommits newest commit generation = 1
   [junit4]   2> 2710522 T10639 oass.SolrIndexSearcher.<init> Opening Searcher@5c00b33f[collection1] main
   [junit4]   2> 2710522 T10639 oascc.ZkStateReader.readConfigName Load collection config from:/collections/control_collection
   [junit4]   2> 2710525 T10639 oascc.ZkStateReader.readConfigName path=/collections/control_collection configName=conf1 specified config exists in ZooKeeper
   [junit4]   2> 2710525 T10639 oasr.ManagedResourceStorage.newStorageIO Setting up ZooKeeper-based storage for the RestManager with znodeBase: /configs/conf1
   [junit4]   2> 2710526 T10639 oasr.ManagedResourceStorage$ZooKeeperStorageIO.configure Configured ZooKeeperStorageIO with znodeBase: /configs/conf1
   [junit4]   2> 2710526 T10639 oasr.RestManager.init Initializing RestManager with initArgs: {}
   [junit4]   2> 2710526 T10639 oasr.ManagedResourceStorage.load Reading _rest_managed.json using ZooKeeperStorageIO:path=/configs/conf1
   [junit4]   2> 2710527 T10639 oasr.ManagedResourceStorage$ZooKeeperStorageIO.openInputStream No data found for znode /configs/conf1/_rest_managed.json
   [junit4]   2> 2710527 T10639 oasr.ManagedResourceStorage.load Loaded null at path _rest_managed.json using ZooKeeperStorageIO:path=/configs/conf1
   [junit4]   2> 2710527 T10639 oasr.RestManager.init Initializing 0 registered ManagedResources
   [junit4]   2> 2710527 T10639 oash.ReplicationHandler.inform Commits will be reserved for  10000
   [junit4]   2> 2710529 T10639 oasc.CoreContainer.registerCore registering core: collection1
   [junit4]   2> 2710529 T10640 oasc.SolrCore.registerSearcher [collection1] Registered new searcher Searcher@5c00b33f[collection1] main{ExitableDirectoryReader(UninvertingDirectoryReader())}
   [junit4]   2> 2710530 T10643 oasc.ZkController.register Register replica - core:collection1 address:http://127.0.0.1:64741/vi_/wu collection:control_collection shard:shard1
   [junit4]   2> 2710530 T10609 oass.SolrDispatchFilter.init user.dir=C:\Users\JenkinsSlave\workspace\Lucene-Solr-5.x-Windows\solr\build\solr-core\test\J0
   [junit4]   2> 2710530 T10609 oass.SolrDispatchFilter.init SolrDispatchFilter.init() done
   [junit4]   2> 2710531 T10643 oascc.SolrZkClient.makePath makePath: /collections/control_collection/leader_elect/shard1/election
   [junit4]   2> 2710531 T10609 oascc.SolrZkClient.createZkCredentialsToAddAutomatically Using default ZkCredentialsProvider
   [junit4]   2> 2710535 T10609 oascc.ConnectionManager.waitForConnected Waiting for client to connect to ZooKeeper
   [junit4]   2> 2710538 T10647 oascc.ConnectionManager.process Watcher org.apache.solr.common.cloud.ConnectionManager@19d8ffee name:ZooKeeperConnection Watcher:127.0.0.1:64734/solr got event WatchedEvent state:SyncConnected type:None path:null path:null type:None
   [junit4]   2> 2710539 T10609 oascc.ConnectionManager.waitForConnected Client is connected to ZooKeeper
   [junit4]   2> 2710539 T10609 oascc.SolrZkClient.createZkACLProvider Using default ZkACLProvider
   [junit4]   2> 2710540 T10609 oascc.ZkStateReader.createClusterStateWatchersAndUpdate Updating cluster state from ZooKeeper... 
   [junit4]   2> 2710544 T10643 oasc.ShardLeaderElectionContext.runLeaderProcess Running the leader process for shard shard1
   [junit4]   2> 2710548 T10635 oasc.DistributedQueue$LatchWatcher.process NodeChildrenChanged fired on path /overseer/queue state SyncConnected
   [junit4]   2> 2710550 T10609 oasc.ChaosMonkey.monkeyLog monkey: init - expire sessions:false cause connection loss:false
   [junit4]   2> 2710550 T10643 oasc.ShardLeaderElectionContext.waitForReplicasToComeUp Enough replicas found to continue.
   [junit4]   2> 2710550 T10643 oasc.ShardLeaderElectionContext.runLeaderProcess I may be the new leader - try and sync
   [junit4]   2> ASYNC  NEW_CORE C8539 name=collection1 org.apache.solr.core.SolrCore@5d1c2ef4 url=http://127.0.0.1:64741/vi_/wu/collection1 node=127.0.0.1:64741_vi_%2Fwu C8539_STATE=coll:control_collection core:collection1 props:{base_url=http://127.0.0.1:64741/vi_/wu, node_name=127.0.0.1:64741_vi_%2Fwu, state=down, core=collection1}
   [junit4]   2> 2710550 T10643 C8539 P64741 oasc.SyncStrategy.sync Sync replicas to http://127.0.0.1:64741/vi_/wu/collection1/
   [junit4]   2> 2710551 T10643 C8539 P64741 oasc.SyncStrategy.syncReplicas Sync Success - now sync replicas to me
   [junit4]   2> 2710551 T10643 C8539 P64741 oasc.SyncStrategy.syncToMe http://127.0.0.1:64741/vi_/wu/collection1/ has no replicas
   [junit4]   2> 2710551 T10643 oasc.ShardLeaderElectionContext.runLeaderProcess I am the new leader: http://127.0.0.1:64741/vi_/wu/collection1/ shard1
   [junit4]   2> 2710550 T10609 oasc.AbstractFullDistribZkTestBase.createJettys Creating collection1 with stateFormat=2
   [junit4]   2> 2710551 T10609 oascc.SolrZkClient.createZkCredentialsToAddAutomatically Using default ZkCredentialsProvider
   [junit4]   2> 2710551 T10643 oascc.SolrZkClient.makePath makePath: /collections/control_collection/leaders/shard1
   [junit4]   2> 2710551 T10636 oasc.Overseer$ClusterStateUpdater.run processMessage: queueSize: 1, message = {
   [junit4]   2> 	  "operation":"leader",
   [junit4]   2> 	  "shard":"shard1",
   [junit4]   2> 	  "collection":"control_collection"} current state version: 1
   [junit4]   2> 2710555 T10609 oascc.ConnectionManager.waitForConnected Waiting for client to connect to ZooKeeper
   [junit4]   2> 2710555 T10647 oascc.ZkStateReader$2.process A cluster state change: WatchedEvent state:SyncConnected type:NodeDataChanged path:/clusterstate.json, has occurred - updating... (live nodes size: 1)
   [junit4]   2> 2710555 T10635 oascc.ZkStateReader$2.process A cluster state change: WatchedEvent state:SyncConnected type:NodeDataChanged path:/clusterstate.json, has occurred - updating... (live nodes size: 1)
   [junit4]   2> 2710561 T10650 oascc.ConnectionManager.process Watcher org.apache.solr.common.cloud.ConnectionManager@3a5d4efe name:ZooKeeperConnection Watcher:127.0.0.1:64734/solr got event WatchedEvent state:SyncConnected type:None path:null path:null type:None
   [junit4]   2> 2710563 T10609 oascc.ConnectionManager.waitForConnected Client is connected to ZooKeeper
   [junit4]   2> 2710563 T10609 oascc.SolrZkClient.createZkACLProvider Using default ZkACLProvider
   [junit4]   2> 2710568 T10611 oazs.NIOServerCnxn.doIO WARN caught end of stream exception EndOfStreamException: Unable to read additional data from client sessionid 0x14b9be1aec40005, likely client has closed socket
   [junit4]   2> 	at org.apache.zookeeper.server.NIOServerCnxn.doIO(NIOServerCnxn.java:228)
   [junit4]   2> 	at org.apache.zookeeper.server.NIOServerCnxnFactory.run(NIOServerCnxnFactory.java:208)
   [junit4]   2> 	at java.lang.Thread.run(Thread.java:745)
   [junit4]   2> 
   [junit4]   2> 2710572 T10636 oasc.Overseer$ClusterStateUpdater.run processMessage: queueSize: 2, message = {
   [junit4]   2> 	  "operation":"create",
   [junit4]   2> 	  "name":"collection1",
   [junit4]   2> 	  "numShards":"3",
   [junit4]   2> 	  "stateFormat":"2"} current state version: 2
   [junit4]   2> 2710572 T10636 oasco.ClusterStateMutator.createCollection building a new cName: collection1
   [junit4]   2> 2710577 T10635 oasc.DistributedQueue$LatchWatcher.process NodeChildrenChanged fired on path /overseer/queue state SyncConnected
   [junit4]   2> 2710580 T10636 oasc.Overseer$ClusterStateUpdater.run processMessage: queueSize: 1, message = {
   [junit4]   2> 	  "operation":"leader",
   [junit4]   2> 	  "shard":"shard1",
   [junit4]   2> 	  "collection":"control_collection",
   [junit4]   2> 	  "base_url":"http://127.0.0.1:64741/vi_/wu",
   [junit4]   2> 	  "core":"collection1",
   [junit4]   2> 	  "state":"active"} current state version: 2
   [junit4]   2> 2710581 T10636 oasco.ZkStateWriter.writePendingUpdates going to create_collection /collections/collection1/state.json
   [junit4]   2> 2710584 T10635 oascc.ZkStateReader$2.process A cluster state change: WatchedEvent state:SyncConnected type:NodeDataChanged path:/clusterstate.json, has occurred - updating... (live nodes size: 1)
   [junit4]   2> 2710584 T10647 oascc.ZkStateReader$2.process A cluster state change: WatchedEvent state:SyncConnected type:NodeDataChanged path:/clusterstate.json, has occurred - updating... (live nodes size: 1)
   [junit4]   2> 2710594 T10635 oasc.DistributedQueue$LatchWatcher.process NodeChildrenChanged fired on path /overseer/queue state SyncConnected
   [junit4]   2> 2710733 T10647 oascc.ZkStateReader$2.process A cluster state change: WatchedEvent state:SyncConnected type:NodeDataChanged path:/clusterstate.json, has occurred - updating... (live nodes size: 1)
   [junit4]   2> 2710733 T10635 oascc.ZkStateReader$2.process A cluster state change: WatchedEvent state:SyncConnected type:NodeDataChanged path:/clusterstate.json, has occurred - updating... (live nodes size: 1)
   [junit4]   2> 2710779 T10643 oasc.ZkController.register We are http://127.0.0.1:64741/vi_/wu/collection1/ and leader is http://127.0.0.1:64741/vi_/wu/collection1/
   [junit4]   2> 2710779 T10643 oasc.ZkController.register No LogReplay needed for core=collection1 baseURL=http://127.0.0.1:64741/vi_/wu
   [junit4]   2> 2710779 T10643 oasc.ZkController.checkRecovery I am the leader, no recovery necessary
   [junit4]   2> 2710779 T10643 oasc.ZkController.publish publishing core=collection1 state=active collection=control_collection
   [junit4]   2> 2710779 T10643 oasc.ZkController.publish numShards not found on descriptor - reading it from system property
   [junit4]   2> 2710782 T10635 oasc.DistributedQueue$LatchWatcher.process NodeChildrenChanged fired on path /overseer/queue state SyncConnected
   [junit4]   2> 2710786 T10636 oasc.Overseer$ClusterStateUpdater.run processMessage: queueSize: 1, message = {
   [junit4]   2> 	  "numShards":"3",
   [junit4]   2> 	  "core_node_name":"core_node1",
   [junit4]   2> 	  "shard":"shard1",
   [junit4]   2> 	  "base_url":"http://127.0.0.1:64741/vi_/wu",
   [junit4]   2> 	  "node_name":"127.0.0.1:64741_vi_%2Fwu",
   [junit4]   2> 	  "state":"active",
   [junit4]   2> 	  "operation":"state",
   [junit4]   2> 	  "roles":null,
   [junit4]   2> 	  "core":"collection1",
   [junit4]   2> 	  "collection":"control_collection"} current state version: 4
   [junit4]   2> 2710787 T10636 oasco.ReplicaMutator.updateState Update state numShards=3 message={
   [junit4]   2> 	  "numShards":"3",
   [junit4]   2> 	  "core_node_name":"core_node1",
   [junit4]   2> 	  "shard":"shard1",
   [junit4]   2> 	  "base_url":"http://127.0.0.1:64741/vi_/wu",
   [junit4]   2> 	  "node_name":"127.0.0.1:64741_vi_%2Fwu",
   [junit4]   2> 	  "state":"active",
   [junit4]   2> 	  "operation":"state",
   [junit4]   2> 	  "roles":null,
   [junit4]   2> 	  "core":"collection1",
   [junit4]   2> 	  "collection":"control_collection"}
   [junit4]   2> 2710929 T10635 oascc.ZkStateReader$2.process A cluster state change: WatchedEvent state:SyncConnected type:NodeDataChanged path:/clusterstate.json, has occurred - updating... (live nodes size: 1)
   [junit4]   2> 2710931 T10647 oascc.ZkStateReader$2.process A cluster state change: WatchedEvent state:SyncConnected type:NodeDataChanged path:/clusterstate.json, has occurred - updating... (live nodes size: 1)
   [junit4]   2> 2712424 T10609 oas.SolrTestCaseJ4.writeCoreProperties Writing core.properties file to C:\Users\JenkinsSlave\workspace\Lucene-Solr-5.x-Windows\solr\build\solr-core\test\J0\temp\solr.cloud.ReplicationFactorTest 10D1CB67BF098A67-001\shard-1-001\cores\collection1
   [junit4]   2> 2712430 T10609 oasc.AbstractFullDistribZkTestBase.createJettys create jetty 1
   [junit4]   2> 2712430 T10609 oejs.Server.doStart jetty-8.1.10.v20130312
   [junit4]   2> 2712435 T10609 oejs.AbstractConnector.doStart Started SelectChannelConnector@127.0.0.1:64758
   [junit4]   2> 2712435 T10609 oass.SolrDispatchFilter.init SolrDispatchFilter.init()sun.misc.Launcher$AppClassLoader@5f186fab
   [junit4]   2> 2712435 T10609 oasc.SolrResourceLoader.locateSolrHome JNDI not configured for solr (NoInitialContextEx)
   [junit4]   2> 2712436 T10609 oasc.SolrResourceLoader.locateSolrHome using system property solr.solr.home: C:\Users\JenkinsSlave\workspace\Lucene-Solr-5.x-Windows\solr\build\solr-core\test\J0\temp\solr.cloud.ReplicationFactorTest 10D1CB67BF098A67-001\shard-1-001
   [junit4]   2> 2712436 T10609 oasc.SolrResourceLoader.<init> new SolrResourceLoader for directory: 'C:\Users\JenkinsSlave\workspace\Lucene-Solr-5.x-Windows\solr\build\solr-core\test\J0\temp\solr.cloud.ReplicationFactorTest 10D1CB67BF098A67-001\shard-1-001\'
   [junit4]   2> 2712481 T10609 oasc.ConfigSolr.fromFile Loading container configuration from C:\Users\JenkinsSlave\workspace\Lucene-Solr-5.x-Windows\solr\build\solr-core\test\J0\temp\solr.cloud.ReplicationFactorTest 10D1CB67BF098A67-001\shard-1-001\solr.xml
   [junit4]   2> 2712523 T10609 oasc.CorePropertiesLocator.<init> Config-defined core root directory: C:\Users\JenkinsSlave\workspace\Lucene-Solr-5.x-Windows\solr\build\solr-core\test\J0\temp\solr.cloud.ReplicationFactorTest 10D1CB67BF098A67-001\shard-1-001\cores
   [junit4]   2> 2712523 T10609 oasc.CoreContainer.<init> New CoreContainer 2091558149
   [junit4]   2> 2712523 T10609 oasc.CoreContainer.load Loading cores into CoreContainer [instanceDir=C:\Users\JenkinsSlave\workspace\Lucene-Solr-5.x-Windows\solr\build\solr-core\test\J0\temp\solr.cloud.ReplicationFactorTest 10D1CB67BF098A67-001\shard-1-001\]
   [junit4]   2> 2712527 T10609 oashc.HttpShardHandlerFactory.getParameter Setting socketTimeout to: 90000
   [junit4]   2> 2712527 T10609 oashc.HttpShardHandlerFactory.getParameter Setting urlScheme to: 
   [junit4]   2> 2712527 T10609 oashc.HttpShardHandlerFactory.getParameter Setting connTimeout to: 15000
   [junit4]   2> 2712527 T10609 oashc.HttpShardHandlerFactory.getParameter Setting maxConnectionsPerHost to: 20
   [junit4]   2> 2712527 T10609 oashc.HttpShardHandlerFactory.getParameter Setting maxConnections to: 10000
   [junit4]   2> 2712527 T10609 oashc.HttpShardHandlerFactory.getParameter Setting corePoolSize to: 0
   [junit4]   2> 2712527 T10609 oashc.HttpShardHandlerFactory.getParameter Setting maximumPoolSize to: 2147483647
   [junit4]   2> 2712527 T10609 oashc.HttpShardHandlerFactory.getParameter Setting maxThreadIdleTime to: 5
   [junit4]   2> 2712527 T10609 oashc.HttpShardHandlerFactory.getParameter Setting sizeOfQueue to: -1
   [junit4]   2> 2712527 T10609 oashc.HttpShardHandlerFactory.getParameter Setting fairnessPolicy to: false
   [junit4]   2> 2712527 T10609 oashc.HttpShardHandlerFactory.getParameter Setting useRetries to: false
   [junit4]   2> 2712527 T10609 oasu.UpdateShardHandler.<init> Creating UpdateShardHandler HTTP client with params: socketTimeout=340000&connTimeout=45000&retry=true
   [junit4]   2> 2712531 T10609 oasl.LogWatcher.createWatcher SLF4J impl is org.slf4j.impl.Log4jLoggerFactory
   [junit4]   2> 2712531 T10609 oasl.LogWatcher.newRegisteredLogWatcher Registering Log Listener [Log4j (org.slf4j.impl.Log4jLoggerFactory)]
   [junit4]   2> 2712531 T10609 oasc.CoreContainer.load Host Name: 127.0.0.1
   [junit4]   2> 2712531 T10609 oasc.ZkContainer.initZooKeeper Zookeeper client=127.0.0.1:64734/solr
   [junit4]   2> 2712531 T10609 oasc.ZkController.checkChrootPath zkHost includes chroot
   [junit4]   2> 2712531 T10609 oascc.SolrZkClient.createZkCredentialsToAddAutomatically Using default ZkCredentialsProvider
   [junit4]   2> 2712535 T10609 oascc.ConnectionManager.waitForConnected Waiting for client to connect to ZooKeeper
   [junit4]   2> 2712539 T10662 oascc.ConnectionManager.process Watcher org.apache.solr.common.cloud.ConnectionManager@2a8a4817 name:ZooKeeperConnection Watcher:127.0.0.1:64734 got event WatchedEvent state:SyncConnected type:None path:null path:null type:None
   [junit4]   2> 2712539 T10609 oascc.ConnectionManager.waitForConnected Client is connected to ZooKeeper
   [junit4]   2> 2712540 T10609 oascc.SolrZkClient.createZkACLProvider Using default ZkACLProvider
   [junit4]   2> 2712544 T10609 oascc.ConnectionManager.waitForConnected Waiting for client to connect to ZooKeeper
   [junit4]   2> 2712547 T10665 oascc.ConnectionManager.process Watcher org.apache.solr.common.cloud.ConnectionManager@56657ce9 name:ZooKeeperConnection Watcher:127.0.0.1:64734/solr got event WatchedEvent state:SyncConnected type:None path:null path:null type:None
   [junit4]   2> 2712547 T10609 oascc.ConnectionManager.waitForConnected Client is connected to ZooKeeper
   [junit4]   2> 2712560 T10609 oascc.ZkStateReader.createClusterStateWatchersAndUpdate Updating cluster state from ZooKeeper... 
   [junit4]   2> 2713918 T10609 oasc.ZkController.createEphemeralLiveNode Register node as live in ZooKeeper:/live_nodes/127.0.0.1:64757_vi_%2Fwu
   [junit4]   2> 2713921 T10609 oascc.SolrZkClient.makePath makePath: /live_nodes/127.0.0.1:64757_vi_%2Fwu
   [junit4]   2> 2713928 T10609 oasc.Overseer.close Overseer (id=null) closing
   [junit4]   2> 2713935 T10609 oasc.CorePropertiesLocator.discover Looking for core definitions underneath C:\Users\JenkinsSlave\workspace\Lucene-Solr-5.x-Windows\solr\build\solr-core\test\J0\temp\solr.cloud.ReplicationFactorTest 10D1CB67BF098A67-001\shard-1-001\cores
   [junit4]   2> 2713936 T10609 oasc.CorePropertiesLocator.discoverUnder Found core collection1 in C:\Users\JenkinsSlave\workspace\Lucene-Solr-5.x-Windows\solr\build\solr-core\test\J0\temp\solr.cloud.ReplicationFactorTest 10D1CB67BF098A67-001\shard-1-001\cores\collection1\
   [junit4]   2> 2713936 T10609 oasc.CorePropertiesLocator.discover Found 1 core definitions
   [junit4]   2> 2713943 T10666 oasc.ZkController.publish publishing core=collection1 state=down collection=collection1
   [junit4]   2> 2713943 T10666 oasc.ZkController.publish numShards not found on descriptor - reading it from system property
   [junit4]   2> 2713947 T10635 oasc.DistributedQueue$LatchWatcher.process NodeChildrenChanged fired on path /overseer/queue state SyncConnected
   [junit4]   2> 2713948 T10666 oasc.ZkController.preRegister Registering watch for external collection collection1
   [junit4]   2> 2713948 T10666 oascc.ZkStateReader.addZkWatch addZkWatch collection1
   [junit4]   2> 2713948 T10636 oasc.Overseer$ClusterStateUpdater.run processMessage: queueSize: 1, message = {
   [junit4]   2> 	  "numShards":"3",
   [junit4]   2> 	  "shard":null,
   [junit4]   2> 	  "base_url":"http://127.0.0.1:64757/vi_/wu",
   [junit4]   2> 	  "node_name":"127.0.0.1:64757_vi_%2Fwu",
   [junit4]   2> 	  "state":"down",
   [junit4]   2> 	  "operation":"state",
   [junit4]   2> 	  "roles":null,
   [junit4]   2> 	  "core":"collection1",
   [junit4]   2> 	  "collection":"collection1"} current state version: 5
   [junit4]   2> 2713950 T10666 oascc.ZkStateReader.addZkWatch Updating collection state at /collections/collection1/state.json from ZooKeeper... 
   [junit4]   2> 2713950 T10636 oasco.ReplicaMutator.updateState Update state numShards=3 message={
   [junit4]   2> 	  "numShards":"3",
   [junit4]   2> 	  "shard":null,
   [junit4]   2> 	  "base_url":"http://127.0.0.1:64757/vi_/wu",
   [junit4]   2> 	  "node_name":"127.0.0.1:64757_vi_%2Fwu",
   [junit4]   2> 	  "state":"down",
   [junit4]   2> 	  "operation":"state",
   [junit4]   2> 	  "roles":null,
   [junit4]   2> 	  "core":"collection1",
   [junit4]   2> 	  "collection":"collection1"}
   [junit4]   2> 2713951 T10636 oasco.ReplicaMutator.updateState Collection already exists with numShards=3
   [junit4]   2> 2713951 T10636 oasco.ReplicaMutator.updateState Assigning new node to shard shard=shard3
   [junit4]   2> 2713953 T10666 oascc.ZkStateReader.updateWatchedCollection Updating data for collection1 to ver 0 
   [junit4]   2> 2713953 T10636 oasco.ZkStateWriter.writePendingUpdates going to update_collection /collections/collection1/state.json version: 0
   [junit4]   2> 2713953 T10666 oasc.ZkController.waitForCoreNodeName look for our core node name
   [junit4]   2> 2713955 T10665 oascc.ZkStateReader$7.process A cluster state change: WatchedEvent state:SyncConnected type:NodeDataChanged path:/collections/collection1/state.json for collection collection1 has occurred - updating... (live nodes size: 2)
   [junit4]   2> 2713956 T10665 oascc.ZkStateReader.updateWatchedCollection Updating data for collection1 to ver 1 
   [junit4]   2> 2715303 T10666 oasc.ZkController.waitForShardId waiting to find shard id in clusterstate for collection1
   [junit4]   2> 2715303 T10666 oasc.ZkController.createCollectionZkNode Check for collection zkNode:collection1
   [junit4]   2> 2715305 T10666 oasc.ZkController.createCollectionZkNode Collection zkNode exists
   [junit4]   2> 2715305 T10666 oascc.ZkStateReader.readConfigName Load collection config from:/collections/collection1
   [junit4]   2> 2715307 T10666 oascc.ZkStateReader.readConfigName path=/collections/collection1 configName=conf1 specified config exists in ZooKeeper
   [junit4]   2> 2715307 T10666 oasc.SolrResourceLoader.<init> new SolrResourceLoader for directory: 'C:\Users\JenkinsSlave\workspace\Lucene-Solr-5.x-Windows\solr\build\solr-core\test\J0\temp\solr.cloud.ReplicationFactorTest 10D1CB67BF098A67-001\shard-1-001\cores\collection1\'
   [junit4]   2> 2715335 T10666 oasc.ZkController.watchZKConfDir watch zkdir /configs/conf1
   [junit4]   2> 2715340 T10666 oasc.Config.<init> loaded config solrconfig.xml with version 0 
   [junit4]   2> 2715353 T10666 oasc.SolrConfig.refreshRequestParams current version of requestparams : -1
   [junit4]   2> 2715385 T10666 oasc.SolrConfig.<init> Using Lucene MatchVersion: 5.1.0
   [junit4]   2> 2715470 T10666 oasc.SolrConfig.<init> Loaded SolrConfig: solrconfig.xml
   [junit4]   2> 2715472 T10666 oass.IndexSchema.readSchema Reading Solr Schema from /configs/conf1/schema.xml
   [junit4]   2> 2715485 T10666 oass.IndexSchema.readSchema [collection1] Schema name=test
   [junit4]   2> 2716026 T10666 oass.OpenExchangeRatesOrgProvider.init Initialized with rates=open-exchange-rates.json, refreshInterval=1440.
   [junit4]   2> 2716036 T10666 oass.IndexSchema.readSchema default search field in schema is text
   [junit4]   2> 2716039 T10666 oass.IndexSchema.readSchema unique key field: id
   [junit4]   2> 2716061 T10666 oass.FileExchangeRateProvider.reload Reloading exchange rates from file currency.xml
   [junit4]   2> 2716067 T10666 oass.FileExchangeRateProvider.reload Reloading exchange rates from file currency.xml
   [junit4]   2> 2716073 T10666 oass.OpenExchangeRatesOrgProvider.reload Reloading exchange rates from open-exchange-rates.json
   [junit4]   2> 2716076 T10666 oass.OpenExchangeRatesOrgProvider$OpenExchangeRates.<init> WARN Unknown key IMPORTANT NOTE
   [junit4]   2> 2716076 T10666 oass.OpenExchangeRatesOrgProvider$OpenExchangeRates.<init> WARN Expected key, got STRING
   [junit4]   2> 2716076 T10666 oass.OpenExchangeRatesOrgProvider.reload Reloading exchange rates from open-exchange-rates.json
   [junit4]   2> 2716079 T10666 oass.OpenExchangeRatesOrgProvider$OpenExchangeRates.<init> WARN Unknown key IMPORTANT NOTE
   [junit4]   2> 2716079 T10666 oass.OpenExchangeRatesOrgProvider$OpenExchangeRates.<init> WARN Expected key, got STRING
   [junit4]   2> 2716079 T10666 oasc.CoreContainer.create Creating SolrCore 'collection1' using configuration from collection collection1
   [junit4]   2> 2716079 T10666 oasc.SolrCore.initDirectoryFactory org.apache.solr.core.MockDirectoryFactory
   [junit4]   2> 2716079 T10666 oasc.SolrCore.<init> [collection1] Opening new SolrCore at C:\Users\JenkinsSlave\workspace\Lucene-Solr-5.x-Windows\solr\build\solr-core\test\J0\temp\solr.cloud.ReplicationFactorTest 10D1CB67BF098A67-001\shard-1-001\cores\collection1\, dataDir=C:\Users\JenkinsSlave\workspace\Lucene-Solr-5.x-Windows\solr\build\solr-core\test\J0\temp\solr.cloud.ReplicationFactorTest 10D1CB67BF098A67-001\tempDir-001/jetty1\
   [junit4]   2> 2716080 T10666 oasc.JmxMonitoredMap.<init> JMX monitoring is enabled. Adding Solr mbeans to JMX Server: com.sun.jmx.mbeanserver.JmxMBeanServer@797f3214
   [junit4]   2> 2716081 T10666 oasc.CachingDirectoryFactory.get return new directory for C:\Users\JenkinsSlave\workspace\Lucene-Solr-5.x-Windows\solr\build\solr-core\test\J0\temp\solr.cloud.ReplicationFactorTest 10D1CB67BF098A67-001\tempDir-001/jetty1\
   [junit4]   2> 2716081 T10666 oasc.SolrCore.getNewIndexDir New index directory detected: old=null new=C:\Users\JenkinsSlave\workspace\Lucene-Solr-5.x-Windows\solr\build\solr-core\test\J0\temp\solr.cloud.ReplicationFactorTest 10D1CB67BF098A67-001\tempDir-001/jetty1\index/
   [junit4]   2> 2716081 T10666 oasc.SolrCore.initIndex WARN [collection1] Solr index directory 'C:\Users\JenkinsSlave\workspace\Lucene-Solr-5.x-Windows\solr\build\solr-core\test\J0\temp\solr.cloud.ReplicationFactorTest 10D1CB67BF098A67-001\tempDir-001\jetty1\index' doesn't exist. Creating new index...
   [junit4]   2> 2716081 T10666 oasc.CachingDirectoryFactory.get return new directory for C:\Users\JenkinsSlave\workspace\Lucene-Solr-5.x-Windows\solr\build\solr-core\test\J0\temp\solr.cloud.ReplicationFactorTest 10D1CB67BF098A67-001\tempDir-001/jetty1\index
   [junit4]   2> 2716083 T10666 oasu.RandomMergePolicy.<init> RandomMergePolicy wrapping class org.apache.lucene.index.LogDocMergePolicy: [LogDocMergePolicy: minMergeSize=1000, mergeFactor=33, maxMergeSize=9223372036854775807, maxMergeSizeForForcedMerge=9223372036854775807, calibrateSizeByDeletes=true, maxMergeDocs=2147483647, maxCFSSegmentSizeMB=8.796093022207999E12, noCFSRatio=1.0]
   [junit4]   2> 2716083 T10666 oasc.SolrDeletionPolicy.onCommit SolrDeletionPolicy.onCommit: commits: num=1
   [junit4]   2> 		commit{dir=MockDirectoryWrapper(RAMDirectory@32df3b3b lockFactory=org.apache.lucene.store.SingleInstanceLockFactory@5da9b894),segFN=segments_1,generation=1}
   [junit4]   2> 2716084 T10666 oasc.SolrDeletionPolicy.updateCommits newest commit generation = 1
   [junit4]   2> 2716089 T10666 oasup.UpdateRequestProcessorChain.init creating updateRequestProcessorChain "nodistrib"
   [junit4]   2> 2716089 T10666 oasup.UpdateRequestProcessorChain.init creating updateRequestProcessorChain "dedupe"
   [junit4]   2> 2716090 T10666 oasup.UpdateRequestProcessorChain.init inserting DistributedUpdateProcessorFactory into updateRequestProcessorChain "dedupe"
   [junit4]   2> 2716090 T10666 oasup.UpdateRequestProcessorChain.init creating updateRequestProcessorChain "stored_sig"
   [junit4]   2> 2716090 T10666 oasup.UpdateRequestProcessorChain.init inserting DistributedUpdateProcessorFactory into updateRequestProcessorChain "stored_sig"
   [junit4]   2> 2716090 T10666 oasup.UpdateRequestProcessorChain.init creating updateRequestProcessorChain "distrib-dup-test-chain-explicit"
   [junit4]   2> 2716092 T10666 oasup.UpdateRequestProcessorChain.init creating updateRequestProcessorChain "distrib-dup-test-chain-implicit"
   [junit4]   2> 2716092 T10666 oasup.UpdateRequestProcessorChain.init inserting DistributedUpdateProcessorFactory into updateRequestProcessorChain "distrib-dup-test-chain-implicit"
   [junit4]   2> 2716092 T10666 oasc.SolrCore.loadUpdateProcessorChains no updateRequestProcessorChain defined as default, creating implicit default
   [junit4]   2> 2716093 T10666 oasc.RequestHandlers.initHandlersFromConfig created /update: org.apache.solr.handler.UpdateRequestHandler
   [junit4]   2> 2716093 T10666 oasc.RequestHandlers.initHandlersFromConfig created /update/json: org.apache.solr.handler.UpdateRequestHandler
   [junit4]   2> 2716094 T10666 oasc.RequestHandlers.initHandlersFromConfig created /update/csv: org.apache.solr.handler.UpdateRequestHandler
   [junit4]   2> 2716094 T10666 oasc.RequestHandlers.initHandlersFromConfig created /update/json/docs: org.apache.solr.handler.UpdateRequestHandler
   [junit4]   2> 2716096 T10666 oasc.RequestHandlers.initHandlersFromConfig created /config: org.apache.solr.handler.SolrConfigHandler
   [junit4]   2> 2716096 T10666 oasc.RequestHandlers.initHandlersFromConfig created /schema: org.apache.solr.handler.SchemaHandler
   [junit4]   2> 2716098 T10666 oasc.RequestHandlers.initHandlersFromConfig created /replication: org.apache.solr.handler.ReplicationHandler
   [junit4]   2> 2716098 T10666 oasc.RequestHandlers.initHandlersFromConfig created /get: org.apache.solr.handler.RealTimeGetHandler
   [junit4]   2> 2716100 T10666 oasc.RequestHandlers.initHandlersFromConfig created /admin/luke: org.apache.solr.handler.admin.LukeRequestHandler
   [junit4]   2> 2716101 T10666 oasc.RequestHandlers.initHandlersFromConfig created /admin/system: org.apache.solr.handler.admin.SystemInfoHandler
   [junit4]   2> 2716101 T10666 oasc.RequestHandlers.initHandlersFromConfig created /admin/mbeans: org.apache.solr.handler.admin.SolrInfoMBeanHandler
   [junit4]   2> 2716102 T10666 oasc.RequestHandlers.initHandlersFromConfig created /admin/plugins: org.apache.solr.handler.admin.PluginInfoHandler
   [junit4]   2> 2716102 T10666 oasc.RequestHandlers.initHandlersFromConfig created /admin/threads: org.apache.solr.handler.admin.ThreadDumpHandler
   [junit4]   2> 2716104 T10666 oasc.RequestHandlers.initHandlersFromConfig created /admin/properties: org.apache.solr.handler.admin.PropertiesRequestHandler
   [junit4]   2> 2716105 T10666 oasc.RequestHandlers.initHandlersFromConfig created /admin/logging: org.apache.solr.handler.admin.LoggingHandler
   [junit4]   2> 2716105 T10666 oasc.RequestHandlers.initHandlersFromConfig created /admin/file: solr.admin.ShowFileRequestHandler
   [junit4]   2> 2716106 T10666 oasc.RequestHandlers.initHandlersFromConfig created /admin/ping: org.apache.solr.handler.PingRequestHandler
   [junit4]   2> 2716106 T10666 oasc.RequestHandlers.initHandlersFromConfig created standard: solr.StandardRequestHandler
   [junit4]   2> 2716113 T10666 oashl.XMLLoader.init xsltCacheLifetimeSeconds=60
   [junit4]   2> 2716115 T10666 oashl.XMLLoader.init xsltCacheLifetimeSeconds=60
   [junit4]   2> 2716117 T10666 oashl.XMLLoader.init xsltCacheLifetimeSeconds=60
   [junit4]   2> 2716119 T10666 oashl.XMLLoader.init xsltCacheLifetimeSeconds=60
   [junit4]   2> 2716123 T10666 oasc.SolrCore.initStatsCache Using default statsCache cache: org.apache.solr.search.stats.LocalStatsCache
   [junit4]   2> 2716127 T10666 oasu.CommitTracker.<init> Hard AutoCommit: disabled
   [junit4]   2> 2716127 T10666 oasu.CommitTracker.<init> Soft AutoCommit: disabled
   [junit4]   2> 2716127 T10666 oasu.RandomMergePolicy.<init> RandomMergePolicy wrapping class org.apache.lucene.index.LogByteSizeMergePolicy: [LogByteSizeMergePolicy: minMergeSize=1677721, mergeFactor=40, maxMergeSize=2147483648, maxMergeSizeForForcedMerge=9223372036854775807, calibrateSizeByDeletes=false, maxMergeDocs=2147483647, maxCFSSegmentSizeMB=8.796093022207999E12, noCFSRatio=1.0]
   [junit4]   2> 2716129 T10666 oasc.SolrDeletionPolicy.onInit SolrDeletionPolicy.onInit: commits: num=1
   [junit4]   2> 		commit{dir=MockDirectoryWrapper(RAMDirectory@32df3b3b lockFactory=org.apache.lucene.store.SingleInstanceLockFactory@5da9b894),segFN=segments_1,generation=1}
   [junit4]   2> 2716129 T10666 oasc.SolrDeletionPolicy.updateCommits newest commit generation = 1
   [junit4]   2> 2716129 T10666 oass.SolrIndexSearcher.<init> Opening Searcher@6af5fa4[collection1] main
   [junit4]   2> 2716130 T10666 oascc.ZkStateReader.readConfigName Load collection config from:/collections/collection1
   [junit4]   2> 2716131 T10666 oascc.ZkStateReader.readConfigName path=/collections/collection1 configName=conf1 specified config exists in ZooKeeper
   [junit4]   2> 2716131 T10666 oasr.ManagedResourceStorage.newStorageIO Setting up ZooKeeper-based storage for the RestManager with znodeBase: /configs/conf1
   [junit4]   2> 2716133 T10666 oasr.ManagedResourceStorage$ZooKeeperStorageIO.configure Configured ZooKeeperStorageIO with znodeBase: /configs/conf1
   [junit4]   2> 2716133 T10666 oasr.RestManager.init Initializing RestManager with initArgs: {}
   [junit4]   2> 2716134 T10666 oasr.ManagedResourceStorage.load Reading _rest_managed.json using ZooKeeperStorageIO:path=/configs/conf1
   [junit4]   2> 2716135 T10666 oasr.ManagedResourceStorage$ZooKeeperStorageIO.openInputStream No data found for znode /configs/conf1/_rest_managed.json
   [junit4]   2> 2716135 T10666 oasr.ManagedResourceStorage.load Loaded null at path _rest_managed.json using ZooKeeperStorageIO:path=/configs/conf1
   [junit4]   2> 2716135 T10666 oasr.RestManager.init Initializing 0 registered ManagedResources
   [junit4]   2> 2716135 T10666 oash.ReplicationHandler.inform Commits will be reserved for  10000
   [junit4]   2> 2716137 T10667 oasc.SolrCore.registerSearcher [collection1] Registered new searcher Searcher@6af5fa4[collection1] main{ExitableDirectoryReader(UninvertingDirectoryReader())}
   [junit4]   2> 2716138 T10666 oasc.CoreContainer.registerCore registering core: collection1
   [junit4]   2> 2716139 T10670 oasc.ZkController.register Register replica - core:collection1 address:http://127.0.0.1:64757/vi_/wu collection:collection1 shard:shard3
   [junit4]   2> 2716141 T10609 oass.SolrDispatchFilter.init user.dir=C:\Users\JenkinsSlave\workspace\Lucene-Solr-5.x-Windows\solr\build\solr-core\test\J0
   [junit4]   2> 2716141 T10609 oass.SolrDispatchFilter.init SolrDispatchFilter.init() done
   [junit4]   2> 2716142 T10670 oascc.SolrZkClient.makePath makePath: /collections/collection1/leader_elect/shard3/election
   [junit4]   2> 2716151 T10670 oasc.ShardLeaderElectionContext.runLeaderProcess Running the leader process for shard shard3
   [junit4]   2> 2716155 T10635 oasc.DistributedQueue$LatchWatcher.process NodeChildrenChanged fired on path /overseer/queue state SyncConnected
   [junit4]   2> 2716156 T10670 oasc.ShardLeaderElectionContext.waitForReplicasToComeUp Enough replicas found to continue.
   [junit4]   2> 2716156 T10670 oasc.ShardLeaderElectionContext.runLeaderProcess I may be the new leader - try and sync
   [junit4]   2> ASYNC  NEW_CORE C8540 name=collection1 org.apache.solr.core.SolrCore@14985705 url=http://127.0.0.1:64757/vi_/wu/collection1 node=127.0.0.1:64757_vi_%2Fwu C8540_STATE=coll:collection1 core:collection1 props:{base_url=http://127.0.0.1:64757/vi_/wu, node_name=127.0.0.1:64757_vi_%2Fwu, state=down, core=collection1}
   [junit4]   2> 2716156 T10670 C8540 P64757 oasc.SyncStrategy.sync Sync replicas to http://127.0.0.1:64757/vi_/wu/collection1/
   [junit4]   2> 2716156 T10670 C8540 P64757 oasc.SyncStrategy.syncReplicas Sync Success - now sync replicas to me
   [junit4]   2> 2716156 T10670 C8540 P64757 oasc.SyncStrategy.syncToMe http://127.0.0.1:64757/vi_/wu/collection1/ has no replicas
   [junit4]   2> 2716156 T10670 oasc.ShardLeaderElectionContext.runLeaderProcess I am the new leader: http://127.0.0.1:64757/vi_/wu/collection1/ shard3
   [junit4]   2> 2716158 T10670 oascc.SolrZkClient.makePath makePath: /collections/collection1/leaders/shard3
   [junit4]   2> 2716160 T10636 oasc.Overseer$ClusterStateUpdater.run processMessage: queueSize: 1, message = {
   [junit4]   2> 	  "operation":"leader",
   [junit4]   2> 	  "shard":"shard3",
   [junit4]   2> 	  "collection":"collection1"} current state version: 5
   [junit4]   2> 2716163 T10636 oasco.ZkStateWriter.writePendingUpdates going to update_collection /collections/collection1/state.json version: 1
   [junit4]   2> 2716166 T10665 oascc.ZkStateReader$7.process A cluster state change: WatchedEvent state:SyncConnected type:NodeDataChanged path:/collections/collection1/state.json for collection collection1 has occurred - updating... (live nodes size: 2)
   [junit4]   2> 2716167 T10665 oascc.ZkStateReader.updateWatchedCollection Updating data for collection1 to ver 2 
   [junit4]   2> 2716177 T10636 oasc.Overseer$ClusterStateUpdater.run processMessage: queueSize: 1, message = {
   [junit4]   2> 	  "operation":"leader",
   [junit4]   2> 	  "shard":"shard3",
   [junit4]   2> 	  "collection":"collection1",
   [junit4]   2> 	  "base_url":"http://127.0.0.1:64757/vi_/wu",
   [junit4]   2> 	  "core":"collection1",
   [junit4]   2> 	  "state":"active"} current state version: 5
   [junit4]   2> 2716180 T10636 oasco.ZkStateWriter.writePendingUpdates going to update_collection /collections/collection1/state.json version: 2
   [junit4]   2> 2716181 T10665 oascc.ZkStateReader$7.process A cluster state change: WatchedEvent state:SyncConnected type:NodeDataChanged path:/collections/collection1/state.json for collection collection1 has occurred - updating... (live nodes size: 2)
   [junit4]   2> 2716183 T10665 oascc.ZkStateReader.updateWatchedCollection Updating data for collection1 to ver 3 
   [junit4]   2> 2716188 T10635 oasc.DistributedQueue$LatchWatcher.process NodeChildrenChanged fired on path /overseer/queue state SyncConnected
   [junit4]   2> 2716245 T10670 oasc.ZkController.register We are http://127.0.0.1:64757/vi_/wu/collection1/ and leader is http://127.0.0.1:64757/vi_/wu/collection1/
   [junit4]   2> 2716245 T10670 oasc.ZkController.register No LogReplay needed for core=collection1 baseURL=http://127.0.0.1:64757/vi_/wu
   [junit4]   2> 2716245 T10670 oasc.ZkController.checkRecovery I am the leader, no recovery necessary
   [junit4]   2> 2716245 T10670 oasc.ZkController.publish publishing core=collection1 state=active collection=collection1
   [junit4]   2> 2716245 T10670 oasc.ZkController.publish numShards not found on descriptor - reading it from system property
   [junit4]   2> 2716247 T10635 oasc.DistributedQueue$LatchWatcher.process NodeChildrenChanged fired on path /overseer/queue state SyncConnected
   [junit4]   2> 2716250 T10636 oasc.Overseer$ClusterStateUpdater.run processMessage: queueSize: 1, message = {
   [junit4]   2> 	  "numShards":"3",
   [junit4]   2> 	  "core_node_name":"core_node1",
   [junit4]   2> 	  "shard":"shard3",
   [junit4]   2> 	  "base_url":"http://127.0.0.1:64757/vi_/wu",
   [junit4]   2> 	  "node_name":"127.0.0.1:64757_vi_%2Fwu",
   [junit4]   2> 	  "state":"active",
   [junit4]   2> 	  "operation":"state",
   [junit4]   2> 	  "roles":null,
   [junit4]   2> 	  "core":"collection1",
   [junit4]   2> 	  "collection":"collection1"} current state version: 5
   [junit4]   2> 2716253 T10636 oasco.ReplicaMutator.updateState Update state numShards=3 message={
   [junit4]   2> 	  "numShards":"3",
   [junit4]   2> 	  "core_node_name":"core_node1",
   [junit4]   2> 	  "shard":"shard3",
   [junit4]   2> 	  "base_url":"http://127.0.0.1:64757/vi_/wu",
   [junit4]   2> 	  "node_name":"127.0.0.1:64757_vi_%2Fwu",
   [junit4]   2> 	  "state":"active",
   [junit4]   2> 	  "operation":"state",
   [junit4]   2> 	  "roles":null,
   [junit4]   2> 	  "core":"collection1",
   [junit4]   2> 	  "collection":"collection1"}
   [junit4]   2> 2716255 T10636 oasco.ZkStateWriter.writePendingUpdates going to update_collection /collections/collection1/state.json version: 3
   [junit4]   2> 2716257 T10665 oascc.ZkStateReader$7.process A cluster state change: WatchedEvent state:SyncConnected type:NodeDataChanged path:/collections/collection1/state.json for collection collection1 has occurred - updating... (live nodes size: 2)
   [junit4]   2> 2716260 T10670 oascc.ZkStateReader.updateWatchedCollection Updating data for collection1 to ver 4 
   [junit4]   2> 2716263 T10665 oascc.ZkStateReader.updateWatchedCollection Updating data for collection1 to ver 4 
   [junit4]   2> 2718039 T10609 oas.SolrTestCaseJ4.writeCoreProperties Writing core.properties file to C:\Users\JenkinsSlave\workspace\Lucene-Solr-5.x-Windows\solr\build\solr-core\test\J0\temp\solr.cloud.ReplicationFactorTest 10D1CB67BF098A67-001\shard-2-001\cores\collection1
   [junit4]   2> 2718043 T10609 oasc.AbstractFullDistribZkTestBase.createJettys create jetty 2
   [junit4]   2> 2718044 T10609 oejs.Server.doStart jetty-8.1.10.v20130312
   [junit4]   2> 2718049 T10609 oejs.AbstractConnector.doStart Started SelectChannelConnector@127.0.0.1:64768
   [junit4]   2> 2718049 T10609 oass.SolrDispatchFilter.init SolrDispatchFilter.init()sun.misc.Launcher$AppClassLoader@5f186fab
   [junit4]   2> 2718049 T10609 oasc.SolrResourceLoader.locateSolrHome JNDI not configured for solr (NoInitialContextEx)
   [junit4]   2> 2718049 T10609 oasc.SolrResourceLoader.locateSolrHome using system property solr.solr.home: C:\Users\JenkinsSlave\workspace\Lucene-Solr-5.x-Windows\solr\build\solr-core\test\J0\temp\solr.cloud.ReplicationFactorTest 10D1CB67BF098A67-001\shard-2-001
   [junit4]   2> 2718049 T10609 oasc.SolrResourceLoader.<init> new SolrResourceLoader for directory: 'C:\Users\JenkinsSlave\workspace\Lucene-Solr-5.x-Windows\solr\build\solr-core\test\J0\temp\solr.cloud.ReplicationFactorTest 10D1CB67BF098A67-001\shard-2-001\'
   [junit4]   2> 2718096 T10609 oasc.ConfigSolr.fromFile Loading container configuration from C:\Users\JenkinsSlave\workspace\Lucene-Solr-5.x-Windows\solr\build\solr-core\test\J0\temp\solr.cloud.ReplicationFactorTest 10D1CB67BF098A67-001\shard-2-001\solr.xml
   [junit4]   2> 2718158 T10609 oasc.CorePropertiesLocator.<init> Config-defined core root directory: C:\Users\JenkinsSlave\workspace\Lucene-Solr-5.x-Windows\solr\build\solr-core\test\J0\temp\solr.cloud.ReplicationFactorTest 10D1CB67BF098A67-001\shard-2-001\cores
   [junit4]   2> 2718158 T10609 oasc.CoreContainer.<init> New CoreContainer 691057335
   [junit4]   2> 2718159 T10609 oasc.CoreContainer.load Loading cores into CoreContainer [instanceDir=C:\Users\JenkinsSlave\workspace\Lucene-Solr-5.x-Windows\solr\build\solr-core\test\J0\temp\solr.cloud.ReplicationFactorTest 10D1CB67BF098A67-001\shard-2-001\]
   [junit4]   2> 2718160 T10609 oashc.HttpShardHandlerFactory.getParameter Setting socketTimeout to: 90000
   [junit4]   2> 2718160 T10609 oashc.HttpShardHandlerFactory.getParameter Setting urlScheme to: 
   [junit4]   2> 2718160 T10609 oashc.HttpShardHandlerFactory.getParameter Setting connTimeout to: 15000
   [junit4]   2> 2718161 T10609 oashc.HttpShardHandlerFactory.getParameter Setting maxConnectionsPerHost to: 20
   [junit4]   2> 2718161 T10609 oashc.HttpShardHandlerFactory.getParameter Setting maxConnections to: 10000
   [junit4]   2> 2718161 T10609 oashc.HttpShardHandlerFactory.getParameter Setting corePoolSize to: 0
   [junit4]   2> 2718161 T10609 oashc.HttpShardHandlerFactory.getParameter Setting maximumPoolSize to: 2147483647
   [junit4]   2> 2718161 T10609 oashc.HttpShardHandlerFactory.getParameter Setting maxThreadIdleTime to: 5
   [junit4]   2> 2718161 T10609 oashc.HttpShardHandlerFactory.getParameter Setting sizeOfQueue to: -1
   [junit4]   2> 2718161 T10609 oashc.HttpShardHandlerFactory.getParameter Setting fairnessPolicy to: false
   [junit4]   2> 2718161 T10609 oashc.HttpShardHandlerFactory.getParameter Setting useRetries to: false
   [junit4]   2> 2718161 T10609 oasu.UpdateShardHandl

[...truncated too long message...]

est, FastVectorHighlighterTest, HdfsDirectoryTest, BasicDistributedZkTest, BasicDistributedZk2Test, UnloadDistributedZkTest, CollectionsAPIDistributedZkTest, OpenCloseCoreStressTest, OverseerTest, LeaderElectionIntegrationTest, ShardRoutingTest, BasicZkTest, TestRandomFaceting, TestZkChroot, TestRandomDVFaceting, ShardRoutingCustomTest, TestDistributedSearch, AutoCommitTest, TestDistributedGrouping, TestRecovery, TestHashPartitioner, TermVectorComponentDistributedTest, ZkControllerTest, TestRealTimeGet, HardAutoCommitTest, DistributedTermsComponentTest, TestCoreContainer, SolrCoreTest, StatsComponentTest, SpellCheckComponentTest, BadIndexSchemaTest, ConvertedLegacyTest, TestFiltering, TestFunctionQuery, DirectUpdateHandlerTest, TestIndexSearcher, ShowFileRequestHandlerTest, CurrencyFieldXmlFileTest, SolrIndexSplitterTest, TestCoreDiscovery, AnalysisAfterCoreReloadTest, SpellCheckCollatorTest, CoreAdminHandlerTest, SolrRequestParserTest, SuggesterTest, TestStressLucene, TestTrie, PolyFieldTest, WordBreakSolrSpellCheckerTest, SolrCoreCheckLockOnStartupTest, TestPseudoReturnFields, TestUpdate, FieldMutatingUpdateProcessorTest, TestAtomicUpdateErrorCases, QueryEqualityTest, DirectUpdateHandlerOptimizeTest, DefaultValueUpdateProcessorTest, StatelessScriptUpdateProcessorFactoryTest, SortByFunctionTest, TestRemoteStreaming, DocValuesMultiTest, DistanceFunctionTest, TestSolrDeletionPolicy1, XsltUpdateRequestHandlerTest, DebugComponentTest, CacheHeaderTest, IndexBasedSpellCheckerTest, LukeRequestHandlerTest, StandardRequestHandlerTest, DocumentAnalysisRequestHandlerTest, TestQueryTypes, PrimitiveFieldTypeTest, TestOmitPositions, FileBasedSpellCheckerTest, XmlUpdateRequestHandlerTest, RequestHandlersTest, DocumentBuilderTest, TermVectorComponentTest, TestIndexingPerformance, RequiredFieldsTest, FieldAnalysisRequestHandlerTest, TestSolrQueryParser, LoggingHandlerTest, RegexBoostProcessorTest, TestJmxIntegration, TestCollationField, ReturnFieldsTest, BinaryUpdateRequestHandlerTest, TestPHPSerializedResponseWriter, CSVRequestHandlerTest, TestBinaryResponseWriter, SOLR749Test, AlternateDirectoryTest, TestQuerySenderNoQuery, BadComponentTest, TestMergePolicyConfig, TestSolrDeletionPolicy2, MultiTermTest, SampleTest, MinimalSchemaTest, TestElisionMultitermQuery, TestConfig, OutputWriterTest, ExternalFileFieldSortTest, TestSolrCoreProperties, NotRequiredUniqueKeyTest, TestPhraseSuggestions, SpellPossibilityIteratorTest, TestSweetSpotSimilarityFactory, TestPerFieldSimilarity, TestIBSimilarityFactory, TestDefaultSimilarityFactory, TestJmxMonitoredMap, TimeZoneUtilsTest, URLClassifyProcessorTest, PluginInfoTest, DateMathParserTest, ChaosMonkeyNothingIsSafeTest, PreAnalyzedFieldTest, DateFieldTest, SpellingQueryConverterTest, RAMDirectoryFactoryTest, TestLRUCache, TestUtils, TestDocumentBuilder, ZkNodePropsTest, SliceStateTest, SystemInfoHandlerTest, UUIDFieldTest, CircularListTest, DistributedMLTComponentTest, TestRTGBase, CursorPagingTest, TestDistributedMissingSort, ActionThrottleTest, AssignTest, CloudExitableDirectoryReaderTest, ConnectionManagerTest, DeleteInactiveReplicaTest, DistribCursorPagingTest, DistributedQueueTest, ExternalCollectionsTest, LeaderInitiatedRecoveryOnCommitTest, MultiThreadedOCPTest, OutOfBoxZkACLAndCredentialsProvidersTest, OverseerRolesTest, OverseerStatusTest, RecoveryAfterSoftCommitTest, RemoteQueryErrorTest, RollingRestartTest, SSLMigrationTest, SaslZkACLProviderTest, SharedFSAutoReplicaFailoverUtilsTest, SimpleCollectionCreateDeleteTest, TestCloudInspectUtil, TestCollectionAPI, TestLeaderElectionZkExpiry, TestRebalanceLeaders, TestRequestStatusCollectionAPI, TestShortCircuitedRequests, VMParamsZkACLAndCredentialsProvidersTest, HdfsBasicDistributedZk2Test, HdfsBasicDistributedZkTest, HdfsChaosMonkeySafeLeaderTest, HdfsCollectionsAPIDistributedZkTest, HdfsSyncSliceTest, HdfsUnloadDistributedZkTest, StressHdfsTest, HdfsDirectoryFactoryTest, QueryResultKeyTest, TestConfigSets, TestInfoStreamLogging, TestReloadAndDeleteDocs, TestShardHandlerFactory, TestSolrXml, RequestLoggingTest, TestReplicationHandlerBackup]
   [junit4]   2> NOTE: reproduce with: ant test  -Dtestcase=TestReplicationHandlerBackup -Dtests.seed=10D1CB67BF098A67 -Dtests.slow=true -Dtests.locale=sr__#Latn -Dtests.timezone=NZ -Dtests.asserts=true -Dtests.file.encoding=UTF-8
   [junit4] ERROR   0.00s | TestReplicationHandlerBackup (suite) <<<
   [junit4]    > Throwable #1: java.io.IOException: Could not remove the following files (in the order of attempts):
   [junit4]    >    C:\Users\JenkinsSlave\workspace\Lucene-Solr-5.x-Windows\solr\build\solr-core\test\J0\temp\solr.handler.TestReplicationHandlerBackup 10D1CB67BF098A67-001\solr-instance-002\collection1: java.nio.file.DirectoryNotEmptyException: C:\Users\JenkinsSlave\workspace\Lucene-Solr-5.x-Windows\solr\build\solr-core\test\J0\temp\solr.handler.TestReplicationHandlerBackup 10D1CB67BF098A67-001\solr-instance-002\collection1
   [junit4]    >    C:\Users\JenkinsSlave\workspace\Lucene-Solr-5.x-Windows\solr\build\solr-core\test\J0\temp\solr.handler.TestReplicationHandlerBackup 10D1CB67BF098A67-001\solr-instance-002: java.nio.file.DirectoryNotEmptyException: C:\Users\JenkinsSlave\workspace\Lucene-Solr-5.x-Windows\solr\build\solr-core\test\J0\temp\solr.handler.TestReplicationHandlerBackup 10D1CB67BF098A67-001\solr-instance-002
   [junit4]    >    C:\Users\JenkinsSlave\workspace\Lucene-Solr-5.x-Windows\solr\build\solr-core\test\J0\temp\solr.handler.TestReplicationHandlerBackup 10D1CB67BF098A67-001\solr-instance-001\collection1: java.nio.file.DirectoryNotEmptyException: C:\Users\JenkinsSlave\workspace\Lucene-Solr-5.x-Windows\solr\build\solr-core\test\J0\temp\solr.handler.TestReplicationHandlerBackup 10D1CB67BF098A67-001\solr-instance-001\collection1
   [junit4]    >    C:\Users\JenkinsSlave\workspace\Lucene-Solr-5.x-Windows\solr\build\solr-core\test\J0\temp\solr.handler.TestReplicationHandlerBackup 10D1CB67BF098A67-001\solr-instance-001: java.nio.file.DirectoryNotEmptyException: C:\Users\JenkinsSlave\workspace\Lucene-Solr-5.x-Windows\solr\build\solr-core\test\J0\temp\solr.handler.TestReplicationHandlerBackup 10D1CB67BF098A67-001\solr-instance-001
   [junit4]    >    C:\Users\JenkinsSlave\workspace\Lucene-Solr-5.x-Windows\solr\build\solr-core\test\J0\temp\solr.handler.TestReplicationHandlerBackup 10D1CB67BF098A67-001\solr-instance-001\collection1\data: java.nio.file.AccessDeniedException: C:\Users\JenkinsSlave\workspace\Lucene-Solr-5.x-Windows\solr\build\solr-core\test\J0\temp\solr.handler.TestReplicationHandlerBackup 10D1CB67BF098A67-001\solr-instance-001\collection1\data
   [junit4]    >    C:\Users\JenkinsSlave\workspace\Lucene-Solr-5.x-Windows\solr\build\solr-core\test\J0\temp\solr.handler.TestReplicationHandlerBackup 10D1CB67BF098A67-001\solr-instance-001: java.nio.file.DirectoryNotEmptyException: C:\Users\JenkinsSlave\workspace\Lucene-Solr-5.x-Windows\solr\build\solr-core\test\J0\temp\solr.handler.TestReplicationHandlerBackup 10D1CB67BF098A67-001\solr-instance-001
   [junit4]    >    C:\Users\JenkinsSlave\workspace\Lucene-Solr-5.x-Windows\solr\build\solr-core\test\J0\temp\solr.handler.TestReplicationHandlerBackup 10D1CB67BF098A67-001\solr-instance-002\collection1\data: java.nio.file.AccessDeniedException: C:\Users\JenkinsSlave\workspace\Lucene-Solr-5.x-Windows\solr\build\solr-core\test\J0\temp\solr.handler.TestReplicationHandlerBackup 10D1CB67BF098A67-001\solr-instance-002\collection1\data
   [junit4]    >    C:\Users\JenkinsSlave\workspace\Lucene-Solr-5.x-Windows\solr\build\solr-core\test\J0\temp\solr.handler.TestReplicationHandlerBackup 10D1CB67BF098A67-001\solr-instance-002: java.nio.file.DirectoryNotEmptyException: C:\Users\JenkinsSlave\workspace\Lucene-Solr-5.x-Windows\solr\build\solr-core\test\J0\temp\solr.handler.TestReplicationHandlerBackup 10D1CB67BF098A67-001\solr-instance-002
   [junit4]    >    C:\Users\JenkinsSlave\workspace\Lucene-Solr-5.x-Windows\solr\build\solr-core\test\J0\temp\solr.handler.TestReplicationHandlerBackup 10D1CB67BF098A67-001: java.nio.file.DirectoryNotEmptyException: C:\Users\JenkinsSlave\workspace\Lucene-Solr-5.x-Windows\solr\build\solr-core\test\J0\temp\solr.handler.TestReplicationHandlerBackup 10D1CB67BF098A67-001
   [junit4]    > 	at __randomizedtesting.SeedInfo.seed([10D1CB67BF098A67]:0)
   [junit4]    > 	at org.apache.lucene.util.IOUtils.rm(IOUtils.java:294)
   [junit4]    > 	at java.lang.Thread.run(Thread.java:745)
   [junit4] Completed in 9.40s, 2 tests, 1 error <<< FAILURES!

[...truncated 158 lines...]
BUILD FAILED
C:\Users\JenkinsSlave\workspace\Lucene-Solr-5.x-Windows\build.xml:529: The following error occurred while executing this line:
C:\Users\JenkinsSlave\workspace\Lucene-Solr-5.x-Windows\build.xml:477: The following error occurred while executing this line:
C:\Users\JenkinsSlave\workspace\Lucene-Solr-5.x-Windows\build.xml:61: The following error occurred while executing this line:
C:\Users\JenkinsSlave\workspace\Lucene-Solr-5.x-Windows\extra-targets.xml:39: The following error occurred while executing this line:
C:\Users\JenkinsSlave\workspace\Lucene-Solr-5.x-Windows\solr\build.xml:191: The following error occurred while executing this line:
C:\Users\JenkinsSlave\workspace\Lucene-Solr-5.x-Windows\solr\common-build.xml:508: The following error occurred while executing this line:
C:\Users\JenkinsSlave\workspace\Lucene-Solr-5.x-Windows\lucene\common-build.xml:1368: The following error occurred while executing this line:
C:\Users\JenkinsSlave\workspace\Lucene-Solr-5.x-Windows\lucene\common-build.xml:975: There were test failures: 466 suites, 1863 tests, 2 suite-level errors, 1 error, 55 ignored (30 assumptions)

Total time: 122 minutes 40 seconds
Build step 'Invoke Ant' marked build as failure
[description-setter] Description set: Java: 64bit/jdk1.7.0_76 -XX:-UseCompressedOops -XX:+UseSerialGC
Archiving artifacts
Recording test results
Email was triggered for: Failure - Any
Sending email for trigger: Failure - Any



Mime
View raw message