lucene-dev mailing list archives

Site index · List index
Message view « Date » · « Thread »
Top « Date » · « Thread »
From Policeman Jenkins Server <jenk...@thetaphi.de>
Subject [JENKINS] Lucene-Solr-5.x-Linux (32bit/jdk1.8.0_40-ea-b22) - Build # 11735 - Failure!
Date Sat, 28 Feb 2015 20:15:30 GMT
Build: http://jenkins.thetaphi.de/job/Lucene-Solr-5.x-Linux/11735/
Java: 32bit/jdk1.8.0_40-ea-b22 -server -XX:+UseSerialGC

2 tests failed.
FAILED:  junit.framework.TestSuite.org.apache.lucene.search.TestScorerPerf

Error Message:
Suite timeout exceeded (>= 7200000 msec).

Stack Trace:
java.lang.Exception: Suite timeout exceeded (>= 7200000 msec).
	at __randomizedtesting.SeedInfo.seed([411F6F29BA133E59]:0)


FAILED:  org.apache.lucene.search.TestScorerPerf.testConjunctions

Error Message:
Test abandoned because suite timeout was reached.

Stack Trace:
java.lang.Exception: Test abandoned because suite timeout was reached.
	at __randomizedtesting.SeedInfo.seed([411F6F29BA133E59]:0)




Build Log:
[...truncated 1936 lines...]
   [junit4] Suite: org.apache.lucene.search.TestScorerPerf
   [junit4]   2> NOTE: reproduce with: ant test  -Dtestcase=TestScorerPerf -Dtests.method=testConjunctions
-Dtests.seed=411F6F29BA133E59 -Dtests.multiplier=3 -Dtests.slow=true -Dtests.locale=nl_NL
-Dtests.timezone=Chile/EasterIsland -Dtests.asserts=true -Dtests.file.encoding=UTF-8
   [junit4] ERROR   7200s J1 | TestScorerPerf.testConjunctions <<<
   [junit4]    > Throwable #1: java.lang.Exception: Test abandoned because suite timeout
was reached.
   [junit4]    > 	at __randomizedtesting.SeedInfo.seed([411F6F29BA133E59]:0)
   [junit4]   2> NOTE: test params are: codec=Asserting(Lucene50): {}, docValues:{}, sim=RandomSimilarityProvider(queryNorm=false,coord=no):
{}, locale=nl_NL, timezone=Chile/EasterIsland
   [junit4]   2> NOTE: Linux 3.13.0-45-generic i386/Oracle Corporation 1.8.0_40-ea (32-bit)/cpus=8,threads=2,free=94240728,total=129773568
   [junit4]   2> NOTE: All tests run in this JVM: [TestParallelTermEnum, TestTragicIndexWriterDeadlock,
TestIntBlockPool, TestDisjunctionMaxQuery, TestCheckIndex, TestBinaryDocValuesUpdates, TestNamedSPILoader,
TestNumericUtils, TestOrdinalMap, TestSortRescorer, TestFilteredQuery, TestNeedsScores, TestForTooMuchCloning,
TestPerSegmentDeletes, TestBooleanScorer, TestLookaheadTokenFilter, TestAssertions, TestStressIndexing2,
TestIndexWriterExceptions2, TestLockFactory, TestFileSwitchDirectory, TestPayloadNearQuery,
TestDoc, TestIntsRef, TestPrefixQuery, TestSameTokenSamePosition, TestFilterIterator, InBeforeClass,
InAfterClass, InTestMethod, NonStringProperties, TestLegacyPostings, TestCharsRefBuilder,
TestTermVectors, TestMultiDocValues, TestMinimize, TestFastCompressionMode, TestNumericRangeQuery64,
TestRegexpRandom, TestNumericDocValuesUpdates, TestDocValuesRangeQuery, TestFlex, TestLevenshteinAutomata,
TestDeterminism, TestTerm, TestPayloadExplanations, TestDuelingCodecs, TestPayloadTermQuery,
TestGroupFiltering, TestCharFilter, TestLucene50NormsFormat, TestIndexWriterMergePolicy, TestTermRangeQuery,
TestIndexWriterReader, Test2BPositions, TestRoaringDocIdSet, TestNoMergePolicy, TestNearSpansOrdered,
TestIndexWriterConfig, TestQueryRescorer, TestComplexExplanations, TestToken, TestTotalHitCountCollector,
TestDocValues, TestFieldType, TestIndexWriterWithThreads, TestLucene50StoredFieldsFormat,
TestTieredMergePolicy, TestMixedCodecs, TestCustomNorms, TestMutableValues, TestEarlyTermination,
TestMaxTermFrequency, TestMockAnalyzer, TestNewestSegment, TestVirtualMethod, TestDeletionPolicy,
TestCharsRef, TestTopFieldCollector, TestPagedBytes, TestMultiTermQueryRewrites, TestRamUsageEstimatorOnWildAnimals,
TestSpanSearchEquivalence, TestLongPostings, TestFieldMaskingSpanQuery, TestSimpleAttributeImpl,
TestPrefixCodedTerms, TestShardSearching, TestFilteredSearch, TestDocTermOrdsRewriteMethod,
TestBooleanMinShouldMatch, TestPhraseQuery, TestFlushByRamOrCountsPolicy, TestBooleanCoord,
TestTwoPhaseCommitTool, TestAssertingStoredFieldsFormat, TestStressDeletes, TestPackedTokenAttributeImpl,
TestSearchAfter, TestComplexExplanationsOfNonMatches, TestSimilarity, TestSegmentTermDocs,
TestIndexInput, TestLongBitSet, TestNumericTokenStream, TestCrash, TestDocTermOrdsRangeFilter,
TestIndexWriter, TestPerFieldDocValuesFormat, TestCompressingTermVectorsFormat, TestIndexWriterMerging,
TestFSTs, TestBytesStore, TestGraphTokenizers, TestAddIndexes, TestMultiMMap, TestSearcherManager,
TestBasics, TestSloppyPhraseQuery, TestNRTThreads, TestAtomicUpdate, TestStressAdvance, TestNorms,
TestIndexWriterCommit, TestDirectoryReaderReopen, TestTimeLimitingCollector, TestSearchWithThreads,
TestConcurrentMergeScheduler, TestHighCompressionMode, TestDocumentsWriterStallControl, TestNeverDelete,
TestTopDocsMerge, TestRollingUpdates, TestIndexWriterUnicode, TestArrayUtil, TestByteSlices,
TestBufferedIndexInput, TestConsistentFieldNumbers, TestWeakIdentityMap, TestSimpleExplanations,
TestDirectoryReader, TestCompressingStoredFieldsFormat, TestSegmentMerger, TestBagOfPositions,
TestSegmentReader, TestFastDecompressionMode, TestIndexWriterNRTIsCurrent, TestFieldCacheRewriteMethod,
TestTransactions, TestMultiThreadTermVectors, TestPerFieldPostingsFormat2, TestFieldsReader,
TestCustomSearcherSort, TestDocValuesIndexing, TestSimilarityBase, TestHugeRamFile, TestIndexWriterOnDiskFull,
TestSpans, TestPayloadSpans, TestTransactionRollback, TestSpanExplanations, Nested, Nested2,
TestMultiPhraseQuery, TestLazyProxSkipping, TestDocsAndPositions, TestFieldCacheRangeFilter,
TestBagOfPostings, TestTermVectorsWriter, TestCodecs, TestCharTermAttributeImpl, TestOmitPositions,
TestBytesRefHash, TestThreadedForceMerge, TestStressNRT, TestSloppyPhraseQuery2, TestForceMergeForever,
TestQueryWrapperFilter, TestMultiFields, TestDocumentsWriterDeleteQueue, TestDocumentWriter,
TestCrashCausesCorruptIndex, TestScorerPerf]
   [junit4]   2> NOTE: reproduce with: ant test  -Dtestcase=TestScorerPerf -Dtests.seed=411F6F29BA133E59
-Dtests.multiplier=3 -Dtests.slow=true -Dtests.locale=nl_NL -Dtests.timezone=Chile/EasterIsland
-Dtests.asserts=true -Dtests.file.encoding=UTF-8
   [junit4] ERROR   0.00s J1 | TestScorerPerf (suite) <<<
   [junit4]    > Throwable #1: java.lang.Exception: Suite timeout exceeded (>= 7200000
msec).
   [junit4]    > 	at __randomizedtesting.SeedInfo.seed([411F6F29BA133E59]:0)
   [junit4] Completed on J1 in 7223.15s, 1 test, 2 errors <<< FAILURES!

[...truncated 11 lines...]
BUILD FAILED
/mnt/ssd/jenkins/workspace/Lucene-Solr-5.x-Linux/build.xml:529: The following error occurred
while executing this line:
/mnt/ssd/jenkins/workspace/Lucene-Solr-5.x-Linux/build.xml:477: The following error occurred
while executing this line:
/mnt/ssd/jenkins/workspace/Lucene-Solr-5.x-Linux/build.xml:61: The following error occurred
while executing this line:
/mnt/ssd/jenkins/workspace/Lucene-Solr-5.x-Linux/extra-targets.xml:39: The following error
occurred while executing this line:
/mnt/ssd/jenkins/workspace/Lucene-Solr-5.x-Linux/lucene/build.xml:49: The following error
occurred while executing this line:
/mnt/ssd/jenkins/workspace/Lucene-Solr-5.x-Linux/lucene/common-build.xml:1370: The following
error occurred while executing this line:
/mnt/ssd/jenkins/workspace/Lucene-Solr-5.x-Linux/lucene/common-build.xml:976: There were test
failures: 421 suites, 3353 tests, 1 suite-level error, 1 error, 67 ignored (57 assumptions)

Total time: 131 minutes 57 seconds
Build step 'Invoke Ant' marked build as failure
[description-setter] Description set: Java: 32bit/jdk1.8.0_40-ea-b22 -server -XX:+UseSerialGC
Archiving artifacts
Recording test results
Email was triggered for: Failure - Any
Sending email for trigger: Failure - Any



Mime
View raw message