lucene-dev mailing list archives

Site index · List index
Message view « Date » · « Thread »
Top « Date » · « Thread »
From "Uwe Schindler" <...@thetaphi.de>
Subject RE: [JENKINS] Lucene-Solr-4.10-Linux (64bit/jdk1.9.0-ea-b47) - Build # 34 - Failure!
Date Thu, 26 Feb 2015 20:37:47 GMT
I fixed this by backporting the Java 9 exclusion in the assert (LUCENE-6169). I re-enabled Lucene 4.10 test runs.

Uwe

-----
Uwe Schindler
H.-H.-Meier-Allee 63, D-28213 Bremen
http://www.thetaphi.de
eMail: uwe@thetaphi.de


> -----Original Message-----
> From: Policeman Jenkins Server [mailto:jenkins@thetaphi.de]
> Sent: Thursday, February 26, 2015 4:30 PM
> To: yonik@apache.org; sarowe@gmail.com; jpountz@apache.org;
> uwe@thetaphi.de; tflobbe@apache.org; mikemccand@apache.org;
> dsmiley@apache.org; rmuir@apache.org; thelabdude@apache.org;
> janhoy@apache.org; markrmiller@apache.org; shalin@apache.org;
> hossman@apache.org; jbernste@apache.org; ehatcher@apache.org;
> dev@lucene.apache.org
> Subject: [JENKINS] Lucene-Solr-4.10-Linux (64bit/jdk1.9.0-ea-b47) - Build # 34
> - Failure!
> 
> Build: http://jenkins.thetaphi.de/job/Lucene-Solr-4.10-Linux/34/
> Java: 64bit/jdk1.9.0-ea-b47 -XX:+UseCompressedOops -XX:+UseSerialGC
> 
> 67 tests failed.
> FAILED:
> org.apache.lucene.codecs.lucene40.TestLucene40DocValuesFormat.testZero
> OrMin
> 
> Error Message:
> On Linux and MacOSX fsyncing a directory should not throw IOException, we
> just don't want to rely on that in production (undocumented). Got:
> java.nio.file.FileSystemException: /mnt/ssd/jenkins/workspace/Lucene-Solr-
> 4.10-
> Linux/lucene/build/core/test/J0/lucene.codecs.lucene40.TestLucene40DocV
> aluesFormat-50D540524CD2431C-001/index-NIOFSDirectory-001: Is a
> directory
> 
> Stack Trace:
> java.lang.AssertionError: On Linux and MacOSX fsyncing a directory should
> not throw IOException, we just don't want to rely on that in production
> (undocumented). Got: java.nio.file.FileSystemException:
> /mnt/ssd/jenkins/workspace/Lucene-Solr-4.10-
> Linux/lucene/build/core/test/J0/lucene.codecs.lucene40.TestLucene40DocV
> aluesFormat-50D540524CD2431C-001/index-NIOFSDirectory-001: Is a
> directory
> 	at
> __randomizedtesting.SeedInfo.seed([50D540524CD2431C:500430E030D6E10
> 3]:0)
> 	at org.apache.lucene.util.IOUtils.fsync(IOUtils.java:339)
> 	at org.apache.lucene.store.FSDirectory.sync(FSDirectory.java:311)
> 	at
> org.apache.lucene.store.MockDirectoryWrapper.sync(MockDirectoryWrapp
> er.java:233)
> 	at
> org.apache.lucene.index.IndexWriter.startCommit(IndexWriter.java:4561)
> 	at
> org.apache.lucene.index.IndexWriter.prepareCommitInternal(IndexWriter.j
> ava:3014)
> 	at
> org.apache.lucene.index.IndexWriter.commitInternal(IndexWriter.java:3117
> )
> 	at
> org.apache.lucene.index.IndexWriter.commit(IndexWriter.java:3084)
> 	at
> org.apache.lucene.index.RandomIndexWriter.maybeCommit(RandomIndex
> Writer.java:161)
> 	at
> org.apache.lucene.index.RandomIndexWriter.addDocument(RandomIndex
> Writer.java:152)
> 	at
> org.apache.lucene.index.RandomIndexWriter.addDocument(RandomIndex
> Writer.java:110)
> 	at
> org.apache.lucene.index.BaseDocValuesFormatTestCase.doTestNumericsVs
> StoredFields(BaseDocValuesFormatTestCase.java:1180)
> 	at
> org.apache.lucene.index.BaseDocValuesFormatTestCase.testZeroOrMin(Bas
> eDocValuesFormatTestCase.java:2490)
> 	at sun.reflect.NativeMethodAccessorImpl.invoke0(Native Method)
> 	at
> sun.reflect.NativeMethodAccessorImpl.invoke(NativeMethodAccessorImpl.j
> ava:62)
> 	at
> sun.reflect.DelegatingMethodAccessorImpl.invoke(DelegatingMethodAcces
> sorImpl.java:43)
> 	at java.lang.reflect.Method.invoke(Method.java:498)
> 	at
> com.carrotsearch.randomizedtesting.RandomizedRunner.invoke(Randomize
> dRunner.java:1618)
> 	at
> com.carrotsearch.randomizedtesting.RandomizedRunner$6.evaluate(Rando
> mizedRunner.java:827)
> 	at
> com.carrotsearch.randomizedtesting.RandomizedRunner$7.evaluate(Rando
> mizedRunner.java:863)
> 	at
> com.carrotsearch.randomizedtesting.RandomizedRunner$8.evaluate(Rando
> mizedRunner.java:877)
> 	at
> org.apache.lucene.util.TestRuleSetupTeardownChained$1.evaluate(TestRule
> SetupTeardownChained.java:50)
> 	at
> org.apache.lucene.util.TestRuleFieldCacheSanity$1.evaluate(TestRuleFieldCa
> cheSanity.java:51)
> 	at
> org.apache.lucene.util.AbstractBeforeAfterRule$1.evaluate(AbstractBeforeA
> fterRule.java:46)
> 	at
> com.carrotsearch.randomizedtesting.rules.SystemPropertiesInvariantRule$1
> .evaluate(SystemPropertiesInvariantRule.java:55)
> 	at
> org.apache.lucene.util.TestRuleThreadAndTestName$1.evaluate(TestRuleTh
> readAndTestName.java:49)
> 	at
> org.apache.lucene.util.TestRuleIgnoreAfterMaxFailures$1.evaluate(TestRule
> IgnoreAfterMaxFailures.java:65)
> 	at
> org.apache.lucene.util.TestRuleMarkFailure$1.evaluate(TestRuleMarkFailure
> .java:48)
> 	at
> com.carrotsearch.randomizedtesting.rules.StatementAdapter.evaluate(Stat
> ementAdapter.java:36)
> 	at
> com.carrotsearch.randomizedtesting.ThreadLeakControl$StatementRunner.
> run(ThreadLeakControl.java:365)
> 	at
> com.carrotsearch.randomizedtesting.ThreadLeakControl.forkTimeoutingTask
> (ThreadLeakControl.java:798)
> 	at
> com.carrotsearch.randomizedtesting.ThreadLeakControl$3.evaluate(ThreadL
> eakControl.java:458)
> 	at
> com.carrotsearch.randomizedtesting.RandomizedRunner.runSingleTest(Ran
> domizedRunner.java:836)
> 	at
> com.carrotsearch.randomizedtesting.RandomizedRunner$3.evaluate(Rando
> mizedRunner.java:738)
> 	at
> com.carrotsearch.randomizedtesting.RandomizedRunner$4.evaluate(Rando
> mizedRunner.java:772)
> 	at
> com.carrotsearch.randomizedtesting.RandomizedRunner$5.evaluate(Rando
> mizedRunner.java:783)
> 	at
> org.apache.lucene.util.AbstractBeforeAfterRule$1.evaluate(AbstractBeforeA
> fterRule.java:46)
> 	at
> org.apache.lucene.util.TestRuleStoreClassName$1.evaluate(TestRuleStoreCl
> assName.java:42)
> 	at
> com.carrotsearch.randomizedtesting.rules.SystemPropertiesInvariantRule$1
> .evaluate(SystemPropertiesInvariantRule.java:55)
> 	at
> com.carrotsearch.randomizedtesting.rules.NoShadowingOrOverridesOnMet
> hodsRule$1.evaluate(NoShadowingOrOverridesOnMethodsRule.java:39)
> 	at
> com.carrotsearch.randomizedtesting.rules.NoShadowingOrOverridesOnMet
> hodsRule$1.evaluate(NoShadowingOrOverridesOnMethodsRule.java:39)
> 	at
> com.carrotsearch.randomizedtesting.rules.StatementAdapter.evaluate(Stat
> ementAdapter.java:36)
> 	at
> com.carrotsearch.randomizedtesting.rules.StatementAdapter.evaluate(Stat
> ementAdapter.java:36)
> 	at
> com.carrotsearch.randomizedtesting.rules.StatementAdapter.evaluate(Stat
> ementAdapter.java:36)
> 	at
> org.apache.lucene.util.TestRuleAssertionsRequired$1.evaluate(TestRuleAss
> ertionsRequired.java:43)
> 	at
> org.apache.lucene.util.TestRuleMarkFailure$1.evaluate(TestRuleMarkFailure
> .java:48)
> 	at
> org.apache.lucene.util.TestRuleIgnoreAfterMaxFailures$1.evaluate(TestRule
> IgnoreAfterMaxFailures.java:65)
> 	at
> org.apache.lucene.util.TestRuleIgnoreTestSuites$1.evaluate(TestRuleIgnore
> TestSuites.java:55)
> 	at
> com.carrotsearch.randomizedtesting.rules.StatementAdapter.evaluate(Stat
> ementAdapter.java:36)
> 	at
> com.carrotsearch.randomizedtesting.ThreadLeakControl$StatementRunner.
> run(ThreadLeakControl.java:365)
> 	at java.lang.Thread.run(Thread.java:745)
> 
> 
> FAILED:
> org.apache.lucene.codecs.lucene40.TestLucene40DocValuesFormat.testMer
> geStability
> 
> Error Message:
> On Linux and MacOSX fsyncing a directory should not throw IOException, we
> just don't want to rely on that in production (undocumented). Got:
> java.nio.file.FileSystemException: /mnt/ssd/jenkins/workspace/Lucene-Solr-
> 4.10-
> Linux/lucene/build/core/test/J0/lucene.codecs.lucene40.TestLucene40DocV
> aluesFormat-50D540524CD2431C-001/index-MMapDirectory-001: Is a
> directory
> 
> Stack Trace:
> java.lang.AssertionError: On Linux and MacOSX fsyncing a directory should
> not throw IOException, we just don't want to rely on that in production
> (undocumented). Got: java.nio.file.FileSystemException:
> /mnt/ssd/jenkins/workspace/Lucene-Solr-4.10-
> Linux/lucene/build/core/test/J0/lucene.codecs.lucene40.TestLucene40DocV
> aluesFormat-50D540524CD2431C-001/index-MMapDirectory-001: Is a
> directory
> 	at
> __randomizedtesting.SeedInfo.seed([50D540524CD2431C:2499067D413841A
> A]:0)
> 	at org.apache.lucene.util.IOUtils.fsync(IOUtils.java:339)
> 	at org.apache.lucene.store.FSDirectory.sync(FSDirectory.java:311)
> 	at
> org.apache.lucene.store.MockDirectoryWrapper.sync(MockDirectoryWrapp
> er.java:233)
> 	at
> org.apache.lucene.index.IndexWriter.startCommit(IndexWriter.java:4561)
> 	at
> org.apache.lucene.index.IndexWriter.prepareCommitInternal(IndexWriter.j
> ava:3014)
> 	at
> org.apache.lucene.index.IndexWriter.commitInternal(IndexWriter.java:3117
> )
> 	at
> org.apache.lucene.index.IndexWriter.commit(IndexWriter.java:3084)
> 	at
> org.apache.lucene.index.BaseIndexFileFormatTestCase.testMergeStability(B
> aseIndexFileFormatTestCase.java:204)
> 	at
> org.apache.lucene.index.BaseDocValuesFormatTestCase.testMergeStability(
> BaseDocValuesFormatTestCase.java:76)
> 	at sun.reflect.NativeMethodAccessorImpl.invoke0(Native Method)
> 	at
> sun.reflect.NativeMethodAccessorImpl.invoke(NativeMethodAccessorImpl.j
> ava:62)
> 	at
> sun.reflect.DelegatingMethodAccessorImpl.invoke(DelegatingMethodAcces
> sorImpl.java:43)
> 	at java.lang.reflect.Method.invoke(Method.java:498)
> 	at
> com.carrotsearch.randomizedtesting.RandomizedRunner.invoke(Randomize
> dRunner.java:1618)
> 	at
> com.carrotsearch.randomizedtesting.RandomizedRunner$6.evaluate(Rando
> mizedRunner.java:827)
> 	at
> com.carrotsearch.randomizedtesting.RandomizedRunner$7.evaluate(Rando
> mizedRunner.java:863)
> 	at
> com.carrotsearch.randomizedtesting.RandomizedRunner$8.evaluate(Rando
> mizedRunner.java:877)
> 	at
> org.apache.lucene.util.TestRuleSetupTeardownChained$1.evaluate(TestRule
> SetupTeardownChained.java:50)
> 	at
> org.apache.lucene.util.TestRuleFieldCacheSanity$1.evaluate(TestRuleFieldCa
> cheSanity.java:51)
> 	at
> org.apache.lucene.util.AbstractBeforeAfterRule$1.evaluate(AbstractBeforeA
> fterRule.java:46)
> 	at
> com.carrotsearch.randomizedtesting.rules.SystemPropertiesInvariantRule$1
> .evaluate(SystemPropertiesInvariantRule.java:55)
> 	at
> org.apache.lucene.util.TestRuleThreadAndTestName$1.evaluate(TestRuleTh
> readAndTestName.java:49)
> 	at
> org.apache.lucene.util.TestRuleIgnoreAfterMaxFailures$1.evaluate(TestRule
> IgnoreAfterMaxFailures.java:65)
> 	at
> org.apache.lucene.util.TestRuleMarkFailure$1.evaluate(TestRuleMarkFailure
> .java:48)
> 	at
> com.carrotsearch.randomizedtesting.rules.StatementAdapter.evaluate(Stat
> ementAdapter.java:36)
> 	at
> com.carrotsearch.randomizedtesting.ThreadLeakControl$StatementRunner.
> run(ThreadLeakControl.java:365)
> 	at
> com.carrotsearch.randomizedtesting.ThreadLeakControl.forkTimeoutingTask
> (ThreadLeakControl.java:798)
> 	at
> com.carrotsearch.randomizedtesting.ThreadLeakControl$3.evaluate(ThreadL
> eakControl.java:458)
> 	at
> com.carrotsearch.randomizedtesting.RandomizedRunner.runSingleTest(Ran
> domizedRunner.java:836)
> 	at
> com.carrotsearch.randomizedtesting.RandomizedRunner$3.evaluate(Rando
> mizedRunner.java:738)
> 	at
> com.carrotsearch.randomizedtesting.RandomizedRunner$4.evaluate(Rando
> mizedRunner.java:772)
> 	at
> com.carrotsearch.randomizedtesting.RandomizedRunner$5.evaluate(Rando
> mizedRunner.java:783)
> 	at
> org.apache.lucene.util.AbstractBeforeAfterRule$1.evaluate(AbstractBeforeA
> fterRule.java:46)
> 	at
> org.apache.lucene.util.TestRuleStoreClassName$1.evaluate(TestRuleStoreCl
> assName.java:42)
> 	at
> com.carrotsearch.randomizedtesting.rules.SystemPropertiesInvariantRule$1
> .evaluate(SystemPropertiesInvariantRule.java:55)
> 	at
> com.carrotsearch.randomizedtesting.rules.NoShadowingOrOverridesOnMet
> hodsRule$1.evaluate(NoShadowingOrOverridesOnMethodsRule.java:39)
> 	at
> com.carrotsearch.randomizedtesting.rules.NoShadowingOrOverridesOnMet
> hodsRule$1.evaluate(NoShadowingOrOverridesOnMethodsRule.java:39)
> 	at
> com.carrotsearch.randomizedtesting.rules.StatementAdapter.evaluate(Stat
> ementAdapter.java:36)
> 	at
> com.carrotsearch.randomizedtesting.rules.StatementAdapter.evaluate(Stat
> ementAdapter.java:36)
> 	at
> com.carrotsearch.randomizedtesting.rules.StatementAdapter.evaluate(Stat
> ementAdapter.java:36)
> 	at
> org.apache.lucene.util.TestRuleAssertionsRequired$1.evaluate(TestRuleAss
> ertionsRequired.java:43)
> 	at
> org.apache.lucene.util.TestRuleMarkFailure$1.evaluate(TestRuleMarkFailure
> .java:48)
> 	at
> org.apache.lucene.util.TestRuleIgnoreAfterMaxFailures$1.evaluate(TestRule
> IgnoreAfterMaxFailures.java:65)
> 	at
> org.apache.lucene.util.TestRuleIgnoreTestSuites$1.evaluate(TestRuleIgnore
> TestSuites.java:55)
> 	at
> com.carrotsearch.randomizedtesting.rules.StatementAdapter.evaluate(Stat
> ementAdapter.java:36)
> 	at
> com.carrotsearch.randomizedtesting.ThreadLeakControl$StatementRunner.
> run(ThreadLeakControl.java:365)
> 	at java.lang.Thread.run(Thread.java:745)
> 
> 
> FAILED:
> org.apache.lucene.codecs.lucene40.TestLucene40DocValuesFormat.testSort
> edFixedLengthVsStoredFields
> 
> Error Message:
> On Linux and MacOSX fsyncing a directory should not throw IOException, we
> just don't want to rely on that in production (undocumented). Got:
> java.nio.file.FileSystemException: /mnt/ssd/jenkins/workspace/Lucene-Solr-
> 4.10-
> Linux/lucene/build/core/test/J0/lucene.codecs.lucene40.TestLucene40DocV
> aluesFormat-50D540524CD2431C-001/dvduel-001: Is a directory
> 
> Stack Trace:
> java.lang.AssertionError: On Linux and MacOSX fsyncing a directory should
> not throw IOException, we just don't want to rely on that in production
> (undocumented). Got: java.nio.file.FileSystemException:
> /mnt/ssd/jenkins/workspace/Lucene-Solr-4.10-
> Linux/lucene/build/core/test/J0/lucene.codecs.lucene40.TestLucene40DocV
> aluesFormat-50D540524CD2431C-001/dvduel-001: Is a directory
> 	at
> __randomizedtesting.SeedInfo.seed([50D540524CD2431C:BC5033C283DBE1A
> B]:0)
> 	at org.apache.lucene.util.IOUtils.fsync(IOUtils.java:339)
> 	at org.apache.lucene.store.FSDirectory.sync(FSDirectory.java:311)
> 	at
> org.apache.lucene.store.MockDirectoryWrapper.sync(MockDirectoryWrapp
> er.java:233)
> 	at
> org.apache.lucene.index.SegmentInfos.finishCommit(SegmentInfos.java:10
> 98)
> 	at
> org.apache.lucene.index.IndexWriter.finishCommit(IndexWriter.java:3143)
> 	at
> org.apache.lucene.index.IndexWriter.commitInternal(IndexWriter.java:3124
> )
> 	at
> org.apache.lucene.index.IndexWriter.commit(IndexWriter.java:3084)
> 	at
> org.apache.lucene.index.RandomIndexWriter.commit(RandomIndexWriter.j
> ava:260)
> 	at
> org.apache.lucene.index.BaseDocValuesFormatTestCase.doTestSortedVsSto
> redFields(BaseDocValuesFormatTestCase.java:1517)
> 	at
> org.apache.lucene.index.BaseDocValuesFormatTestCase.testSortedFixedLe
> ngthVsStoredFields(BaseDocValuesFormatTestCase.java:1608)
> 	at sun.reflect.NativeMethodAccessorImpl.invoke0(Native Method)
> 	at
> sun.reflect.NativeMethodAccessorImpl.invoke(NativeMethodAccessorImpl.j
> ava:62)
> 	at
> sun.reflect.DelegatingMethodAccessorImpl.invoke(DelegatingMethodAcces
> sorImpl.java:43)
> 	at java.lang.reflect.Method.invoke(Method.java:498)
> 	at
> com.carrotsearch.randomizedtesting.RandomizedRunner.invoke(Randomize
> dRunner.java:1618)
> 	at
> com.carrotsearch.randomizedtesting.RandomizedRunner$6.evaluate(Rando
> mizedRunner.java:827)
> 	at
> com.carrotsearch.randomizedtesting.RandomizedRunner$7.evaluate(Rando
> mizedRunner.java:863)
> 	at
> com.carrotsearch.randomizedtesting.RandomizedRunner$8.evaluate(Rando
> mizedRunner.java:877)
> 	at
> org.apache.lucene.util.TestRuleSetupTeardownChained$1.evaluate(TestRule
> SetupTeardownChained.java:50)
> 	at
> org.apache.lucene.util.TestRuleFieldCacheSanity$1.evaluate(TestRuleFieldCa
> cheSanity.java:51)
> 	at
> org.apache.lucene.util.AbstractBeforeAfterRule$1.evaluate(AbstractBeforeA
> fterRule.java:46)
> 	at
> com.carrotsearch.randomizedtesting.rules.SystemPropertiesInvariantRule$1
> .evaluate(SystemPropertiesInvariantRule.java:55)
> 	at
> org.apache.lucene.util.TestRuleThreadAndTestName$1.evaluate(TestRuleTh
> readAndTestName.java:49)
> 	at
> org.apache.lucene.util.TestRuleIgnoreAfterMaxFailures$1.evaluate(TestRule
> IgnoreAfterMaxFailures.java:65)
> 	at
> org.apache.lucene.util.TestRuleMarkFailure$1.evaluate(TestRuleMarkFailure
> .java:48)
> 	at
> com.carrotsearch.randomizedtesting.rules.StatementAdapter.evaluate(Stat
> ementAdapter.java:36)
> 	at
> com.carrotsearch.randomizedtesting.ThreadLeakControl$StatementRunner.
> run(ThreadLeakControl.java:365)
> 	at
> com.carrotsearch.randomizedtesting.ThreadLeakControl.forkTimeoutingTask
> (ThreadLeakControl.java:798)
> 	at
> com.carrotsearch.randomizedtesting.ThreadLeakControl$3.evaluate(ThreadL
> eakControl.java:458)
> 	at
> com.carrotsearch.randomizedtesting.RandomizedRunner.runSingleTest(Ran
> domizedRunner.java:836)
> 	at
> com.carrotsearch.randomizedtesting.RandomizedRunner$3.evaluate(Rando
> mizedRunner.java:738)
> 	at
> com.carrotsearch.randomizedtesting.RandomizedRunner$4.evaluate(Rando
> mizedRunner.java:772)
> 	at
> com.carrotsearch.randomizedtesting.RandomizedRunner$5.evaluate(Rando
> mizedRunner.java:783)
> 	at
> org.apache.lucene.util.AbstractBeforeAfterRule$1.evaluate(AbstractBeforeA
> fterRule.java:46)
> 	at
> org.apache.lucene.util.TestRuleStoreClassName$1.evaluate(TestRuleStoreCl
> assName.java:42)
> 	at
> com.carrotsearch.randomizedtesting.rules.SystemPropertiesInvariantRule$1
> .evaluate(SystemPropertiesInvariantRule.java:55)
> 	at
> com.carrotsearch.randomizedtesting.rules.NoShadowingOrOverridesOnMet
> hodsRule$1.evaluate(NoShadowingOrOverridesOnMethodsRule.java:39)
> 	at
> com.carrotsearch.randomizedtesting.rules.NoShadowingOrOverridesOnMet
> hodsRule$1.evaluate(NoShadowingOrOverridesOnMethodsRule.java:39)
> 	at
> com.carrotsearch.randomizedtesting.rules.StatementAdapter.evaluate(Stat
> ementAdapter.java:36)
> 	at
> com.carrotsearch.randomizedtesting.rules.StatementAdapter.evaluate(Stat
> ementAdapter.java:36)
> 	at
> com.carrotsearch.randomizedtesting.rules.StatementAdapter.evaluate(Stat
> ementAdapter.java:36)
> 	at
> org.apache.lucene.util.TestRuleAssertionsRequired$1.evaluate(TestRuleAss
> ertionsRequired.java:43)
> 	at
> org.apache.lucene.util.TestRuleMarkFailure$1.evaluate(TestRuleMarkFailure
> .java:48)
> 	at
> org.apache.lucene.util.TestRuleIgnoreAfterMaxFailures$1.evaluate(TestRule
> IgnoreAfterMaxFailures.java:65)
> 	at
> org.apache.lucene.util.TestRuleIgnoreTestSuites$1.evaluate(TestRuleIgnore
> TestSuites.java:55)
> 	at
> com.carrotsearch.randomizedtesting.rules.StatementAdapter.evaluate(Stat
> ementAdapter.java:36)
> 	at
> com.carrotsearch.randomizedtesting.ThreadLeakControl$StatementRunner.
> run(ThreadLeakControl.java:365)
> 	at java.lang.Thread.run(Thread.java:745)
> 
> 
> FAILED:
> org.apache.lucene.codecs.lucene40.TestLucene40DocValuesFormat.testSort
> edVariableLengthVsStoredFields
> 
> Error Message:
> On Linux and MacOSX fsyncing a directory should not throw IOException, we
> just don't want to rely on that in production (undocumented). Got:
> java.nio.file.FileSystemException: /mnt/ssd/jenkins/workspace/Lucene-Solr-
> 4.10-
> Linux/lucene/build/core/test/J0/lucene.codecs.lucene40.TestLucene40DocV
> aluesFormat-50D540524CD2431C-001/dvduel-002: Is a directory
> 
> Stack Trace:
> java.lang.AssertionError: On Linux and MacOSX fsyncing a directory should
> not throw IOException, we just don't want to rely on that in production
> (undocumented). Got: java.nio.file.FileSystemException:
> /mnt/ssd/jenkins/workspace/Lucene-Solr-4.10-
> Linux/lucene/build/core/test/J0/lucene.codecs.lucene40.TestLucene40DocV
> aluesFormat-50D540524CD2431C-001/dvduel-002: Is a directory
> 	at
> __randomizedtesting.SeedInfo.seed([50D540524CD2431C:636F8D3872E2B55
> 7]:0)
> 	at org.apache.lucene.util.IOUtils.fsync(IOUtils.java:339)
> 	at org.apache.lucene.store.FSDirectory.sync(FSDirectory.java:311)
> 	at
> org.apache.lucene.store.MockDirectoryWrapper.sync(MockDirectoryWrapp
> er.java:233)
> 	at
> org.apache.lucene.index.SegmentInfos.finishCommit(SegmentInfos.java:10
> 98)
> 	at
> org.apache.lucene.index.IndexWriter.finishCommit(IndexWriter.java:3143)
> 	at
> org.apache.lucene.index.IndexWriter.commitInternal(IndexWriter.java:3124
> )
> 	at
> org.apache.lucene.index.IndexWriter.commit(IndexWriter.java:3084)
> 	at
> org.apache.lucene.index.RandomIndexWriter.maybeCommit(RandomIndex
> Writer.java:161)
> 	at
> org.apache.lucene.index.RandomIndexWriter.addDocument(RandomIndex
> Writer.java:152)
> 	at
> org.apache.lucene.index.RandomIndexWriter.addDocument(RandomIndex
> Writer.java:110)
> 	at
> org.apache.lucene.index.BaseDocValuesFormatTestCase.doTestSortedVsSto
> redFields(BaseDocValuesFormatTestCase.java:1515)
> 	at
> org.apache.lucene.index.BaseDocValuesFormatTestCase.testSortedVariable
> LengthVsStoredFields(BaseDocValuesFormatTestCase.java:1630)
> 	at sun.reflect.NativeMethodAccessorImpl.invoke0(Native Method)
> 	at
> sun.reflect.NativeMethodAccessorImpl.invoke(NativeMethodAccessorImpl.j
> ava:62)
> 	at
> sun.reflect.DelegatingMethodAccessorImpl.invoke(DelegatingMethodAcces
> sorImpl.java:43)
> 	at java.lang.reflect.Method.invoke(Method.java:498)
> 	at
> com.carrotsearch.randomizedtesting.RandomizedRunner.invoke(Randomize
> dRunner.java:1618)
> 	at
> com.carrotsearch.randomizedtesting.RandomizedRunner$6.evaluate(Rando
> mizedRunner.java:827)
> 	at
> com.carrotsearch.randomizedtesting.RandomizedRunner$7.evaluate(Rando
> mizedRunner.java:863)
> 	at
> com.carrotsearch.randomizedtesting.RandomizedRunner$8.evaluate(Rando
> mizedRunner.java:877)
> 	at
> org.apache.lucene.util.TestRuleSetupTeardownChained$1.evaluate(TestRule
> SetupTeardownChained.java:50)
> 	at
> org.apache.lucene.util.TestRuleFieldCacheSanity$1.evaluate(TestRuleFieldCa
> cheSanity.java:51)
> 	at
> org.apache.lucene.util.AbstractBeforeAfterRule$1.evaluate(AbstractBeforeA
> fterRule.java:46)
> 	at
> com.carrotsearch.randomizedtesting.rules.SystemPropertiesInvariantRule$1
> .evaluate(SystemPropertiesInvariantRule.java:55)
> 	at
> org.apache.lucene.util.TestRuleThreadAndTestName$1.evaluate(TestRuleTh
> readAndTestName.java:49)
> 	at
> org.apache.lucene.util.TestRuleIgnoreAfterMaxFailures$1.evaluate(TestRule
> IgnoreAfterMaxFailures.java:65)
> 	at
> org.apache.lucene.util.TestRuleMarkFailure$1.evaluate(TestRuleMarkFailure
> .java:48)
> 	at
> com.carrotsearch.randomizedtesting.rules.StatementAdapter.evaluate(Stat
> ementAdapter.java:36)
> 	at
> com.carrotsearch.randomizedtesting.ThreadLeakControl$StatementRunner.
> run(ThreadLeakControl.java:365)
> 	at
> com.carrotsearch.randomizedtesting.ThreadLeakControl.forkTimeoutingTask
> (ThreadLeakControl.java:798)
> 	at
> com.carrotsearch.randomizedtesting.ThreadLeakControl$3.evaluate(ThreadL
> eakControl.java:458)
> 	at
> com.carrotsearch.randomizedtesting.RandomizedRunner.runSingleTest(Ran
> domizedRunner.java:836)
> 	at
> com.carrotsearch.randomizedtesting.RandomizedRunner$3.evaluate(Rando
> mizedRunner.java:738)
> 	at
> com.carrotsearch.randomizedtesting.RandomizedRunner$4.evaluate(Rando
> mizedRunner.java:772)
> 	at
> com.carrotsearch.randomizedtesting.RandomizedRunner$5.evaluate(Rando
> mizedRunner.java:783)
> 	at
> org.apache.lucene.util.AbstractBeforeAfterRule$1.evaluate(AbstractBeforeA
> fterRule.java:46)
> 	at
> org.apache.lucene.util.TestRuleStoreClassName$1.evaluate(TestRuleStoreCl
> assName.java:42)
> 	at
> com.carrotsearch.randomizedtesting.rules.SystemPropertiesInvariantRule$1
> .evaluate(SystemPropertiesInvariantRule.java:55)
> 	at
> com.carrotsearch.randomizedtesting.rules.NoShadowingOrOverridesOnMet
> hodsRule$1.evaluate(NoShadowingOrOverridesOnMethodsRule.java:39)
> 	at
> com.carrotsearch.randomizedtesting.rules.NoShadowingOrOverridesOnMet
> hodsRule$1.evaluate(NoShadowingOrOverridesOnMethodsRule.java:39)
> 	at
> com.carrotsearch.randomizedtesting.rules.StatementAdapter.evaluate(Stat
> ementAdapter.java:36)
> 	at
> com.carrotsearch.randomizedtesting.rules.StatementAdapter.evaluate(Stat
> ementAdapter.java:36)
> 	at
> com.carrotsearch.randomizedtesting.rules.StatementAdapter.evaluate(Stat
> ementAdapter.java:36)
> 	at
> org.apache.lucene.util.TestRuleAssertionsRequired$1.evaluate(TestRuleAss
> ertionsRequired.java:43)
> 	at
> org.apache.lucene.util.TestRuleMarkFailure$1.evaluate(TestRuleMarkFailure
> .java:48)
> 	at
> org.apache.lucene.util.TestRuleIgnoreAfterMaxFailures$1.evaluate(TestRule
> IgnoreAfterMaxFailures.java:65)
> 	at
> org.apache.lucene.util.TestRuleIgnoreTestSuites$1.evaluate(TestRuleIgnore
> TestSuites.java:55)
> 	at
> com.carrotsearch.randomizedtesting.rules.StatementAdapter.evaluate(Stat
> ementAdapter.java:36)
> 	at
> com.carrotsearch.randomizedtesting.ThreadLeakControl$StatementRunner.
> run(ThreadLeakControl.java:365)
> 	at java.lang.Thread.run(Thread.java:745)
> 
> 
> FAILED:
> org.apache.lucene.codecs.lucene410.TestLucene410DocValuesFormat.testS
> ortedSetFixedLengthSingleValuedVsStoredFields
> 
> Error Message:
> On Linux and MacOSX fsyncing a directory should not throw IOException, we
> just don't want to rely on that in production (undocumented). Got:
> java.nio.file.FileSystemException: /mnt/ssd/jenkins/workspace/Lucene-Solr-
> 4.10-
> Linux/lucene/build/core/test/J0/lucene.codecs.lucene410.TestLucene410Do
> cValuesFormat-50D540524CD2431C-001/dvduel-001: Is a directory
> 
> Stack Trace:
> java.lang.AssertionError: On Linux and MacOSX fsyncing a directory should
> not throw IOException, we just don't want to rely on that in production
> (undocumented). Got: java.nio.file.FileSystemException:
> /mnt/ssd/jenkins/workspace/Lucene-Solr-4.10-
> Linux/lucene/build/core/test/J0/lucene.codecs.lucene410.TestLucene410Do
> cValuesFormat-50D540524CD2431C-001/dvduel-001: Is a directory
> 	at
> __randomizedtesting.SeedInfo.seed([50D540524CD2431C:D4A4F5B4AFABD8
> 01]:0)
> 	at org.apache.lucene.util.IOUtils.fsync(IOUtils.java:339)
> 	at org.apache.lucene.store.FSDirectory.sync(FSDirectory.java:311)
> 	at
> org.apache.lucene.store.MockDirectoryWrapper.sync(MockDirectoryWrapp
> er.java:233)
> 	at
> org.apache.lucene.index.IndexWriter.startCommit(IndexWriter.java:4561)
> 	at
> org.apache.lucene.index.IndexWriter.prepareCommitInternal(IndexWriter.j
> ava:3014)
> 	at
> org.apache.lucene.index.IndexWriter.commitInternal(IndexWriter.java:3117
> )
> 	at
> org.apache.lucene.index.IndexWriter.commit(IndexWriter.java:3084)
> 	at
> org.apache.lucene.index.RandomIndexWriter.commit(RandomIndexWriter.j
> ava:260)
> 	at
> org.apache.lucene.index.BaseDocValuesFormatTestCase.doTestSortedSetVs
> StoredFields(BaseDocValuesFormatTestCase.java:2109)
> 	at
> org.apache.lucene.index.BaseDocValuesFormatTestCase.testSortedSetFixed
> LengthSingleValuedVsStoredFields(BaseDocValuesFormatTestCase.java:2253
> )
> 	at sun.reflect.NativeMethodAccessorImpl.invoke0(Native Method)
> 	at
> sun.reflect.NativeMethodAccessorImpl.invoke(NativeMethodAccessorImpl.j
> ava:62)
> 	at
> sun.reflect.DelegatingMethodAccessorImpl.invoke(DelegatingMethodAcces
> sorImpl.java:43)
> 	at java.lang.reflect.Method.invoke(Method.java:498)
> 	at
> com.carrotsearch.randomizedtesting.RandomizedRunner.invoke(Randomize
> dRunner.java:1618)
> 	at
> com.carrotsearch.randomizedtesting.RandomizedRunner$6.evaluate(Rando
> mizedRunner.java:827)
> 	at
> com.carrotsearch.randomizedtesting.RandomizedRunner$7.evaluate(Rando
> mizedRunner.java:863)
> 	at
> com.carrotsearch.randomizedtesting.RandomizedRunner$8.evaluate(Rando
> mizedRunner.java:877)
> 	at
> org.apache.lucene.util.TestRuleSetupTeardownChained$1.evaluate(TestRule
> SetupTeardownChained.java:50)
> 	at
> org.apache.lucene.util.TestRuleFieldCacheSanity$1.evaluate(TestRuleFieldCa
> cheSanity.java:51)
> 	at
> org.apache.lucene.util.AbstractBeforeAfterRule$1.evaluate(AbstractBeforeA
> fterRule.java:46)
> 	at
> com.carrotsearch.randomizedtesting.rules.SystemPropertiesInvariantRule$1
> .evaluate(SystemPropertiesInvariantRule.java:55)
> 	at
> org.apache.lucene.util.TestRuleThreadAndTestName$1.evaluate(TestRuleTh
> readAndTestName.java:49)
> 	at
> org.apache.lucene.util.TestRuleIgnoreAfterMaxFailures$1.evaluate(TestRule
> IgnoreAfterMaxFailures.java:65)
> 	at
> org.apache.lucene.util.TestRuleMarkFailure$1.evaluate(TestRuleMarkFailure
> .java:48)
> 	at
> com.carrotsearch.randomizedtesting.rules.StatementAdapter.evaluate(Stat
> ementAdapter.java:36)
> 	at
> com.carrotsearch.randomizedtesting.ThreadLeakControl$StatementRunner.
> run(ThreadLeakControl.java:365)
> 	at
> com.carrotsearch.randomizedtesting.ThreadLeakControl.forkTimeoutingTask
> (ThreadLeakControl.java:798)
> 	at
> com.carrotsearch.randomizedtesting.ThreadLeakControl$3.evaluate(ThreadL
> eakControl.java:458)
> 	at
> com.carrotsearch.randomizedtesting.RandomizedRunner.runSingleTest(Ran
> domizedRunner.java:836)
> 	at
> com.carrotsearch.randomizedtesting.RandomizedRunner$3.evaluate(Rando
> mizedRunner.java:738)
> 	at
> com.carrotsearch.randomizedtesting.RandomizedRunner$4.evaluate(Rando
> mizedRunner.java:772)
> 	at
> com.carrotsearch.randomizedtesting.RandomizedRunner$5.evaluate(Rando
> mizedRunner.java:783)
> 	at
> org.apache.lucene.util.AbstractBeforeAfterRule$1.evaluate(AbstractBeforeA
> fterRule.java:46)
> 	at
> org.apache.lucene.util.TestRuleStoreClassName$1.evaluate(TestRuleStoreCl
> assName.java:42)
> 	at
> com.carrotsearch.randomizedtesting.rules.SystemPropertiesInvariantRule$1
> .evaluate(SystemPropertiesInvariantRule.java:55)
> 	at
> com.carrotsearch.randomizedtesting.rules.NoShadowingOrOverridesOnMet
> hodsRule$1.evaluate(NoShadowingOrOverridesOnMethodsRule.java:39)
> 	at
> com.carrotsearch.randomizedtesting.rules.NoShadowingOrOverridesOnMet
> hodsRule$1.evaluate(NoShadowingOrOverridesOnMethodsRule.java:39)
> 	at
> com.carrotsearch.randomizedtesting.rules.StatementAdapter.evaluate(Stat
> ementAdapter.java:36)
> 	at
> com.carrotsearch.randomizedtesting.rules.StatementAdapter.evaluate(Stat
> ementAdapter.java:36)
> 	at
> com.carrotsearch.randomizedtesting.rules.StatementAdapter.evaluate(Stat
> ementAdapter.java:36)
> 	at
> org.apache.lucene.util.TestRuleAssertionsRequired$1.evaluate(TestRuleAss
> ertionsRequired.java:43)
> 	at
> org.apache.lucene.util.TestRuleMarkFailure$1.evaluate(TestRuleMarkFailure
> .java:48)
> 	at
> org.apache.lucene.util.TestRuleIgnoreAfterMaxFailures$1.evaluate(TestRule
> IgnoreAfterMaxFailures.java:65)
> 	at
> org.apache.lucene.util.TestRuleIgnoreTestSuites$1.evaluate(TestRuleIgnore
> TestSuites.java:55)
> 	at
> com.carrotsearch.randomizedtesting.rules.StatementAdapter.evaluate(Stat
> ementAdapter.java:36)
> 	at
> com.carrotsearch.randomizedtesting.ThreadLeakControl$StatementRunner.
> run(ThreadLeakControl.java:365)
> 	at java.lang.Thread.run(Thread.java:745)
> 
> 
> FAILED:
> org.apache.lucene.codecs.lucene410.TestLucene410DocValuesFormat.testE
> mptyBinaryValueOnPageSizes
> 
> Error Message:
> On Linux and MacOSX fsyncing a directory should not throw IOException, we
> just don't want to rely on that in production (undocumented). Got:
> java.nio.file.FileSystemException: /mnt/ssd/jenkins/workspace/Lucene-Solr-
> 4.10-
> Linux/lucene/build/core/test/J0/lucene.codecs.lucene410.TestLucene410Do
> cValuesFormat-50D540524CD2431C-001/index-NIOFSDirectory-001: Is a
> directory
> 
> Stack Trace:
> java.lang.AssertionError: On Linux and MacOSX fsyncing a directory should
> not throw IOException, we just don't want to rely on that in production
> (undocumented). Got: java.nio.file.FileSystemException:
> /mnt/ssd/jenkins/workspace/Lucene-Solr-4.10-
> Linux/lucene/build/core/test/J0/lucene.codecs.lucene410.TestLucene410Do
> cValuesFormat-50D540524CD2431C-001/index-NIOFSDirectory-001: Is a
> directory
> 	at
> __randomizedtesting.SeedInfo.seed([50D540524CD2431C:32AC891335DE903
> A]:0)
> 	at org.apache.lucene.util.IOUtils.fsync(IOUtils.java:339)
> 	at org.apache.lucene.store.FSDirectory.sync(FSDirectory.java:311)
> 	at
> org.apache.lucene.store.MockDirectoryWrapper.sync(MockDirectoryWrapp
> er.java:233)
> 	at
> org.apache.lucene.index.SegmentInfos.finishCommit(SegmentInfos.java:10
> 98)
> 	at
> org.apache.lucene.index.IndexWriter.finishCommit(IndexWriter.java:3143)
> 	at
> org.apache.lucene.index.IndexWriter.commitInternal(IndexWriter.java:3124
> )
> 	at
> org.apache.lucene.index.IndexWriter.commit(IndexWriter.java:3084)
> 	at
> org.apache.lucene.index.RandomIndexWriter.getReader(RandomIndexWrit
> er.java:348)
> 	at
> org.apache.lucene.index.RandomIndexWriter.getReader(RandomIndexWrit
> er.java:277)
> 	at
> org.apache.lucene.index.BaseDocValuesFormatTestCase.testEmptyBinaryVa
> lueOnPageSizes(BaseDocValuesFormatTestCase.java:3207)
> 	at sun.reflect.NativeMethodAccessorImpl.invoke0(Native Method)
> 	at
> sun.reflect.NativeMethodAccessorImpl.invoke(NativeMethodAccessorImpl.j
> ava:62)
> 	at
> sun.reflect.DelegatingMethodAccessorImpl.invoke(DelegatingMethodAcces
> sorImpl.java:43)
> 	at java.lang.reflect.Method.invoke(Method.java:498)
> 	at
> com.carrotsearch.randomizedtesting.RandomizedRunner.invoke(Randomize
> dRunner.java:1618)
> 	at
> com.carrotsearch.randomizedtesting.RandomizedRunner$6.evaluate(Rando
> mizedRunner.java:827)
> 	at
> com.carrotsearch.randomizedtesting.RandomizedRunner$7.evaluate(Rando
> mizedRunner.java:863)
> 	at
> com.carrotsearch.randomizedtesting.RandomizedRunner$8.evaluate(Rando
> mizedRunner.java:877)
> 	at
> org.apache.lucene.util.TestRuleSetupTeardownChained$1.evaluate(TestRule
> SetupTeardownChained.java:50)
> 	at
> org.apache.lucene.util.TestRuleFieldCacheSanity$1.evaluate(TestRuleFieldCa
> cheSanity.java:51)
> 	at
> org.apache.lucene.util.AbstractBeforeAfterRule$1.evaluate(AbstractBeforeA
> fterRule.java:46)
> 	at
> com.carrotsearch.randomizedtesting.rules.SystemPropertiesInvariantRule$1
> .evaluate(SystemPropertiesInvariantRule.java:55)
> 	at
> org.apache.lucene.util.TestRuleThreadAndTestName$1.evaluate(TestRuleTh
> readAndTestName.java:49)
> 	at
> org.apache.lucene.util.TestRuleIgnoreAfterMaxFailures$1.evaluate(TestRule
> IgnoreAfterMaxFailures.java:65)
> 	at
> org.apache.lucene.util.TestRuleMarkFailure$1.evaluate(TestRuleMarkFailure
> .java:48)
> 	at
> com.carrotsearch.randomizedtesting.rules.StatementAdapter.evaluate(Stat
> ementAdapter.java:36)
> 	at
> com.carrotsearch.randomizedtesting.ThreadLeakControl$StatementRunner.
> run(ThreadLeakControl.java:365)
> 	at
> com.carrotsearch.randomizedtesting.ThreadLeakControl.forkTimeoutingTask
> (ThreadLeakControl.java:798)
> 	at
> com.carrotsearch.randomizedtesting.ThreadLeakControl$3.evaluate(ThreadL
> eakControl.java:458)
> 	at
> com.carrotsearch.randomizedtesting.RandomizedRunner.runSingleTest(Ran
> domizedRunner.java:836)
> 	at
> com.carrotsearch.randomizedtesting.RandomizedRunner$3.evaluate(Rando
> mizedRunner.java:738)
> 	at
> com.carrotsearch.randomizedtesting.RandomizedRunner$4.evaluate(Rando
> mizedRunner.java:772)
> 	at
> com.carrotsearch.randomizedtesting.RandomizedRunner$5.evaluate(Rando
> mizedRunner.java:783)
> 	at
> org.apache.lucene.util.AbstractBeforeAfterRule$1.evaluate(AbstractBeforeA
> fterRule.java:46)
> 	at
> org.apache.lucene.util.TestRuleStoreClassName$1.evaluate(TestRuleStoreCl
> assName.java:42)
> 	at
> com.carrotsearch.randomizedtesting.rules.SystemPropertiesInvariantRule$1
> .evaluate(SystemPropertiesInvariantRule.java:55)
> 	at
> com.carrotsearch.randomizedtesting.rules.NoShadowingOrOverridesOnMet
> hodsRule$1.evaluate(NoShadowingOrOverridesOnMethodsRule.java:39)
> 	at
> com.carrotsearch.randomizedtesting.rules.NoShadowingOrOverridesOnMet
> hodsRule$1.evaluate(NoShadowingOrOverridesOnMethodsRule.java:39)
> 	at
> com.carrotsearch.randomizedtesting.rules.StatementAdapter.evaluate(Stat
> ementAdapter.java:36)
> 	at
> com.carrotsearch.randomizedtesting.rules.StatementAdapter.evaluate(Stat
> ementAdapter.java:36)
> 	at
> com.carrotsearch.randomizedtesting.rules.StatementAdapter.evaluate(Stat
> ementAdapter.java:36)
> 	at
> org.apache.lucene.util.TestRuleAssertionsRequired$1.evaluate(TestRuleAss
> ertionsRequired.java:43)
> 	at
> org.apache.lucene.util.TestRuleMarkFailure$1.evaluate(TestRuleMarkFailure
> .java:48)
> 	at
> org.apache.lucene.util.TestRuleIgnoreAfterMaxFailures$1.evaluate(TestRule
> IgnoreAfterMaxFailures.java:65)
> 	at
> org.apache.lucene.util.TestRuleIgnoreTestSuites$1.evaluate(TestRuleIgnore
> TestSuites.java:55)
> 	at
> com.carrotsearch.randomizedtesting.rules.StatementAdapter.evaluate(Stat
> ementAdapter.java:36)
> 	at
> com.carrotsearch.randomizedtesting.ThreadLeakControl$StatementRunner.
> run(ThreadLeakControl.java:365)
> 	at java.lang.Thread.run(Thread.java:745)
> 
> 
> FAILED:
> org.apache.lucene.codecs.lucene410.TestLucene410DocValuesFormat.testS
> ortedSetVariableLengthVsStoredFields
> 
> Error Message:
> On Linux and MacOSX fsyncing a directory should not throw IOException, we
> just don't want to rely on that in production (undocumented). Got:
> java.nio.file.FileSystemException: /mnt/ssd/jenkins/workspace/Lucene-Solr-
> 4.10-
> Linux/lucene/build/core/test/J0/lucene.codecs.lucene410.TestLucene410Do
> cValuesFormat-50D540524CD2431C-001/dvduel-002: Is a directory
> 
> Stack Trace:
> java.lang.AssertionError: On Linux and MacOSX fsyncing a directory should
> not throw IOException, we just don't want to rely on that in production
> (undocumented). Got: java.nio.file.FileSystemException:
> /mnt/ssd/jenkins/workspace/Lucene-Solr-4.10-
> Linux/lucene/build/core/test/J0/lucene.codecs.lucene410.TestLucene410Do
> cValuesFormat-50D540524CD2431C-001/dvduel-002: Is a directory
> 	at
> __randomizedtesting.SeedInfo.seed([50D540524CD2431C:74C411AE282E54B
> 1]:0)
> 	at org.apache.lucene.util.IOUtils.fsync(IOUtils.java:339)
> 	at org.apache.lucene.store.FSDirectory.sync(FSDirectory.java:311)
> 	at
> org.apache.lucene.store.MockDirectoryWrapper.sync(MockDirectoryWrapp
> er.java:233)
> 	at
> org.apache.lucene.index.IndexWriter.startCommit(IndexWriter.java:4561)
> 	at
> org.apache.lucene.index.IndexWriter.prepareCommitInternal(IndexWriter.j
> ava:3014)
> 	at
> org.apache.lucene.index.IndexWriter.commitInternal(IndexWriter.java:3117
> )
> 	at
> org.apache.lucene.index.IndexWriter.commit(IndexWriter.java:3084)
> 	at
> org.apache.lucene.index.RandomIndexWriter.commit(RandomIndexWriter.j
> ava:260)
> 	at
> org.apache.lucene.index.BaseDocValuesFormatTestCase.doTestSortedSetVs
> StoredFields(BaseDocValuesFormatTestCase.java:2109)
> 	at
> org.apache.lucene.index.BaseDocValuesFormatTestCase.testSortedSetVaria
> bleLengthVsStoredFields(BaseDocValuesFormatTestCase.java:2244)
> 	at sun.reflect.NativeMethodAccessorImpl.invoke0(Native Method)
> 	at
> sun.reflect.NativeMethodAccessorImpl.invoke(NativeMethodAccessorImpl.j
> ava:62)
> 	at
> sun.reflect.DelegatingMethodAccessorImpl.invoke(DelegatingMethodAcces
> sorImpl.java:43)
> 	at java.lang.reflect.Method.invoke(Method.java:498)
> 	at
> com.carrotsearch.randomizedtesting.RandomizedRunner.invoke(Randomize
> dRunner.java:1618)
> 	at
> com.carrotsearch.randomizedtesting.RandomizedRunner$6.evaluate(Rando
> mizedRunner.java:827)
> 	at
> com.carrotsearch.randomizedtesting.RandomizedRunner$7.evaluate(Rando
> mizedRunner.java:863)
> 	at
> com.carrotsearch.randomizedtesting.RandomizedRunner$8.evaluate(Rando
> mizedRunner.java:877)
> 	at
> org.apache.lucene.util.TestRuleSetupTeardownChained$1.evaluate(TestRule
> SetupTeardownChained.java:50)
> 	at
> org.apache.lucene.util.TestRuleFieldCacheSanity$1.evaluate(TestRuleFieldCa
> cheSanity.java:51)
> 	at
> org.apache.lucene.util.AbstractBeforeAfterRule$1.evaluate(AbstractBeforeA
> fterRule.java:46)
> 	at
> com.carrotsearch.randomizedtesting.rules.SystemPropertiesInvariantRule$1
> .evaluate(SystemPropertiesInvariantRule.java:55)
> 	at
> org.apache.lucene.util.TestRuleThreadAndTestName$1.evaluate(TestRuleTh
> readAndTestName.java:49)
> 	at
> org.apache.lucene.util.TestRuleIgnoreAfterMaxFailures$1.evaluate(TestRule
> IgnoreAfterMaxFailures.java:65)
> 	at
> org.apache.lucene.util.TestRuleMarkFailure$1.evaluate(TestRuleMarkFailure
> .java:48)
> 	at
> com.carrotsearch.randomizedtesting.rules.StatementAdapter.evaluate(Stat
> ementAdapter.java:36)
> 	at
> com.carrotsearch.randomizedtesting.ThreadLeakControl$StatementRunner.
> run(ThreadLeakControl.java:365)
> 	at
> com.carrotsearch.randomizedtesting.ThreadLeakControl.forkTimeoutingTask
> (ThreadLeakControl.java:798)
> 	at
> com.carrotsearch.randomizedtesting.ThreadLeakControl$3.evaluate(ThreadL
> eakControl.java:458)
> 	at
> com.carrotsearch.randomizedtesting.RandomizedRunner.runSingleTest(Ran
> domizedRunner.java:836)
> 	at
> com.carrotsearch.randomizedtesting.RandomizedRunner$3.evaluate(Rando
> mizedRunner.java:738)
> 	at
> com.carrotsearch.randomizedtesting.RandomizedRunner$4.evaluate(Rando
> mizedRunner.java:772)
> 	at
> com.carrotsearch.randomizedtesting.RandomizedRunner$5.evaluate(Rando
> mizedRunner.java:783)
> 	at
> org.apache.lucene.util.AbstractBeforeAfterRule$1.evaluate(AbstractBeforeA
> fterRule.java:46)
> 	at
> org.apache.lucene.util.TestRuleStoreClassName$1.evaluate(TestRuleStoreCl
> assName.java:42)
> 	at
> com.carrotsearch.randomizedtesting.rules.SystemPropertiesInvariantRule$1
> .evaluate(SystemPropertiesInvariantRule.java:55)
> 	at
> com.carrotsearch.randomizedtesting.rules.NoShadowingOrOverridesOnMet
> hodsRule$1.evaluate(NoShadowingOrOverridesOnMethodsRule.java:39)
> 	at
> com.carrotsearch.randomizedtesting.rules.NoShadowingOrOverridesOnMet
> hodsRule$1.evaluate(NoShadowingOrOverridesOnMethodsRule.java:39)
> 	at
> com.carrotsearch.randomizedtesting.rules.StatementAdapter.evaluate(Stat
> ementAdapter.java:36)
> 	at
> com.carrotsearch.randomizedtesting.rules.StatementAdapter.evaluate(Stat
> ementAdapter.java:36)
> 	at
> com.carrotsearch.randomizedtesting.rules.StatementAdapter.evaluate(Stat
> ementAdapter.java:36)
> 	at
> org.apache.lucene.util.TestRuleAssertionsRequired$1.evaluate(TestRuleAss
> ertionsRequired.java:43)
> 	at
> org.apache.lucene.util.TestRuleMarkFailure$1.evaluate(TestRuleMarkFailure
> .java:48)
> 	at
> org.apache.lucene.util.TestRuleIgnoreAfterMaxFailures$1.evaluate(TestRule
> IgnoreAfterMaxFailures.java:65)
> 	at
> org.apache.lucene.util.TestRuleIgnoreTestSuites$1.evaluate(TestRuleIgnore
> TestSuites.java:55)
> 	at
> com.carrotsearch.randomizedtesting.rules.StatementAdapter.evaluate(Stat
> ementAdapter.java:36)
> 	at
> com.carrotsearch.randomizedtesting.ThreadLeakControl$StatementRunner.
> run(ThreadLeakControl.java:365)
> 	at java.lang.Thread.run(Thread.java:745)
> 
> 
> FAILED:
> org.apache.lucene.codecs.lucene410.TestLucene410DocValuesFormat.testS
> ortedVariableLengthVsStoredFields
> 
> Error Message:
> On Linux and MacOSX fsyncing a directory should not throw IOException, we
> just don't want to rely on that in production (undocumented). Got:
> java.nio.file.FileSystemException: /mnt/ssd/jenkins/workspace/Lucene-Solr-
> 4.10-
> Linux/lucene/build/core/test/J0/lucene.codecs.lucene410.TestLucene410Do
> cValuesFormat-50D540524CD2431C-001/dvduel-003: Is a directory
> 
> Stack Trace:
> java.lang.AssertionError: On Linux and MacOSX fsyncing a directory should
> not throw IOException, we just don't want to rely on that in production
> (undocumented). Got: java.nio.file.FileSystemException:
> /mnt/ssd/jenkins/workspace/Lucene-Solr-4.10-
> Linux/lucene/build/core/test/J0/lucene.codecs.lucene410.TestLucene410Do
> cValuesFormat-50D540524CD2431C-001/dvduel-003: Is a directory
> 	at
> __randomizedtesting.SeedInfo.seed([50D540524CD2431C:636F8D3872E2B55
> 7]:0)
> 	at org.apache.lucene.util.IOUtils.fsync(IOUtils.java:339)
> 	at org.apache.lucene.store.FSDirectory.sync(FSDirectory.java:311)
> 	at
> org.apache.lucene.store.MockDirectoryWrapper.sync(MockDirectoryWrapp
> er.java:233)
> 	at
> org.apache.lucene.index.IndexWriter.startCommit(IndexWriter.java:4561)
> 	at
> org.apache.lucene.index.IndexWriter.prepareCommitInternal(IndexWriter.j
> ava:3014)
> 	at
> org.apache.lucene.index.IndexWriter.commitInternal(IndexWriter.java:3117
> )
> 	at
> org.apache.lucene.index.IndexWriter.commit(IndexWriter.java:3084)
> 	at
> org.apache.lucene.index.RandomIndexWriter.commit(RandomIndexWriter.j
> ava:260)
> 	at
> org.apache.lucene.index.BaseDocValuesFormatTestCase.doTestSortedVsSto
> redFields(BaseDocValuesFormatTestCase.java:1517)
> 	at
> org.apache.lucene.index.BaseDocValuesFormatTestCase.testSortedVariable
> LengthVsStoredFields(BaseDocValuesFormatTestCase.java:1630)
> 	at sun.reflect.NativeMethodAccessorImpl.invoke0(Native Method)
> 	at
> sun.reflect.NativeMethodAccessorImpl.invoke(NativeMethodAccessorImpl.j
> ava:62)
> 	at
> sun.reflect.DelegatingMethodAccessorImpl.invoke(DelegatingMethodAcces
> sorImpl.java:43)
> 	at java.lang.reflect.Method.invoke(Method.java:498)
> 	at
> com.carrotsearch.randomizedtesting.RandomizedRunner.invoke(Randomize
> dRunner.java:1618)
> 	at
> com.carrotsearch.randomizedtesting.RandomizedRunner$6.evaluate(Rando
> mizedRunner.java:827)
> 	at
> com.carrotsearch.randomizedtesting.RandomizedRunner$7.evaluate(Rando
> mizedRunner.java:863)
> 	at
> com.carrotsearch.randomizedtesting.RandomizedRunner$8.evaluate(Rando
> mizedRunner.java:877)
> 	at
> org.apache.lucene.util.TestRuleSetupTeardownChained$1.evaluate(TestRule
> SetupTeardownChained.java:50)
> 	at
> org.apache.lucene.util.TestRuleFieldCacheSanity$1.evaluate(TestRuleFieldCa
> cheSanity.java:51)
> 	at
> org.apache.lucene.util.AbstractBeforeAfterRule$1.evaluate(AbstractBeforeA
> fterRule.java:46)
> 	at
> com.carrotsearch.randomizedtesting.rules.SystemPropertiesInvariantRule$1
> .evaluate(SystemPropertiesInvariantRule.java:55)
> 	at
> org.apache.lucene.util.TestRuleThreadAndTestName$1.evaluate(TestRuleTh
> readAndTestName.java:49)
> 	at
> org.apache.lucene.util.TestRuleIgnoreAfterMaxFailures$1.evaluate(TestRule
> IgnoreAfterMaxFailures.java:65)
> 	at
> org.apache.lucene.util.TestRuleMarkFailure$1.evaluate(TestRuleMarkFailure
> .java:48)
> 	at
> com.carrotsearch.randomizedtesting.rules.StatementAdapter.evaluate(Stat
> ementAdapter.java:36)
> 	at
> com.carrotsearch.randomizedtesting.ThreadLeakControl$StatementRunner.
> run(ThreadLeakControl.java:365)
> 	at
> com.carrotsearch.randomizedtesting.ThreadLeakControl.forkTimeoutingTask
> (ThreadLeakControl.java:798)
> 	at
> com.carrotsearch.randomizedtesting.ThreadLeakControl$3.evaluate(ThreadL
> eakControl.java:458)
> 	at
> com.carrotsearch.randomizedtesting.RandomizedRunner.runSingleTest(Ran
> domizedRunner.java:836)
> 	at
> com.carrotsearch.randomizedtesting.RandomizedRunner$3.evaluate(Rando
> mizedRunner.java:738)
> 	at
> com.carrotsearch.randomizedtesting.RandomizedRunner$4.evaluate(Rando
> mizedRunner.java:772)
> 	at
> com.carrotsearch.randomizedtesting.RandomizedRunner$5.evaluate(Rando
> mizedRunner.java:783)
> 	at
> org.apache.lucene.util.AbstractBeforeAfterRule$1.evaluate(AbstractBeforeA
> fterRule.java:46)
> 	at
> org.apache.lucene.util.TestRuleStoreClassName$1.evaluate(TestRuleStoreCl
> assName.java:42)
> 	at
> com.carrotsearch.randomizedtesting.rules.SystemPropertiesInvariantRule$1
> .evaluate(SystemPropertiesInvariantRule.java:55)
> 	at
> com.carrotsearch.randomizedtesting.rules.NoShadowingOrOverridesOnMet
> hodsRule$1.evaluate(NoShadowingOrOverridesOnMethodsRule.java:39)
> 	at
> com.carrotsearch.randomizedtesting.rules.NoShadowingOrOverridesOnMet
> hodsRule$1.evaluate(NoShadowingOrOverridesOnMethodsRule.java:39)
> 	at
> com.carrotsearch.randomizedtesting.rules.StatementAdapter.evaluate(Stat
> ementAdapter.java:36)
> 	at
> com.carrotsearch.randomizedtesting.rules.StatementAdapter.evaluate(Stat
> ementAdapter.java:36)
> 	at
> com.carrotsearch.randomizedtesting.rules.StatementAdapter.evaluate(Stat
> ementAdapter.java:36)
> 	at
> org.apache.lucene.util.TestRuleAssertionsRequired$1.evaluate(TestRuleAss
> ertionsRequired.java:43)
> 	at
> org.apache.lucene.util.TestRuleMarkFailure$1.evaluate(TestRuleMarkFailure
> .java:48)
> 	at
> org.apache.lucene.util.TestRuleIgnoreAfterMaxFailures$1.evaluate(TestRule
> IgnoreAfterMaxFailures.java:65)
> 	at
> org.apache.lucene.util.TestRuleIgnoreTestSuites$1.evaluate(TestRuleIgnore
> TestSuites.java:55)
> 	at
> com.carrotsearch.randomizedtesting.rules.StatementAdapter.evaluate(Stat
> ementAdapter.java:36)
> 	at
> com.carrotsearch.randomizedtesting.ThreadLeakControl$StatementRunner.
> run(ThreadLeakControl.java:365)
> 	at java.lang.Thread.run(Thread.java:745)
> 
> 
> FAILED:
> org.apache.lucene.codecs.lucene410.TestLucene410DocValuesFormat.testS
> ortedSetVariableLengthSingleValuedVsStoredFields
> 
> Error Message:
> On Linux and MacOSX fsyncing a directory should not throw IOException, we
> just don't want to rely on that in production (undocumented). Got:
> java.nio.file.FileSystemException: /mnt/ssd/jenkins/workspace/Lucene-Solr-
> 4.10-
> Linux/lucene/build/core/test/J0/lucene.codecs.lucene410.TestLucene410Do
> cValuesFormat-50D540524CD2431C-001/dvduel-004: Is a directory
> 
> Stack Trace:
> java.lang.AssertionError: On Linux and MacOSX fsyncing a directory should
> not throw IOException, we just don't want to rely on that in production
> (undocumented). Got: java.nio.file.FileSystemException:
> /mnt/ssd/jenkins/workspace/Lucene-Solr-4.10-
> Linux/lucene/build/core/test/J0/lucene.codecs.lucene410.TestLucene410Do
> cValuesFormat-50D540524CD2431C-001/dvduel-004: Is a directory
> 	at
> __randomizedtesting.SeedInfo.seed([50D540524CD2431C:A0A60B6466D153E
> F]:0)
> 	at org.apache.lucene.util.IOUtils.fsync(IOUtils.java:339)
> 	at org.apache.lucene.store.FSDirectory.sync(FSDirectory.java:311)
> 	at
> org.apache.lucene.store.MockDirectoryWrapper.sync(MockDirectoryWrapp
> er.java:233)
> 	at
> org.apache.lucene.index.SegmentInfos.finishCommit(SegmentInfos.java:10
> 98)
> 	at
> org.apache.lucene.index.IndexWriter.finishCommit(IndexWriter.java:3143)
> 	at
> org.apache.lucene.index.IndexWriter.commitInternal(IndexWriter.java:3124
> )
> 	at
> org.apache.lucene.index.IndexWriter.commit(IndexWriter.java:3084)
> 	at
> org.apache.lucene.index.RandomIndexWriter.commit(RandomIndexWriter.j
> ava:260)
> 	at
> org.apache.lucene.index.BaseDocValuesFormatTestCase.doTestSortedSetVs
> StoredFields(BaseDocValuesFormatTestCase.java:2109)
> 	at
> org.apache.lucene.index.BaseDocValuesFormatTestCase.testSortedSetVaria
> bleLengthSingleValuedVsStoredFields(BaseDocValuesFormatTestCase.java:2
> 261)
> 	at sun.reflect.NativeMethodAccessorImpl.invoke0(Native Method)
> 	at
> sun.reflect.NativeMethodAccessorImpl.invoke(NativeMethodAccessorImpl.j
> ava:62)
> 	at
> sun.reflect.DelegatingMethodAccessorImpl.invoke(DelegatingMethodAcces
> sorImpl.java:43)
> 	at java.lang.reflect.Method.invoke(Method.java:498)
> 	at
> com.carrotsearch.randomizedtesting.RandomizedRunner.invoke(Randomize
> dRunner.java:1618)
> 	at
> com.carrotsearch.randomizedtesting.RandomizedRunner$6.evaluate(Rando
> mizedRunner.java:827)
> 	at
> com.carrotsearch.randomizedtesting.RandomizedRunner$7.evaluate(Rando
> mizedRunner.java:863)
> 	at
> com.carrotsearch.randomizedtesting.RandomizedRunner$8.evaluate(Rando
> mizedRunner.java:877)
> 	at
> org.apache.lucene.util.TestRuleSetupTeardownChained$1.evaluate(TestRule
> SetupTeardownChained.java:50)
> 	at
> org.apache.lucene.util.TestRuleFieldCacheSanity$1.evaluate(TestRuleFieldCa
> cheSanity.java:51)
> 	at
> org.apache.lucene.util.AbstractBeforeAfterRule$1.evaluate(AbstractBeforeA
> fterRule.java:46)
> 	at
> com.carrotsearch.randomizedtesting.rules.SystemPropertiesInvariantRule$1
> .evaluate(SystemPropertiesInvariantRule.java:55)
> 	at
> org.apache.lucene.util.TestRuleThreadAndTestName$1.evaluate(TestRuleTh
> readAndTestName.java:49)
> 	at
> org.apache.lucene.util.TestRuleIgnoreAfterMaxFailures$1.evaluate(TestRule
> IgnoreAfterMaxFailures.java:65)
> 	at
> org.apache.lucene.util.TestRuleMarkFailure$1.evaluate(TestRuleMarkFailure
> .java:48)
> 	at
> com.carrotsearch.randomizedtesting.rules.StatementAdapter.evaluate(Stat
> ementAdapter.java:36)
> 	at
> com.carrotsearch.randomizedtesting.ThreadLeakControl$StatementRunner.
> run(ThreadLeakControl.java:365)
> 	at
> com.carrotsearch.randomizedtesting.ThreadLeakControl.forkTimeoutingTask
> (ThreadLeakControl.java:798)
> 	at
> com.carrotsearch.randomizedtesting.ThreadLeakControl$3.evaluate(ThreadL
> eakControl.java:458)
> 	at
> com.carrotsearch.randomizedtesting.RandomizedRunner.runSingleTest(Ran
> domizedRunner.java:836)
> 	at
> com.carrotsearch.randomizedtesting.RandomizedRunner$3.evaluate(Rando
> mizedRunner.java:738)
> 	at
> com.carrotsearch.randomizedtesting.RandomizedRunner$4.evaluate(Rando
> mizedRunner.java:772)
> 	at
> com.carrotsearch.randomizedtesting.RandomizedRunner$5.evaluate(Rando
> mizedRunner.java:783)
> 	at
> org.apache.lucene.util.AbstractBeforeAfterRule$1.evaluate(AbstractBeforeA
> fterRule.java:46)
> 	at
> org.apache.lucene.util.TestRuleStoreClassName$1.evaluate(TestRuleStoreCl
> assName.java:42)
> 	at
> com.carrotsearch.randomizedtesting.rules.SystemPropertiesInvariantRule$1
> .evaluate(SystemPropertiesInvariantRule.java:55)
> 	at
> com.carrotsearch.randomizedtesting.rules.NoShadowingOrOverridesOnMet
> hodsRule$1.evaluate(NoShadowingOrOverridesOnMethodsRule.java:39)
> 	at
> com.carrotsearch.randomizedtesting.rules.NoShadowingOrOverridesOnMet
> hodsRule$1.evaluate(NoShadowingOrOverridesOnMethodsRule.java:39)
> 	at
> com.carrotsearch.randomizedtesting.rules.StatementAdapter.evaluate(Stat
> ementAdapter.java:36)
> 	at
> com.carrotsearch.randomizedtesting.rules.StatementAdapter.evaluate(Stat
> ementAdapter.java:36)
> 	at
> com.carrotsearch.randomizedtesting.rules.StatementAdapter.evaluate(Stat
> ementAdapter.java:36)
> 	at
> org.apache.lucene.util.TestRuleAssertionsRequired$1.evaluate(TestRuleAss
> ertionsRequired.java:43)
> 	at
> org.apache.lucene.util.TestRuleMarkFailure$1.evaluate(TestRuleMarkFailure
> .java:48)
> 	at
> org.apache.lucene.util.TestRuleIgnoreAfterMaxFailures$1.evaluate(TestRule
> IgnoreAfterMaxFailures.java:65)
> 	at
> org.apache.lucene.util.TestRuleIgnoreTestSuites$1.evaluate(TestRuleIgnore
> TestSuites.java:55)
> 	at
> com.carrotsearch.randomizedtesting.rules.StatementAdapter.evaluate(Stat
> ementAdapter.java:36)
> 	at
> com.carrotsearch.randomizedtesting.ThreadLeakControl$StatementRunner.
> run(ThreadLeakControl.java:365)
> 	at java.lang.Thread.run(Thread.java:745)
> 
> 
> FAILED:
> org.apache.lucene.codecs.lucene410.TestLucene410DocValuesFormat.testS
> ortedFixedLengthVsStoredFields
> 
> Error Message:
> On Linux and MacOSX fsyncing a directory should not throw IOException, we
> just don't want to rely on that in production (undocumented). Got:
> java.nio.file.FileSystemException: /mnt/ssd/jenkins/workspace/Lucene-Solr-
> 4.10-
> Linux/lucene/build/core/test/J0/lucene.codecs.lucene410.TestLucene410Do
> cValuesFormat-50D540524CD2431C-001/dvduel-005: Is a directory
> 
> Stack Trace:
> java.lang.AssertionError: On Linux and MacOSX fsyncing a directory should
> not throw IOException, we just don't want to rely on that in production
> (undocumented). Got: java.nio.file.FileSystemException:
> /mnt/ssd/jenkins/workspace/Lucene-Solr-4.10-
> Linux/lucene/build/core/test/J0/lucene.codecs.lucene410.TestLucene410Do
> cValuesFormat-50D540524CD2431C-001/dvduel-005: Is a directory
> 	at
> __randomizedtesting.SeedInfo.seed([50D540524CD2431C:BC5033C283DBE1A
> B]:0)
> 	at org.apache.lucene.util.IOUtils.fsync(IOUtils.java:339)
> 	at org.apache.lucene.store.FSDirectory.sync(FSDirectory.java:311)
> 	at
> org.apache.lucene.store.MockDirectoryWrapper.sync(MockDirectoryWrapp
> er.java:233)
> 	at
> org.apache.lucene.index.SegmentInfos.finishCommit(SegmentInfos.java:10
> 98)
> 	at
> org.apache.lucene.index.IndexWriter.finishCommit(IndexWriter.java:3143)
> 	at
> org.apache.lucene.index.IndexWriter.commitInternal(IndexWriter.java:3124
> )
> 	at
> org.apache.lucene.index.IndexWriter.commit(IndexWriter.java:3084)
> 	at
> org.apache.lucene.index.RandomIndexWriter.commit(RandomIndexWriter.j
> ava:260)
> 	at
> org.apache.lucene.index.BaseDocValuesFormatTestCase.doTestSortedVsSto
> redFields(BaseDocValuesFormatTestCase.java:1517)
> 	at
> org.apache.lucene.index.BaseDocValuesFormatTestCase.testSortedFixedLe
> ngthVsStoredFields(BaseDocValuesFormatTestCase.java:1608)
> 	at sun.reflect.NativeMethodAccessorImpl.invoke0(Native Method)
> 	at
> sun.reflect.NativeMethodAccessorImpl.invoke(NativeMethodAccessorImpl.j
> ava:62)
> 	at
> sun.reflect.DelegatingMethodAccessorImpl.invoke(DelegatingMethodAcces
> sorImpl.java:43)
> 	at java.lang.reflect.Method.invoke(Method.java:498)
> 	at
> com.carrotsearch.randomizedtesting.RandomizedRunner.invoke(Randomize
> dRunner.java:1618)
> 	at
> com.carrotsearch.randomizedtesting.RandomizedRunner$6.evaluate(Rando
> mizedRunner.java:827)
> 	at
> com.carrotsearch.randomizedtesting.RandomizedRunner$7.evaluate(Rando
> mizedRunner.java:863)
> 	at
> com.carrotsearch.randomizedtesting.RandomizedRunner$8.evaluate(Rando
> mizedRunner.java:877)
> 	at
> org.apache.lucene.util.TestRuleSetupTeardownChained$1.evaluate(TestRule
> SetupTeardownChained.java:50)
> 	at
> org.apache.lucene.util.TestRuleFieldCacheSanity$1.evaluate(TestRuleFieldCa
> cheSanity.java:51)
> 	at
> org.apache.lucene.util.AbstractBeforeAfterRule$1.evaluate(AbstractBeforeA
> fterRule.java:46)
> 	at
> com.carrotsearch.randomizedtesting.rules.SystemPropertiesInvariantRule$1
> .evaluate(SystemPropertiesInvariantRule.java:55)
> 	at
> org.apache.lucene.util.TestRuleThreadAndTestName$1.evaluate(TestRuleTh
> readAndTestName.java:49)
> 	at
> org.apache.lucene.util.TestRuleIgnoreAfterMaxFailures$1.evaluate(TestRule
> IgnoreAfterMaxFailures.java:65)
> 	at
> org.apache.lucene.util.TestRuleMarkFailure$1.evaluate(TestRuleMarkFailure
> .java:48)
> 	at
> com.carrotsearch.randomizedtesting.rules.StatementAdapter.evaluate(Stat
> ementAdapter.java:36)
> 	at
> com.carrotsearch.randomizedtesting.ThreadLeakControl$StatementRunner.
> run(ThreadLeakControl.java:365)
> 	at
> com.carrotsearch.randomizedtesting.ThreadLeakControl.forkTimeoutingTask
> (ThreadLeakControl.java:798)
> 	at
> com.carrotsearch.randomizedtesting.ThreadLeakControl$3.evaluate(ThreadL
> eakControl.java:458)
> 	at
> com.carrotsearch.randomizedtesting.RandomizedRunner.runSingleTest(Ran
> domizedRunner.java:836)
> 	at
> com.carrotsearch.randomizedtesting.RandomizedRunner$3.evaluate(Rando
> mizedRunner.java:738)
> 	at
> com.carrotsearch.randomizedtesting.RandomizedRunner$4.evaluate(Rando
> mizedRunner.java:772)
> 	at
> com.carrotsearch.randomizedtesting.RandomizedRunner$5.evaluate(Rando
> mizedRunner.java:783)
> 	at
> org.apache.lucene.util.AbstractBeforeAfterRule$1.evaluate(AbstractBeforeA
> fterRule.java:46)
> 	at
> org.apache.lucene.util.TestRuleStoreClassName$1.evaluate(TestRuleStoreCl
> assName.java:42)
> 	at
> com.carrotsearch.randomizedtesting.rules.SystemPropertiesInvariantRule$1
> .evaluate(SystemPropertiesInvariantRule.java:55)
> 	at
> com.carrotsearch.randomizedtesting.rules.NoShadowingOrOverridesOnMet
> hodsRule$1.evaluate(NoShadowingOrOverridesOnMethodsRule.java:39)
> 	at
> com.carrotsearch.randomizedtesting.rules.NoShadowingOrOverridesOnMet
> hodsRule$1.evaluate(NoShadowingOrOverridesOnMethodsRule.java:39)
> 	at
> com.carrotsearch.randomizedtesting.rules.StatementAdapter.evaluate(Stat
> ementAdapter.java:36)
> 	at
> com.carrotsearch.randomizedtesting.rules.StatementAdapter.evaluate(Stat
> ementAdapter.java:36)
> 	at
> com.carrotsearch.randomizedtesting.rules.StatementAdapter.evaluate(Stat
> ementAdapter.java:36)
> 	at
> org.apache.lucene.util.TestRuleAssertionsRequired$1.evaluate(TestRuleAss
> ertionsRequired.java:43)
> 	at
> org.apache.lucene.util.TestRuleMarkFailure$1.evaluate(TestRuleMarkFailure
> .java:48)
> 	at
> org.apache.lucene.util.TestRuleIgnoreAfterMaxFailures$1.evaluate(TestRule
> IgnoreAfterMaxFailures.java:65)
> 	at
> org.apache.lucene.util.TestRuleIgnoreTestSuites$1.evaluate(TestRuleIgnore
> TestSuites.java:55)
> 	at
> com.carrotsearch.randomizedtesting.rules.StatementAdapter.evaluate(Stat
> ementAdapter.java:36)
> 	at
> com.carrotsearch.randomizedtesting.ThreadLeakControl$StatementRunner.
> run(ThreadLeakControl.java:365)
> 	at java.lang.Thread.run(Thread.java:745)
> 
> 
> FAILED:
> org.apache.lucene.codecs.lucene410.TestLucene410DocValuesFormat.testZ
> eroOrMin
> 
> Error Message:
> On Linux and MacOSX fsyncing a directory should not throw IOException, we
> just don't want to rely on that in production (undocumented). Got:
> java.nio.file.FileSystemException: /mnt/ssd/jenkins/workspace/Lucene-Solr-
> 4.10-
> Linux/lucene/build/core/test/J0/lucene.codecs.lucene410.TestLucene410Do
> cValuesFormat-50D540524CD2431C-001/index-NIOFSDirectory-002: Is a
> directory
> 
> Stack Trace:
> java.lang.AssertionError: On Linux and MacOSX fsyncing a directory should
> not throw IOException, we just don't want to rely on that in production
> (undocumented). Got: java.nio.file.FileSystemException:
> /mnt/ssd/jenkins/workspace/Lucene-Solr-4.10-
> Linux/lucene/build/core/test/J0/lucene.codecs.lucene410.TestLucene410Do
> cValuesFormat-50D540524CD2431C-001/index-NIOFSDirectory-002: Is a
> directory
> 	at
> __randomizedtesting.SeedInfo.seed([50D540524CD2431C:500430E030D6E10
> 3]:0)
> 	at org.apache.lucene.util.IOUtils.fsync(IOUtils.java:339)
> 	at org.apache.lucene.store.FSDirectory.sync(FSDirectory.java:311)
> 	at
> org.apache.lucene.store.MockDirectoryWrapper.sync(MockDirectoryWrapp
> er.java:233)
> 	at
> org.apache.lucene.index.SegmentInfos.finishCommit(SegmentInfos.java:10
> 98)
> 	at
> org.apache.lucene.index.IndexWriter.finishCommit(IndexWriter.java:3143)
> 	at
> org.apache.lucene.index.IndexWriter.commitInternal(IndexWriter.java:3124
> )
> 	at
> org.apache.lucene.index.IndexWriter.commit(IndexWriter.java:3084)
> 	at
> org.apache.lucene.index.RandomIndexWriter.commit(RandomIndexWriter.j
> ava:260)
> 	at
> org.apache.lucene.index.BaseDocValuesFormatTestCase.doTestNumericsVs
> StoredFields(BaseDocValuesFormatTestCase.java:1182)
> 	at
> org.apache.lucene.index.BaseDocValuesFormatTestCase.testZeroOrMin(Bas
> eDocValuesFormatTestCase.java:2490)
> 	at sun.reflect.NativeMethodAccessorImpl.invoke0(Native Method)
> 	at
> sun.reflect.NativeMethodAccessorImpl.invoke(NativeMethodAccessorImpl.j
> ava:62)
> 	at
> sun.reflect.DelegatingMethodAccessorImpl.invoke(DelegatingMethodAcces
> sorImpl.java:43)
> 	at java.lang.reflect.Method.invoke(Method.java:498)
> 	at
> com.carrotsearch.randomizedtesting.RandomizedRunner.invoke(Randomize
> dRunner.java:1618)
> 	at
> com.carrotsearch.randomizedtesting.RandomizedRunner$6.evaluate(Rando
> mizedRunner.java:827)
> 	at
> com.carrotsearch.randomizedtesting.RandomizedRunner$7.evaluate(Rando
> mizedRunner.java:863)
> 	at
> com.carrotsearch.randomizedtesting.RandomizedRunner$8.evaluate(Rando
> mizedRunner.java:877)
> 	at
> org.apache.lucene.util.TestRuleSetupTeardownChained$1.evaluate(TestRule
> SetupTeardownChained.java:50)
> 	at
> org.apache.lucene.util.TestRuleFieldCacheSanity$1.evaluate(TestRuleFieldCa
> cheSanity.java:51)
> 	at
> org.apache.lucene.util.AbstractBeforeAfterRule$1.evaluate(AbstractBeforeA
> fterRule.java:46)
> 	at
> com.carrotsearch.randomizedtesting.rules.SystemPropertiesInvariantRule$1
> .evaluate(SystemPropertiesInvariantRule.java:55)
> 	at
> org.apache.lucene.util.TestRuleThreadAndTestName$1.evaluate(TestRuleTh
> readAndTestName.java:49)
> 	at
> org.apache.lucene.util.TestRuleIgnoreAfterMaxFailures$1.evaluate(TestRule
> IgnoreAfterMaxFailures.java:65)
> 	at
> org.apache.lucene.util.TestRuleMarkFailure$1.evaluate(TestRuleMarkFailure
> .java:48)
> 	at
> com.carrotsearch.randomizedtesting.rules.StatementAdapter.evaluate(Stat
> ementAdapter.java:36)
> 	at
> com.carrotsearch.randomizedtesting.ThreadLeakControl$StatementRunner.
> run(ThreadLeakControl.java:365)
> 	at
> com.carrotsearch.randomizedtesting.ThreadLeakControl.forkTimeoutingTask
> (ThreadLeakControl.java:798)
> 	at
> com.carrotsearch.randomizedtesting.ThreadLeakControl$3.evaluate(ThreadL
> eakControl.java:458)
> 	at
> com.carrotsearch.randomizedtesting.RandomizedRunner.runSingleTest(Ran
> domizedRunner.java:836)
> 	at
> com.carrotsearch.randomizedtesting.RandomizedRunner$3.evaluate(Rando
> mizedRunner.java:738)
> 	at
> com.carrotsearch.randomizedtesting.RandomizedRunner$4.evaluate(Rando
> mizedRunner.java:772)
> 	at
> com.carrotsearch.randomizedtesting.RandomizedRunner$5.evaluate(Rando
> mizedRunner.java:783)
> 	at
> org.apache.lucene.util.AbstractBeforeAfterRule$1.evaluate(AbstractBeforeA
> fterRule.java:46)
> 	at
> org.apache.lucene.util.TestRuleStoreClassName$1.evaluate(TestRuleStoreCl
> assName.java:42)
> 	at
> com.carrotsearch.randomizedtesting.rules.SystemPropertiesInvariantRule$1
> .evaluate(SystemPropertiesInvariantRule.java:55)
> 	at
> com.carrotsearch.randomizedtesting.rules.NoShadowingOrOverridesOnMet
> hodsRule$1.evaluate(NoShadowingOrOverridesOnMethodsRule.java:39)
> 	at
> com.carrotsearch.randomizedtesting.rules.NoShadowingOrOverridesOnMet
> hodsRule$1.evaluate(NoShadowingOrOverridesOnMethodsRule.java:39)
> 	at
> com.carrotsearch.randomizedtesting.rules.StatementAdapter.evaluate(Stat
> ementAdapter.java:36)
> 	at
> com.carrotsearch.randomizedtesting.rules.StatementAdapter.evaluate(Stat
> ementAdapter.java:36)
> 	at
> com.carrotsearch.randomizedtesting.rules.StatementAdapter.evaluate(Stat
> ementAdapter.java:36)
> 	at
> org.apache.lucene.util.TestRuleAssertionsRequired$1.evaluate(TestRuleAss
> ertionsRequired.java:43)
> 	at
> org.apache.lucene.util.TestRuleMarkFailure$1.evaluate(TestRuleMarkFailure
> .java:48)
> 	at
> org.apache.lucene.util.TestRuleIgnoreAfterMaxFailures$1.evaluate(TestRule
> IgnoreAfterMaxFailures.java:65)
> 	at
> org.apache.lucene.util.TestRuleIgnoreTestSuites$1.evaluate(TestRuleIgnore
> TestSuites.java:55)
> 	at
> com.carrotsearch.randomizedtesting.rules.StatementAdapter.evaluate(Stat
> ementAdapter.java:36)
> 	at
> com.carrotsearch.randomizedtesting.ThreadLeakControl$StatementRunner.
> run(ThreadLeakControl.java:365)
> 	at java.lang.Thread.run(Thread.java:745)
> 
> 
> FAILED:
> org.apache.lucene.codecs.lucene410.TestLucene410DocValuesFormat.testT
> ermsEnumFixedWidth
> 
> Error Message:
> On Linux and MacOSX fsyncing a directory should not throw IOException, we
> just don't want to rely on that in production (undocumented). Got:
> java.nio.file.FileSystemException: /mnt/ssd/jenkins/workspace/Lucene-Solr-
> 4.10-
> Linux/lucene/build/core/test/J0/lucene.codecs.lucene410.TestLucene410Do
> cValuesFormat-50D540524CD2431C-001/tempDir-001: Is a directory
> 
> Stack Trace:
> java.lang.AssertionError: On Linux and MacOSX fsyncing a directory should
> not throw IOException, we just don't want to rely on that in production
> (undocumented). Got: java.nio.file.FileSystemException:
> /mnt/ssd/jenkins/workspace/Lucene-Solr-4.10-
> Linux/lucene/build/core/test/J0/lucene.codecs.lucene410.TestLucene410Do
> cValuesFormat-50D540524CD2431C-001/tempDir-001: Is a directory
> 	at
> __randomizedtesting.SeedInfo.seed([50D540524CD2431C:ADD5FB8916CBC6
> 50]:0)
> 	at org.apache.lucene.util.IOUtils.fsync(IOUtils.java:339)
> 	at org.apache.lucene.store.FSDirectory.sync(FSDirectory.java:311)
> 	at
> org.apache.lucene.store.MockDirectoryWrapper.sync(MockDirectoryWrapp
> er.java:233)
> 	at
> org.apache.lucene.index.SegmentInfos.finishCommit(SegmentInfos.java:10
> 98)
> 	at
> org.apache.lucene.index.IndexWriter.finishCommit(IndexWriter.java:3143)
> 	at
> org.apache.lucene.index.IndexWriter.commitInternal(IndexWriter.java:3124
> )
> 	at
> org.apache.lucene.index.IndexWriter.commit(IndexWriter.java:3084)
> 	at
> org.apache.lucene.index.RandomIndexWriter.commit(RandomIndexWriter.j
> ava:260)
> 	at
> org.apache.lucene.codecs.lucene410.TestLucene410DocValuesFormat.doTes
> tTermsEnumRandom(TestLucene410DocValuesFormat.java:181)
> 	at
> org.apache.lucene.codecs.lucene410.TestLucene410DocValuesFormat.testT
> ermsEnumFixedWidth(TestLucene410DocValuesFormat.java:98)
> 	at sun.reflect.NativeMethodAccessorImpl.invoke0(Native Method)
> 	at
> sun.reflect.NativeMethodAccessorImpl.invoke(NativeMethodAccessorImpl.j
> ava:62)
> 	at
> sun.reflect.DelegatingMethodAccessorImpl.invoke(DelegatingMethodAcces
> sorImpl.java:43)
> 	at java.lang.reflect.Method.invoke(Method.java:498)
> 	at
> com.carrotsearch.randomizedtesting.RandomizedRunner.invoke(Randomize
> dRunner.java:1618)
> 	at
> com.carrotsearch.randomizedtesting.RandomizedRunner$6.evaluate(Rando
> mizedRunner.java:827)
> 	at
> com.carrotsearch.randomizedtesting.RandomizedRunner$7.evaluate(Rando
> mizedRunner.java:863)
> 	at
> com.carrotsearch.randomizedtesting.RandomizedRunner$8.evaluate(Rando
> mizedRunner.java:877)
> 	at
> org.apache.lucene.util.TestRuleSetupTeardownChained$1.evaluate(TestRule
> SetupTeardownChained.java:50)
> 	at
> org.apache.lucene.util.TestRuleFieldCacheSanity$1.evaluate(TestRuleFieldCa
> cheSanity.java:51)
> 	at
> org.apache.lucene.util.AbstractBeforeAfterRule$1.evaluate(AbstractBeforeA
> fterRule.java:46)
> 	at
> com.carrotsearch.randomizedtesting.rules.SystemPropertiesInvariantRule$1
> .evaluate(SystemPropertiesInvariantRule.java:55)
> 	at
> org.apache.lucene.util.TestRuleThreadAndTestName$1.evaluate(TestRuleTh
> readAndTestName.java:49)
> 	at
> org.apache.lucene.util.TestRuleIgnoreAfterMaxFailures$1.evaluate(TestRule
> IgnoreAfterMaxFailures.java:65)
> 	at
> org.apache.lucene.util.TestRuleMarkFailure$1.evaluate(TestRuleMarkFailure
> .java:48)
> 	at
> com.carrotsearch.randomizedtesting.rules.StatementAdapter.evaluate(Stat
> ementAdapter.java:36)
> 	at
> com.carrotsearch.randomizedtesting.ThreadLeakControl$StatementRunner.
> run(ThreadLeakControl.java:365)
> 	at
> com.carrotsearch.randomizedtesting.ThreadLeakControl.forkTimeoutingTask
> (ThreadLeakControl.java:798)
> 	at
> com.carrotsearch.randomizedtesting.ThreadLeakControl$3.evaluate(ThreadL
> eakControl.java:458)
> 	at
> com.carrotsearch.randomizedtesting.RandomizedRunner.runSingleTest(Ran
> domizedRunner.java:836)
> 	at
> com.carrotsearch.randomizedtesting.RandomizedRunner$3.evaluate(Rando
> mizedRunner.java:738)
> 	at
> com.carrotsearch.randomizedtesting.RandomizedRunner$4.evaluate(Rando
> mizedRunner.java:772)
> 	at
> com.carrotsearch.randomizedtesting.RandomizedRunner$5.evaluate(Rando
> mizedRunner.java:783)
> 	at
> org.apache.lucene.util.AbstractBeforeAfterRule$1.evaluate(AbstractBeforeA
> fterRule.java:46)
> 	at
> org.apache.lucene.util.TestRuleStoreClassName$1.evaluate(TestRuleStoreCl
> assName.java:42)
> 	at
> com.carrotsearch.randomizedtesting.rules.SystemPropertiesInvariantRule$1
> .evaluate(SystemPropertiesInvariantRule.java:55)
> 	at
> com.carrotsearch.randomizedtesting.rules.NoShadowingOrOverridesOnMet
> hodsRule$1.evaluate(NoShadowingOrOverridesOnMethodsRule.java:39)
> 	at
> com.carrotsearch.randomizedtesting.rules.NoShadowingOrOverridesOnMet
> hodsRule$1.evaluate(NoShadowingOrOverridesOnMethodsRule.java:39)
> 	at
> com.carrotsearch.randomizedtesting.rules.StatementAdapter.evaluate(Stat
> ementAdapter.java:36)
> 	at
> com.carrotsearch.randomizedtesting.rules.StatementAdapter.evaluate(Stat
> ementAdapter.java:36)
> 	at
> com.carrotsearch.randomizedtesting.rules.StatementAdapter.evaluate(Stat
> ementAdapter.java:36)
> 	at
> org.apache.lucene.util.TestRuleAssertionsRequired$1.evaluate(TestRuleAss
> ertionsRequired.java:43)
> 	at
> org.apache.lucene.util.TestRuleMarkFailure$1.evaluate(TestRuleMarkFailure
> .java:48)
> 	at
> org.apache.lucene.util.TestRuleIgnoreAfterMaxFailures$1.evaluate(TestRule
> IgnoreAfterMaxFailures.java:65)
> 	at
> org.apache.lucene.util.TestRuleIgnoreTestSuites$1.evaluate(TestRuleIgnore
> TestSuites.java:55)
> 	at
> com.carrotsearch.randomizedtesting.rules.StatementAdapter.evaluate(Stat
> ementAdapter.java:36)
> 	at
> com.carrotsearch.randomizedtesting.ThreadLeakControl$StatementRunner.
> run(ThreadLeakControl.java:365)
> 	at java.lang.Thread.run(Thread.java:745)
> 
> 
> FAILED:
> org.apache.lucene.codecs.lucene410.TestLucene410DocValuesFormat.testS
> ortedSetVariableLengthBigVsStoredFields
> 
> Error Message:
> On Linux and MacOSX fsyncing a directory should not throw IOException, we
> just don't want to rely on that in production (undocumented). Got:
> java.nio.file.FileSystemException: /mnt/ssd/jenkins/workspace/Lucene-Solr-
> 4.10-
> Linux/lucene/build/core/test/J0/lucene.codecs.lucene410.TestLucene410Do
> cValuesFormat-50D540524CD2431C-001/dvduel-006: Is a directory
> 
> Stack Trace:
> java.lang.AssertionError: On Linux and MacOSX fsyncing a directory should
> not throw IOException, we just don't want to rely on that in production
> (undocumented). Got: java.nio.file.FileSystemException:
> /mnt/ssd/jenkins/workspace/Lucene-Solr-4.10-
> Linux/lucene/build/core/test/J0/lucene.codecs.lucene410.TestLucene410Do
> cValuesFormat-50D540524CD2431C-001/dvduel-006: Is a directory
> 	at
> __randomizedtesting.SeedInfo.seed([50D540524CD2431C:35CDC8EEDFA1205
> 7]:0)
> 	at org.apache.lucene.util.IOUtils.fsync(IOUtils.java:339)
> 	at org.apache.lucene.store.FSDirectory.sync(FSDirectory.java:311)
> 	at
> org.apache.lucene.store.MockDirectoryWrapper.sync(MockDirectoryWrapp
> er.java:233)
> 	at
> org.apache.lucene.index.IndexWriter.startCommit(IndexWriter.java:4561)
> 	at
> org.apache.lucene.index.IndexWriter.prepareCommitInternal(IndexWriter.j
> ava:3014)
> 	at
> org.apache.lucene.index.IndexWriter.commitInternal(IndexWriter.java:3117
> )
> 	at
> org.apache.lucene.index.IndexWriter.commit(IndexWriter.java:3084)
> 	at
> org.apache.lucene.index.RandomIndexWriter.commit(RandomIndexWriter.j
> ava:260)
> 	at
> org.apache.lucene.index.BaseDocValuesFormatTestCase.doTestSortedSetVs
> StoredFields(BaseDocValuesFormatTestCase.java:2109)
> 	at
> org.apache.lucene.codecs.lucene410.TestLucene410DocValuesFormat.testS
> ortedSetVariableLengthBigVsStoredFields(TestLucene410DocValuesFormat.j
> ava:68)
> 	at sun.reflect.NativeMethodAccessorImpl.invoke0(Native Method)
> 	at
> sun.reflect.NativeMethodAccessorImpl.invoke(NativeMethodAccessorImpl.j
> ava:62)
> 	at
> sun.reflect.DelegatingMethodAccessorImpl.invoke(DelegatingMethodAcces
> sorImpl.java:43)
> 	at java.lang.reflect.Method.invoke(Method.java:498)
> 	at
> com.carrotsearch.randomizedtesting.RandomizedRunner.invoke(Randomize
> dRunner.java:1618)
> 	at
> com.carrotsearch.randomizedtesting.RandomizedRunner$6.evaluate(Rando
> mizedRunner.java:827)
> 	at
> com.carrotsearch.randomizedtesting.RandomizedRunner$7.evaluate(Rando
> mizedRunner.java:863)
> 	at
> com.carrotsearch.randomizedtesting.RandomizedRunner$8.evaluate(Rando
> mizedRunner.java:877)
> 	at
> org.apache.lucene.util.TestRuleSetupTeardownChained$1.evaluate(TestRule
> SetupTeardownChained.java:50)
> 	at
> org.apache.lucene.util.TestRuleFieldCacheSanity$1.evaluate(TestRuleFieldCa
> cheSanity.java:51)
> 	at
> org.apache.lucene.util.AbstractBeforeAfterRule$1.evaluate(AbstractBeforeA
> fterRule.java:46)
> 	at
> com.carrotsearch.randomizedtesting.rules.SystemPropertiesInvariantRule$1
> .evaluate(SystemPropertiesInvariantRule.java:55)
> 	at
> org.apache.lucene.util.TestRuleThreadAndTestName$1.evaluate(TestRuleTh
> readAndTestName.java:49)
> 	at
> org.apache.lucene.util.TestRuleIgnoreAfterMaxFailures$1.evaluate(TestRule
> IgnoreAfterMaxFailures.java:65)
> 	at
> org.apache.lucene.util.TestRuleMarkFailure$1.evaluate(TestRuleMarkFailure
> .java:48)
> 	at
> com.carrotsearch.randomizedtesting.rules.StatementAdapter.evaluate(Stat
> ementAdapter.java:36)
> 	at
> com.carrotsearch.randomizedtesting.ThreadLeakControl$StatementRunner.
> run(ThreadLeakControl.java:365)
> 	at
> com.carrotsearch.randomizedtesting.ThreadLeakControl.forkTimeoutingTask
> (ThreadLeakControl.java:798)
> 	at
> com.carrotsearch.randomizedtesting.ThreadLeakControl$3.evaluate(ThreadL
> eakControl.java:458)
> 	at
> com.carrotsearch.randomizedtesting.RandomizedRunner.runSingleTest(Ran
> domizedRunner.java:836)
> 	at
> com.carrotsearch.randomizedtesting.RandomizedRunner$3.evaluate(Rando
> mizedRunner.java:738)
> 	at
> com.carrotsearch.randomizedtesting.RandomizedRunner$4.evaluate(Rando
> mizedRunner.java:772)
> 	at
> com.carrotsearch.randomizedtesting.RandomizedRunner$5.evaluate(Rando
> mizedRunner.java:783)
> 	at
> org.apache.lucene.util.AbstractBeforeAfterRule$1.evaluate(AbstractBeforeA
> fterRule.java:46)
> 	at
> org.apache.lucene.util.TestRuleStoreClassName$1.evaluate(TestRuleStoreCl
> assName.java:42)
> 	at
> com.carrotsearch.randomizedtesting.rules.SystemPropertiesInvariantRule$1
> .evaluate(SystemPropertiesInvariantRule.java:55)
> 	at
> com.carrotsearch.randomizedtesting.rules.NoShadowingOrOverridesOnMet
> hodsRule$1.evaluate(NoShadowingOrOverridesOnMethodsRule.java:39)
> 	at
> com.carrotsearch.randomizedtesting.rules.NoShadowingOrOverridesOnMet
> hodsRule$1.evaluate(NoShadowingOrOverridesOnMethodsRule.java:39)
> 	at
> com.carrotsearch.randomizedtesting.rules.StatementAdapter.evaluate(Stat
> ementAdapter.java:36)
> 	at
> com.carrotsearch.randomizedtesting.rules.StatementAdapter.evaluate(Stat
> ementAdapter.java:36)
> 	at
> com.carrotsearch.randomizedtesting.rules.StatementAdapter.evaluate(Stat
> ementAdapter.java:36)
> 	at
> org.apache.lucene.util.TestRuleAssertionsRequired$1.evaluate(TestRuleAss
> ertionsRequired.java:43)
> 	at
> org.apache.lucene.util.TestRuleMarkFailure$1.evaluate(TestRuleMarkFailure
> .java:48)
> 	at
> org.apache.lucene.util.TestRuleIgnoreAfterMaxFailures$1.evaluate(TestRule
> IgnoreAfterMaxFailures.java:65)
> 	at
> org.apache.lucene.util.TestRuleIgnoreTestSuites$1.evaluate(TestRuleIgnore
> TestSuites.java:55)
> 	at
> com.carrotsearch.randomizedtesting.rules.StatementAdapter.evaluate(Stat
> ementAdapter.java:36)
> 	at
> com.carrotsearch.randomizedtesting.ThreadLeakControl$StatementRunner.
> run(ThreadLeakControl.java:365)
> 	at java.lang.Thread.run(Thread.java:745)
> 
> 
> FAILED:
> org.apache.lucene.codecs.lucene410.TestLucene410DocValuesFormat.testS
> ortedSetFixedLengthVsStoredFields
> 
> Error Message:
> On Linux and MacOSX fsyncing a directory should not throw IOException, we
> just don't want to rely on that in production (undocumented). Got:
> java.nio.file.FileSystemException: /mnt/ssd/jenkins/workspace/Lucene-Solr-
> 4.10-
> Linux/lucene/build/core/test/J0/lucene.codecs.lucene410.TestLucene410Do
> cValuesFormat-50D540524CD2431C-001/dvduel-007: Is a directory
> 
> Stack Trace:
> java.lang.AssertionError: On Linux and MacOSX fsyncing a directory should
> not throw IOException, we just don't want to rely on that in production
> (undocumented). Got: java.nio.file.FileSystemException:
> /mnt/ssd/jenkins/workspace/Lucene-Solr-4.10-
> Linux/lucene/build/core/test/J0/lucene.codecs.lucene410.TestLucene410Do
> cValuesFormat-50D540524CD2431C-001/dvduel-007: Is a directory
> 	at
> __randomizedtesting.SeedInfo.seed([50D540524CD2431C:25A6F19E5B2F1B4
> A]:0)
> 	at org.apache.lucene.util.IOUtils.fsync(IOUtils.java:339)
> 	at org.apache.lucene.store.FSDirectory.sync(FSDirectory.java:311)
> 	at
> org.apache.lucene.store.MockDirectoryWrapper.sync(MockDirectoryWrapp
> er.java:233)
> 	at
> org.apache.lucene.index.SegmentInfos.finishCommit(SegmentInfos.java:10
> 98)
> 	at
> org.apache.lucene.index.IndexWriter.finishCommit(IndexWriter.java:3143)
> 	at
> org.apache.lucene.index.IndexWriter.commitInternal(IndexWriter.java:3124
> )
> 	at
> org.apache.lucene.index.IndexWriter.commit(IndexWriter.java:3084)
> 	at
> org.apache.lucene.index.RandomIndexWriter.commit(RandomIndexWriter.j
> ava:260)
> 	at
> org.apache.lucene.index.BaseDocValuesFormatTestCase.doTestSortedSetVs
> StoredFields(BaseDocValuesFormatTestCase.java:2109)
> 	at
> org.apache.lucene.index.BaseDocValuesFormatTestCase.testSortedSetFixed
> LengthVsStoredFields(BaseDocValuesFormatTestCase.java:2173)
> 	at sun.reflect.NativeMethodAccessorImpl.invoke0(Native Method)
> 	at
> sun.reflect.NativeMethodAccessorImpl.invoke(NativeMethodAccessorImpl.j
> ava:62)
> 	at
> sun.reflect.DelegatingMethodAccessorImpl.invoke(DelegatingMethodAcces
> sorImpl.java:43)
> 	at java.lang.reflect.Method.invoke(Method.java:498)
> 	at
> com.carrotsearch.randomizedtesting.RandomizedRunner.invoke(Randomize
> dRunner.java:1618)
> 	at
> com.carrotsearch.randomizedtesting.RandomizedRunner$6.evaluate(Rando
> mizedRunner.java:827)
> 	at
> com.carrotsearch.randomizedtesting.RandomizedRunner$7.evaluate(Rando
> mizedRunner.java:863)
> 	at
> com.carrotsearch.randomizedtesting.RandomizedRunner$8.evaluate(Rando
> mizedRunner.java:877)
> 	at
> org.apache.lucene.util.TestRuleSetupTeardownChained$1.evaluate(TestRule
> SetupTeardownChained.java:50)
> 	at
> org.apache.lucene.util.TestRuleFieldCacheSanity$1.evaluate(TestRuleFieldCa
> cheSanity.java:51)
> 	at
> org.apache.lucene.util.AbstractBeforeAfterRule$1.evaluate(AbstractBeforeA
> fterRule.java:46)
> 	at
> com.carrotsearch.randomizedtesting.rules.SystemPropertiesInvariantRule$1
> .evaluate(SystemPropertiesInvariantRule.java:55)
> 	at
> org.apache.lucene.util.TestRuleThreadAndTestName$1.evaluate(TestRuleTh
> readAndTestName.java:49)
> 	at
> org.apache.lucene.util.TestRuleIgnoreAfterMaxFailures$1.evaluate(TestRule
> IgnoreAfterMaxFailures.java:65)
> 	at
> org.apache.lucene.util.TestRuleMarkFailure$1.evaluate(TestRuleMarkFailure
> .java:48)
> 	at
> com.carrotsearch.randomizedtesting.rules.StatementAdapter.evaluate(Stat
> ementAdapter.java:36)
> 	at
> com.carrotsearch.randomizedtesting.ThreadLeakControl$StatementRunner.
> run(ThreadLeakControl.java:365)
> 	at
> com.carrotsearch.randomizedtesting.ThreadLeakControl.forkTimeoutingTask
> (ThreadLeakControl.java:798)
> 	at
> com.carrotsearch.randomizedtesting.ThreadLeakControl$3.evaluate(ThreadL
> eakControl.java:458)
> 	at
> com.carrotsearch.randomizedtesting.RandomizedRunner.runSingleTest(Ran
> domizedRunner.java:836)
> 	at
> com.carrotsearch.randomizedtesting.RandomizedRunner$3.evaluate(Rando
> mizedRunner.java:738)
> 	at
> com.carrotsearch.randomizedtesting.RandomizedRunner$4.evaluate(Rando
> mizedRunner.java:772)
> 	at
> com.carrotsearch.randomizedtesting.RandomizedRunner$5.evaluate(Rando
> mizedRunner.java:783)
> 	at
> org.apache.lucene.util.AbstractBeforeAfterRule$1.evaluate(AbstractBeforeA
> fterRule.java:46)
> 	at
> org.apache.lucene.util.TestRuleStoreClassName$1.evaluate(TestRuleStoreCl
> assName.java:42)
> 	at
> com.carrotsearch.randomizedtesting.rules.SystemPropertiesInvariantRule$1
> .evaluate(SystemPropertiesInvariantRule.java:55)
> 	at
> com.carrotsearch.randomizedtesting.rules.NoShadowingOrOverridesOnMet
> hodsRule$1.evaluate(NoShadowingOrOverridesOnMethodsRule.java:39)
> 	at
> com.carrotsearch.randomizedtesting.rules.NoShadowingOrOverridesOnMet
> hodsRule$1.evaluate(NoShadowingOrOverridesOnMethodsRule.java:39)
> 	at
> com.carrotsearch.randomizedtesting.rules.StatementAdapter.evaluate(Stat
> ementAdapter.java:36)
> 	at
> com.carrotsearch.randomizedtesting.rules.StatementAdapter.evaluate(Stat
> ementAdapter.java:36)
> 	at
> com.carrotsearch.randomizedtesting.rules.StatementAdapter.evaluate(Stat
> ementAdapter.java:36)
> 	at
> org.apache.lucene.util.TestRuleAssertionsRequired$1.evaluate(TestRuleAss
> ertionsRequired.java:43)
> 	at
> org.apache.lucene.util.TestRuleMarkFailure$1.evaluate(TestRuleMarkFailure
> .java:48)
> 	at
> org.apache.lucene.util.TestRuleIgnoreAfterMaxFailures$1.evaluate(TestRule
> IgnoreAfterMaxFailures.java:65)
> 	at
> org.apache.lucene.util.TestRuleIgnoreTestSuites$1.evaluate(TestRuleIgnore
> TestSuites.java:55)
> 	at
> com.carrotsearch.randomizedtesting.rules.StatementAdapter.evaluate(Stat
> ementAdapter.java:36)
> 	at
> com.carrotsearch.randomizedtesting.ThreadLeakControl$StatementRunner.
> run(ThreadLeakControl.java:365)
> 	at java.lang.Thread.run(Thread.java:745)
> 
> 
> FAILED:
> org.apache.lucene.codecs.lucene410.TestLucene410DocValuesFormat.testT
> ermsEnumVariableWidth
> 
> Error Message:
> On Linux and MacOSX fsyncing a directory should not throw IOException, we
> just don't want to rely on that in production (undocumented). Got:
> java.nio.file.FileSystemException: /mnt/ssd/jenkins/workspace/Lucene-Solr-
> 4.10-
> Linux/lucene/build/core/test/J0/lucene.codecs.lucene410.TestLucene410Do
> cValuesFormat-50D540524CD2431C-001/tempDir-002: Is a directory
> 
> Stack Trace:
> java.lang.AssertionError: On Linux and MacOSX fsyncing a directory should
> not throw IOException, we just don't want to rely on that in production
> (undocumented). Got: java.nio.file.FileSystemException:
> /mnt/ssd/jenkins/workspace/Lucene-Solr-4.10-
> Linux/lucene/build/core/test/J0/lucene.codecs.lucene410.TestLucene410Do
> cValuesFormat-50D540524CD2431C-001/tempDir-002: Is a directory
> 	at
> __randomizedtesting.SeedInfo.seed([50D540524CD2431C:95E954ADF16D7D5
> 7]:0)
> 	at org.apache.lucene.util.IOUtils.fsync(IOUtils.java:339)
> 	at org.apache.lucene.store.FSDirectory.sync(FSDirectory.java:311)
> 	at
> org.apache.lucene.store.MockDirectoryWrapper.sync(MockDirectoryWrapp
> er.java:233)
> 	at
> org.apache.lucene.index.IndexWriter.startCommit(IndexWriter.java:4561)
> 	at
> org.apache.lucene.index.IndexWriter.prepareCommitInternal(IndexWriter.j
> ava:3014)
> 	at
> org.apache.lucene.index.IndexWriter.commitInternal(IndexWriter.java:3117
> )
> 	at
> org.apache.lucene.index.IndexWriter.commit(IndexWriter.java:3084)
> 	at
> org.apache.lucene.index.RandomIndexWriter.commit(RandomIndexWriter.j
> ava:260)
> 	at
> org.apache.lucene.codecs.lucene410.TestLucene410DocValuesFormat.doTes
> tTermsEnumRandom(TestLucene410DocValuesFormat.java:181)
> 	at
> org.apache.lucene.codecs.lucene410.TestLucene410DocValuesFormat.testT
> ermsEnumVariableWidth(TestLucene410DocValuesFormat.java:105)
> 	at sun.reflect.NativeMethodAccessorImpl.invoke0(Native Method)
> 	at
> sun.reflect.NativeMethodAccessorImpl.invoke(NativeMethodAccessorImpl.j
> ava:62)
> 	at
> sun.reflect.DelegatingMethodAccessorImpl.invoke(DelegatingMethodAcces
> sorImpl.java:43)
> 	at java.lang.reflect.Method.invoke(Method.java:498)
> 	at
> com.carrotsearch.randomizedtesting.RandomizedRunner.invoke(Randomize
> dRunner.java:1618)
> 	at
> com.carrotsearch.randomizedtesting.RandomizedRunner$6.evaluate(Rando
> mizedRunner.java:827)
> 	at
> com.carrotsearch.randomizedtesting.RandomizedRunner$7.evaluate(Rando
> mizedRunner.java:863)
> 	at
> com.carrotsearch.randomizedtesting.RandomizedRunner$8.evaluate(Rando
> mizedRunner.java:877)
> 	at
> org.apache.lucene.util.TestRuleSetupTeardownChained$1.evaluate(TestRule
> SetupTeardownChained.java:50)
> 	at
> org.apache.lucene.util.TestRuleFieldCacheSanity$1.evaluate(TestRuleFieldCa
> cheSanity.java:51)
> 	at
> org.apache.lucene.util.AbstractBeforeAfterRule$1.evaluate(AbstractBeforeA
> fterRule.java:46)
> 	at
> com.carrotsearch.randomizedtesting.rules.SystemPropertiesInvariantRule$1
> .evaluate(SystemPropertiesInvariantRule.java:55)
> 	at
> org.apache.lucene.util.TestRuleThreadAndTestName$1.evaluate(TestRuleTh
> readAndTestName.java:49)
> 	at
> org.apache.lucene.util.TestRuleIgnoreAfterMaxFailures$1.evaluate(TestRule
> IgnoreAfterMaxFailures.java:65)
> 	at
> org.apache.lucene.util.TestRuleMarkFailure$1.evaluate(TestRuleMarkFailure
> .java:48)
> 	at
> com.carrotsearch.randomizedtesting.rules.StatementAdapter.evaluate(Stat
> ementAdapter.java:36)
> 	at
> com.carrotsearch.randomizedtesting.ThreadLeakControl$StatementRunner.
> run(ThreadLeakControl.java:365)
> 	at
> com.carrotsearch.randomizedtesting.ThreadLeakControl.forkTimeoutingTask
> (ThreadLeakControl.java:798)
> 	at
> com.carrotsearch.randomizedtesting.ThreadLeakControl$3.evaluate(ThreadL
> eakControl.java:458)
> 	at
> com.carrotsearch.randomizedtesting.RandomizedRunner.runSingleTest(Ran
> domizedRunner.java:836)
> 	at
> com.carrotsearch.randomizedtesting.RandomizedRunner$3.evaluate(Rando
> mizedRunner.java:738)
> 	at
> com.carrotsearch.randomizedtesting.RandomizedRunner$4.evaluate(Rando
> mizedRunner.java:772)
> 	at
> com.carrotsearch.randomizedtesting.RandomizedRunner$5.evaluate(Rando
> mizedRunner.java:783)
> 	at
> org.apache.lucene.util.AbstractBeforeAfterRule$1.evaluate(AbstractBeforeA
> fterRule.java:46)
> 	at
> org.apache.lucene.util.TestRuleStoreClassName$1.evaluate(TestRuleStoreCl
> assName.java:42)
> 	at
> com.carrotsearch.randomizedtesting.rules.SystemPropertiesInvariantRule$1
> .evaluate(SystemPropertiesInvariantRule.java:55)
> 	at
> com.carrotsearch.randomizedtesting.rules.NoShadowingOrOverridesOnMet
> hodsRule$1.evaluate(NoShadowingOrOverridesOnMethodsRule.java:39)
> 	at
> com.carrotsearch.randomizedtesting.rules.NoShadowingOrOverridesOnMet
> hodsRule$1.evaluate(NoShadowingOrOverridesOnMethodsRule.java:39)
> 	at
> com.carrotsearch.randomizedtesting.rules.StatementAdapter.evaluate(Stat
> ementAdapter.java:36)
> 	at
> com.carrotsearch.randomizedtesting.rules.StatementAdapter.evaluate(Stat
> ementAdapter.java:36)
> 	at
> com.carrotsearch.randomizedtesting.rules.StatementAdapter.evaluate(Stat
> ementAdapter.java:36)
> 	at
> org.apache.lucene.util.TestRuleAssertionsRequired$1.evaluate(TestRuleAss
> ertionsRequired.java:43)
> 	at
> org.apache.lucene.util.TestRuleMarkFailure$1.evaluate(TestRuleMarkFailure
> .java:48)
> 	at
> org.apache.lucene.util.TestRuleIgnoreAfterMaxFailures$1.evaluate(TestRule
> IgnoreAfterMaxFailures.java:65)
> 	at
> org.apache.lucene.util.TestRuleIgnoreTestSuites$1.evaluate(TestRuleIgnore
> TestSuites.java:55)
> 	at
> com.carrotsearch.randomizedtesting.rules.StatementAdapter.evaluate(Stat
> ementAdapter.java:36)
> 	at
> com.carrotsearch.randomizedtesting.ThreadLeakControl$StatementRunner.
> run(ThreadLeakControl.java:365)
> 	at java.lang.Thread.run(Thread.java:745)
> 
> 
> FAILED:
> org.apache.lucene.codecs.lucene410.TestLucene410DocValuesFormat.testS
> ortedVariableLengthBigVsStoredFields
> 
> Error Message:
> On Linux and MacOSX fsyncing a directory should not throw IOException, we
> just don't want to rely on that in production (undocumented). Got:
> java.nio.file.FileSystemException: /mnt/ssd/jenkins/workspace/Lucene-Solr-
> 4.10-
> Linux/lucene/build/core/test/J0/lucene.codecs.lucene410.TestLucene410Do
> cValuesFormat-50D540524CD2431C-001/dvduel-010: Is a directory
> 
> Stack Trace:
> java.lang.AssertionError: On Linux and MacOSX fsyncing a directory should
> not throw IOException, we just don't want to rely on that in production
> (undocumented). Got: java.nio.file.FileSystemException:
> /mnt/ssd/jenkins/workspace/Lucene-Solr-4.10-
> Linux/lucene/build/core/test/J0/lucene.codecs.lucene410.TestLucene410Do
> cValuesFormat-50D540524CD2431C-001/dvduel-010: Is a directory
> 	at
> __randomizedtesting.SeedInfo.seed([50D540524CD2431C:A02507377FC9E69
> 3]:0)
> 	at org.apache.lucene.util.IOUtils.fsync(IOUtils.java:339)
> 	at org.apache.lucene.store.FSDirectory.sync(FSDirectory.java:311)
> 	at
> org.apache.lucene.store.MockDirectoryWrapper.sync(MockDirectoryWrapp
> er.java:233)
> 	at
> org.apache.lucene.index.IndexWriter.startCommit(IndexWriter.java:4561)
> 	at
> org.apache.lucene.index.IndexWriter.prepareCommitInternal(IndexWriter.j
> ava:3014)
> 	at
> org.apache.lucene.index.IndexWriter.commitInternal(IndexWriter.java:3117
> )
> 	at
> org.apache.lucene.index.IndexWriter.commit(IndexWriter.java:3084)
> 	at
> org.apache.lucene.index.RandomIndexWriter.commit(RandomIndexWriter.j
> ava:260)
> 	at
> org.apache.lucene.index.BaseDocValuesFormatTestCase.doTestSortedVsSto
> redFields(BaseDocValuesFormatTestCase.java:1517)
> 	at
> org.apache.lucene.codecs.lucene410.TestLucene410DocValuesFormat.testS
> ortedVariableLengthBigVsStoredFields(TestLucene410DocValuesFormat.java
> :83)
> 	at sun.reflect.NativeMethodAccessorImpl.invoke0(Native Method)
> 	at
> sun.reflect.NativeMethodAccessorImpl.invoke(NativeMethodAccessorImpl.j
> ava:62)
> 	at
> sun.reflect.DelegatingMethodAccessorImpl.invoke(DelegatingMethodAcces
> sorImpl.java:43)
> 	at java.lang.reflect.Method.invoke(Method.java:498)
> 	at
> com.carrotsearch.randomizedtesting.RandomizedRunner.invoke(Randomize
> dRunner.java:1618)
> 	at
> com.carrotsearch.randomizedtesting.RandomizedRunner$6.evaluate(Rando
> mizedRunner.java:827)
> 	at
> com.carrotsearch.randomizedtesting.RandomizedRunner$7.evaluate(Rando
> mizedRunner.java:863)
> 	at
> com.carrotsearch.randomizedtesting.RandomizedRunner$8.evaluate(Rando
> mizedRunner.java:877)
> 	at
> org.apache.lucene.util.TestRuleSetupTeardownChained$1.evaluate(TestRule
> SetupTeardownChained.java:50)
> 	at
> org.apache.lucene.util.TestRuleFieldCacheSanity$1.evaluate(TestRuleFieldCa
> cheSanity.java:51)
> 	at
> org.apache.lucene.util.AbstractBeforeAfterRule$1.evaluate(AbstractBeforeA
> fterRule.java:46)
> 	at
> com.carrotsearch.randomizedtesting.rules.SystemPropertiesInvariantRule$1
> .evaluate(SystemPropertiesInvariantRule.java:55)
> 	at
> org.apache.lucene.util.TestRuleThreadAndTestName$1.evaluate(TestRuleTh
> readAndTestName.java:49)
> 	at
> org.apache.lucene.util.TestRuleIgnoreAfterMaxFailures$1.evaluate(TestRule
> IgnoreAfterMaxFailures.java:65)
> 	at
> org.apache.lucene.util.TestRuleMarkFailure$1.evaluate(TestRuleMarkFailure
> .java:48)
> 	at
> com.carrotsearch.randomizedtesting.rules.StatementAdapter.evaluate(Stat
> ementAdapter.java:36)
> 	at
> com.carrotsearch.randomizedtesting.ThreadLeakControl$StatementRunner.
> run(ThreadLeakControl.java:365)
> 	at
> com.carrotsearch.randomizedtesting.ThreadLeakControl.forkTimeoutingTask
> (ThreadLeakControl.java:798)
> 	at
> com.carrotsearch.randomizedtesting.ThreadLeakControl$3.evaluate(ThreadL
> eakControl.java:458)
> 	at
> com.carrotsearch.randomizedtesting.RandomizedRunner.runSingleTest(Ran
> domizedRunner.java:836)
> 	at
> com.carrotsearch.randomizedtesting.RandomizedRunner$3.evaluate(Rando
> mizedRunner.java:738)
> 	at
> com.carrotsearch.randomizedtesting.RandomizedRunner$4.evaluate(Rando
> mizedRunner.java:772)
> 	at
> com.carrotsearch.randomizedtesting.RandomizedRunner$5.evaluate(Rando
> mizedRunner.java:783)
> 	at
> org.apache.lucene.util.AbstractBeforeAfterRule$1.evaluate(AbstractBeforeA
> fterRule.java:46)
> 	at
> org.apache.lucene.util.TestRuleStoreClassName$1.evaluate(TestRuleStoreCl
> assName.java:42)
> 	at
> com.carrotsearch.randomizedtesting.rules.SystemPropertiesInvariantRule$1
> .evaluate(SystemPropertiesInvariantRule.java:55)
> 	at
> com.carrotsearch.randomizedtesting.rules.NoShadowingOrOverridesOnMet
> hodsRule$1.evaluate(NoShadowingOrOverridesOnMethodsRule.java:39)
> 	at
> com.carrotsearch.randomizedtesting.rules.NoShadowingOrOverridesOnMet
> hodsRule$1.evaluate(NoShadowingOrOverridesOnMethodsRule.java:39)
> 	at
> com.carrotsearch.randomizedtesting.rules.StatementAdapter.evaluate(Stat
> ementAdapter.java:36)
> 	at
> com.carrotsearch.randomizedtesting.rules.StatementAdapter.evaluate(Stat
> ementAdapter.java:36)
> 	at
> com.carrotsearch.randomizedtesting.rules.StatementAdapter.evaluate(Stat
> ementAdapter.java:36)
> 	at
> org.apache.lucene.util.TestRuleAssertionsRequired$1.evaluate(TestRuleAss
> ertionsRequired.java:43)
> 	at
> org.apache.lucene.util.TestRuleMarkFailure$1.evaluate(TestRuleMarkFailure
> .java:48)
> 	at
> org.apache.lucene.util.TestRuleIgnoreAfterMaxFailures$1.evaluate(TestRule
> IgnoreAfterMaxFailures.java:65)
> 	at
> org.apache.lucene.util.TestRuleIgnoreTestSuites$1.evaluate(TestRuleIgnore
> TestSuites.java:55)
> 	at
> com.carrotsearch.randomizedtesting.rules.StatementAdapter.evaluate(Stat
> ementAdapter.java:36)
> 	at
> com.carrotsearch.randomizedtesting.ThreadLeakControl$StatementRunner.
> run(ThreadLeakControl.java:365)
> 	at java.lang.Thread.run(Thread.java:745)
> 
> 
> FAILED:
> org.apache.lucene.codecs.lucene42.TestLucene42DocValuesFormat.testSort
> edSetVariableLengthVsStoredFields
> 
> Error Message:
> On Linux and MacOSX fsyncing a directory should not throw IOException, we
> just don't want to rely on that in production (undocumented). Got:
> java.nio.file.FileSystemException: /mnt/ssd/jenkins/workspace/Lucene-Solr-
> 4.10-
> Linux/lucene/build/core/test/J0/lucene.codecs.lucene42.TestLucene42DocV
> aluesFormat-50D540524CD2431C-001/dvduel-001: Is a directory
> 
> Stack Trace:
> java.lang.AssertionError: On Linux and MacOSX fsyncing a directory should
> not throw IOException, we just don't want to rely on that in production
> (undocumented). Got: java.nio.file.FileSystemException:
> /mnt/ssd/jenkins/workspace/Lucene-Solr-4.10-
> Linux/lucene/build/core/test/J0/lucene.codecs.lucene42.TestLucene42DocV
> aluesFormat-50D540524CD2431C-001/dvduel-001: Is a directory
> 	at
> __randomizedtesting.SeedInfo.seed([50D540524CD2431C:74C411AE282E54B
> 1]:0)
> 	at org.apache.lucene.util.IOUtils.fsync(IOUtils.java:339)
> 	at org.apache.lucene.store.FSDirectory.sync(FSDirectory.java:311)
> 	at
> org.apache.lucene.store.MockDirectoryWrapper.sync(MockDirectoryWrapp
> er.java:233)
> 	at
> org.apache.lucene.index.SegmentInfos.finishCommit(SegmentInfos.java:10
> 98)
> 	at
> org.apache.lucene.index.IndexWriter.finishCommit(IndexWriter.java:3143)
> 	at
> org.apache.lucene.index.IndexWriter.commitInternal(IndexWriter.java:3124
> )
> 	at
> org.apache.lucene.index.IndexWriter.commit(IndexWriter.java:3084)
> 	at
> org.apache.lucene.index.RandomIndexWriter.commit(RandomIndexWriter.j
> ava:260)
> 	at
> org.apache.lucene.index.BaseDocValuesFormatTestCase.doTestSortedSetVs
> StoredFields(BaseDocValuesFormatTestCase.java:2109)
> 	at
> org.apache.lucene.index.BaseDocValuesFormatTestCase.testSortedSetVaria
> bleLengthVsStoredFields(BaseDocValuesFormatTestCase.java:2244)
> 	at sun.reflect.NativeMethodAccessorImpl.invoke0(Native Method)
> 	at sun.refle
> 
> [...truncated too long message...]
> 
> alueFilter, TestIndexFileDeleter, TestCompiledAutomaton,
> TestConstantScoreQuery, TestMatchAllDocsQuery, TestPrefixQuery,
> TestParallelTermEnum, TestDocIdSet, TestElevationComparator,
> TestFilteredSearch, TestBinaryTerms, TestConjunctions, Nested, Nested,
> TestField, TestDateSort, TestSpanExplanationsOfNonMatches,
> TestVirtualMethod, TestSetOnce, TestFilterAtomicReader, TestSearch,
> TestFilterIterator, TestCharsRef, Test2BPostings, TestFieldCacheTermsFilter,
> TestTotalHitCountCollector, TestMockDirectoryWrapper, TestIsCurrent,
> TestNoMergeScheduler, TestPhrasePrefixQuery, TestRollback, TestNot,
> TestCloseableThreadLocal, TestCodecHoldsOpenFiles, MultiCollectorTest,
> TestIntsRef, Test2BPositions, TestTopScoreDocCollector,
> TestNewestSegment, Test2BBinaryDocValues,
> TestPackedTokenAttributeImpl, TestLucene40NormsFormat,
> TestLucene49NormsFormat, TestFieldType, TestBackwardsCompatibility3x]
>    [junit4] Completed on J1 in 16.85s, 19 tests, 1 failure <<< FAILURES!
> 
> [...truncated 6 lines...]
>    [junit4] Suite:
> org.apache.lucene.index.TestIndexWriterOutOfFileDescriptors
>    [junit4]   2> NOTE: reproduce with: ant test  -
> Dtestcase=TestIndexWriterOutOfFileDescriptors -Dtests.method=test -
> Dtests.seed=50D540524CD2431C -Dtests.multiplier=3 -Dtests.slow=true -
> Dtests.locale=ar_TN -Dtests.timezone=W-SU -Dtests.file.encoding=ISO-
> 8859-1
>    [junit4] FAILURE 2.60s J1 | TestIndexWriterOutOfFileDescriptors.test <<<
>    [junit4]    > Throwable #1: java.lang.AssertionError: On Linux and MacOSX
> fsyncing a directory should not throw IOException, we just don't want to rely
> on that in production (undocumented). Got:
> java.nio.file.FileSystemException: /mnt/ssd/jenkins/workspace/Lucene-Solr-
> 4.10-
> Linux/lucene/build/core/test/J1/lucene.index.TestIndexWriterOutOfFileDes
> criptors-50D540524CD2431C-001/TestIndexWriterOutOfFileDescriptors-001:
> Is a directory
>    [junit4]    > 	at
> __randomizedtesting.SeedInfo.seed([50D540524CD2431C:D8817F88E22E2EE
> 4]:0)
>    [junit4]    > 	at org.apache.lucene.util.IOUtils.fsync(IOUtils.java:339)
>    [junit4]    > 	at
> org.apache.lucene.store.FSDirectory.sync(FSDirectory.java:311)
>    [junit4]    > 	at
> org.apache.lucene.store.MockDirectoryWrapper.sync(MockDirectoryWrapp
> er.java:233)
>    [junit4]    > 	at
> org.apache.lucene.index.SegmentInfos.finishCommit(SegmentInfos.java:10
> 98)
>    [junit4]    > 	at
> org.apache.lucene.index.IndexWriter.finishCommit(IndexWriter.java:3143)
>    [junit4]    > 	at
> org.apache.lucene.index.IndexWriter.commitInternal(IndexWriter.java:3124
> )
>    [junit4]    > 	at
> org.apache.lucene.index.IndexWriter.shutdown(IndexWriter.java:915)
>    [junit4]    > 	at
> org.apache.lucene.index.IndexWriter.close(IndexWriter.java:986)
>    [junit4]    > 	at
> org.apache.lucene.index.IndexWriter.close(IndexWriter.java:956)
>    [junit4]    > 	at
> org.apache.lucene.index.TestIndexWriterOutOfFileDescriptors.test(TestInde
> xWriterOutOfFileDescriptors.java:87)
>    [junit4]    > 	at java.lang.Thread.run(Thread.java:745)
>    [junit4]   2> NOTE: leaving temporary files on disk at:
> /mnt/ssd/jenkins/workspace/Lucene-Solr-4.10-
> Linux/lucene/build/core/test/J1/./lucene.index.TestIndexWriterOutOfFileD
> escriptors-50D540524CD2431C-001
>    [junit4]   2> NOTE: test params are: codec=Lucene410: {date=FST41,
> docid=PostingsFormat(name=MockSep),
> titleTokenized=Lucene41(blocksize=128), body=FST41,
> title=PostingsFormat(name=SimpleText)},
> docValues:{titleDV=DocValuesFormat(name=Asserting)},
> sim=RandomSimilarityProvider(queryNorm=true,coord=no):
> {titleTokenized=DFR I(ne)2, body=IB LL-L1}, locale=ar_TN, timezone=W-SU
>    [junit4]   2> NOTE: Linux 3.13.0-45-generic amd64/Oracle Corporation 1.9.0-
> ea (64-bit)/cpus=8,threads=1,free=23170280,total=312287232
>    [junit4]   2> NOTE: All tests run in this JVM: [TestPackedInts,
> TestScoreCachingWrappingScorer, TestOpenBitSet, TestExternalCodecs,
> TestMultiDocValues, TestTermRangeFilter, TestSortRandom,
> TestMultiTermConstantScore, TestIndexableBinaryStringTools,
> TestLongBitSet, TestBackwardsCompatibility, TestCharFilter, Before3,
> Before3, TestBooleanQueryVisitSubscorers, TestTermdocPerf,
> TestRamUsageEstimatorOnWildAnimals, TestDirectory,
> TestLevenshteinAutomata, TestSmallFloat, TestBooleanScorer,
> TestLucene40StoredFieldsFormat, Test2BPagedBytes, TestAddIndexes,
> TestFieldInfos, TestAttributeSource, TestAssertions, TestSegmentMerger,
> TestRegexpRandom2, TestBoolean2, TestIndexInput,
> TestSnapshotDeletionPolicy, TestEliasFanoDocIdSet,
> TestReusableStringReader, TestIntBlockPool, TestTimSorter,
> TestSimpleSearchEquivalence, TestFuzzyQuery, TestSloppyMath,
> Test4GBStoredFields, TestLongPostings, TestStoredFieldsFormat,
> TestSameTokenSamePosition, TestMultiThreadTermVectors,
> TestLucene40TermVectorsFormat, TestRegexpQuery,
> TestSloppyPhraseQuery2, TestRollingBuffer, TestBufferedIndexInput,
> TestDirectPacked, TestSpansAdvanced, TestBufferedChecksum,
> Test2BPostingsBytes, TestBitVectorBackCompat,
> TestLucene3xStoredFieldsFormat, TestTermVectorsFormat,
> TestBlockPostingsFormat2, TestNumericDocValuesUpdates, TestDocBoost,
> TestMultiFields, TestStringHelper, TestToken, TestIndexCommit,
> TestNumericTokenStream, TestFileSwitchDirectory, TestMathUtil,
> TestFastCompressionMode, TestBinaryDocument,
> TestCachingWrapperFilter, TestTieredMergePolicy, TestPayloadSpans,
> TestIndexWriterExceptions, TestDateFilter, TestDocTermOrdsRangeFilter,
> TestMultiLevelSkipList, TestSizeBoundedForceMerge, TestMockCharFilter,
> TestRecyclingIntBlockAllocator, TestDocument, TestNumericUtils,
> TestDuelingCodecs, TestNeverDelete, TestWeakIdentityMap,
> TestPositionIncrement, TestLucene41StoredFieldsFormat,
> TestCachingTokenFilter, TestFieldReuse, TestIdentityHashSet,
> TestIndexWriterOnJRECrash, TestLucene45DocValuesFormat,
> TestSimpleExplanationsOfNonMatches, TestWAH8DocIdSet,
> TestByteBlockPool, TestDocumentsWriterDeleteQueue, TestOfflineSorter,
> TestControlledRealTimeReopenThread, TestTermInfosReaderIndex,
> TestDoubleBarrelLRUCache, TestCodecs, TestSimilarityBase,
> TestIndexWriterDelete, TestBasics, TestDocValuesFormat,
> TestNumericRangeQuery64, TestGraphTokenizers, TestDeletionPolicy,
> TestAtomicUpdate, TestIndexWriterCommit, TestTimeLimitingCollector,
> TestHighCompressionMode, TestMinimize, TestLucene40PostingsReader,
> TestIndexWriterForceMerge, TestPerFieldPostingsFormat, TestByteSlices,
> TestConsistentFieldNumbers, TestSimpleExplanations,
> TestCompressingStoredFieldsFormat, TestPhraseQuery, TestCollectionUtil,
> TestOmitNorms, TestNRTCachingDirectory, TestSegmentReader,
> TestFastDecompressionMode, TestParallelCompositeReader,
> TestIndexWriterNRTIsCurrent, TestFieldCacheRewriteMethod,
> TestTransactions, TestCrash, TestPerFieldPostingsFormat2,
> TestBlockPostingsFormat, TestBitVector, TestFieldsReader,
> TestDocValuesIndexing, TestHugeRamFile, TestDeterminizeLexicon,
> TestIndexWriterOnDiskFull, TestFieldCache, TestSpans, TestCustomNorms,
> TestTransactionRollback, TestFlex, TestUTF32ToUTF8, TestLazyProxSkipping,
> TestDeterminism, TestDocsAndPositions, TestFieldCacheRangeFilter,
> TestTermVectorsWriter, TestOmitPositions, TestPayloadExplanations,
> TestParallelAtomicReader, TestBytesRefHash, TestDisjunctionMaxQuery,
> TestForceMergeForever, TestNearSpansOrdered,
> TestSameScoresWithThreads, TestLiveFieldValues, TestForTooMuchCloning,
> TestSpanSearchEquivalence, TestPayloads, TestWildcard, TestSimilarity2,
> TestNoDeletionPolicy, TestTermVectorsReader, TestSpansAdvanced2,
> TestMultiValuedNumericRangeQuery, TestPrefixInBooleanQuery,
> TestTopDocsCollector, TestSegmentTermEnum, TestUniqueTermCount,
> TestComplexExplanationsOfNonMatches, TestUnicodeUtil,
> TestPrefixCodedTerms, TestAllFilesHaveCodecHeader,
> TestAutomatonQuery, TestForUtil, TestMaxTermFrequency,
> TestTopFieldCollector, TestSumDocFreq, TestDocValuesScoring,
> TestWindowsMMap, TestCheckIndex, TestPayloadsOnVectors,
> TestFieldValueFilter, TestIndexFileDeleter, TestCompiledAutomaton,
> TestConstantScoreQuery, TestMatchAllDocsQuery, TestPrefixQuery,
> TestParallelTermEnum, TestDocIdSet, TestElevationComparator,
> TestFilteredSearch, TestBinaryTerms, TestConjunctions, Nested, Nested,
> TestField, TestDateSort, TestSpanExplanationsOfNonMatches,
> TestVirtualMethod, TestSetOnce, TestFilterAtomicReader, TestSearch,
> TestFilterIterator, TestCharsRef, Test2BPostings, TestFieldCacheTermsFilter,
> TestTotalHitCountCollector, TestMockDirectoryWrapper, TestIsCurrent,
> TestNoMergeScheduler, TestPhrasePrefixQuery, TestRollback, TestNot,
> TestCloseableThreadLocal, TestCodecHoldsOpenFiles, MultiCollectorTest,
> TestIntsRef, Test2BPositions, TestTopScoreDocCollector,
> TestNewestSegment, Test2BBinaryDocValues,
> TestPackedTokenAttributeImpl, TestLucene40NormsFormat,
> TestLucene49NormsFormat, TestFieldType, TestBackwardsCompatibility3x,
> TestIndexWriterMaxDocs, TestIndexWriterOutOfFileDescriptors]
>    [junit4] Completed on J1 in 2.61s, 1 test, 1 failure <<< FAILURES!
> 
> [...truncated 101 lines...]
> BUILD FAILED
> /mnt/ssd/jenkins/workspace/Lucene-Solr-4.10-Linux/build.xml:474: The
> following error occurred while executing this line:
> /mnt/ssd/jenkins/workspace/Lucene-Solr-4.10-Linux/build.xml:454: The
> following error occurred while executing this line:
> /mnt/ssd/jenkins/workspace/Lucene-Solr-4.10-Linux/build.xml:45: The
> following error occurred while executing this line:
> /mnt/ssd/jenkins/workspace/Lucene-Solr-4.10-Linux/extra-targets.xml:37:
> The following error occurred while executing this line:
> /mnt/ssd/jenkins/workspace/Lucene-Solr-4.10-Linux/lucene/build.xml:49:
> The following error occurred while executing this line:
> /mnt/ssd/jenkins/workspace/Lucene-Solr-4.10-Linux/lucene/common-
> build.xml:1351: The following error occurred while executing this line:
> /mnt/ssd/jenkins/workspace/Lucene-Solr-4.10-Linux/lucene/common-
> build.xml:966: There were test failures: 421 suites, 3727 tests, 4 errors, 63
> failures, 143 ignored (132 assumptions)
> 
> Total time: 24 minutes 9 seconds
> Build step 'Invoke Ant' marked build as failure
> [description-setter] Description set: Java: 64bit/jdk1.9.0-ea-b47 -
> XX:+UseCompressedOops -XX:+UseSerialGC
> Archiving artifacts
> Recording test results
> Email was triggered for: Failure - Any
> Sending email for trigger: Failure - Any
> 



---------------------------------------------------------------------
To unsubscribe, e-mail: dev-unsubscribe@lucene.apache.org
For additional commands, e-mail: dev-help@lucene.apache.org


Mime
View raw message