lucene-dev mailing list archives

Site index · List index
Message view « Date » · « Thread »
Top « Date » · « Thread »
From Michael McCandless <m...@elasticsearch.com>
Subject Re: [CI] Lucene 5x Linux Java8 64 Test Only - Build # 27313 - Failure!
Date Wed, 28 Jan 2015 17:52:06 GMT
I opened https://issues.apache.org/jira/browse/LUCENE-6205

Mike McCandless

http://blog.mikemccandless.com

On Wed, Jan 28, 2015 at 5:04 AM, Michael McCandless <mike@elasticsearch.com>
wrote:

> I'm looking at this.
>
> Mike McCandless
>
> http://blog.mikemccandless.com
>
> On Wed, Jan 28, 2015 at 2:50 AM, <build@elasticsearch.com> wrote:
>
>>   *BUILD FAILURE*
>> Build URL
>> http://build-eu-00.elasticsearch.org/job/lucene_linux_java8_64_test_only/27313/
>> Project:lucene_linux_java8_64_test_only Date of build:Wed, 28 Jan 2015
>> 08:48:34 +0100 Build duration:2 min 27 sec
>>  *CHANGES* No Changes
>>  *BUILD ARTIFACTS*
>> checkout/lucene/build/core/test/temp/junit4-J0-20150128_084838_313.events
>> <http://build-eu-00.elasticsearch.org/job/lucene_linux_java8_64_test_only/27313/artifact/checkout/lucene/build/core/test/temp/junit4-J0-20150128_084838_313.events>
>> checkout/lucene/build/core/test/temp/junit4-J1-20150128_084838_313.events
>> <http://build-eu-00.elasticsearch.org/job/lucene_linux_java8_64_test_only/27313/artifact/checkout/lucene/build/core/test/temp/junit4-J1-20150128_084838_313.events>
>> checkout/lucene/build/core/test/temp/junit4-J2-20150128_084838_313.events
>> <http://build-eu-00.elasticsearch.org/job/lucene_linux_java8_64_test_only/27313/artifact/checkout/lucene/build/core/test/temp/junit4-J2-20150128_084838_313.events>
>> checkout/lucene/build/core/test/temp/junit4-J3-20150128_084838_314.events
>> <http://build-eu-00.elasticsearch.org/job/lucene_linux_java8_64_test_only/27313/artifact/checkout/lucene/build/core/test/temp/junit4-J3-20150128_084838_314.events>
>> checkout/lucene/build/core/test/temp/junit4-J4-20150128_084838_314.events
>> <http://build-eu-00.elasticsearch.org/job/lucene_linux_java8_64_test_only/27313/artifact/checkout/lucene/build/core/test/temp/junit4-J4-20150128_084838_314.events>
>> checkout/lucene/build/core/test/temp/junit4-J5-20150128_084838_314.events
>> <http://build-eu-00.elasticsearch.org/job/lucene_linux_java8_64_test_only/27313/artifact/checkout/lucene/build/core/test/temp/junit4-J5-20150128_084838_314.events>
>> checkout/lucene/build/core/test/temp/junit4-J6-20150128_084838_314.events
>> <http://build-eu-00.elasticsearch.org/job/lucene_linux_java8_64_test_only/27313/artifact/checkout/lucene/build/core/test/temp/junit4-J6-20150128_084838_314.events>
>> checkout/lucene/build/core/test/temp/junit4-J7-20150128_084838_314.events
>> <http://build-eu-00.elasticsearch.org/job/lucene_linux_java8_64_test_only/27313/artifact/checkout/lucene/build/core/test/temp/junit4-J7-20150128_084838_314.events>
>>  *FAILED JUNIT TESTS* Name: org.apache.lucene.index Failed: 1 test(s),
>> Passed: 745 test(s), Skipped: 19 test(s), Total: 765 test(s)
>> *Failed:
>> org.apache.lucene.index.TestBinaryDocValuesUpdates.testManyReopensAndFields
>> *
>>  *CONSOLE OUTPUT* [...truncated 1558 lines...] [junit4]  [junit4] Tests
>> with failures: [junit4] -
>> org.apache.lucene.index.TestBinaryDocValuesUpdates.testManyReopensAndFields [junit4]
>>  [junit4]  [junit4] JVM J0: 0.85 .. 123.14 = 122.28s [junit4] JVM J1:
>> 0.95 .. 123.30 = 122.35s [junit4] JVM J2: 1.03 .. 124.22 = 123.19s [junit4]
>> JVM J3: 0.99 .. 123.94 = 122.95s [junit4] JVM J4: 0.95 .. 123.97 =
>> 123.02s [junit4] JVM J5: 1.01 .. 124.17 = 123.15s [junit4] JVM J6: 1.24
>> .. 133.95 = 132.71s [junit4] JVM J7: 0.94 .. 123.96 = 123.02s [junit4]
>> Execution time total: 2 minutes 13 seconds [junit4] Tests summary: 408
>> suites, 3233 tests, 1 error, 60 ignored (50 assumptions) BUILD FAILED /home/jenkins/workspace/lucene_linux_java8_64_test_only/checkout/lucene/build.xml:49:
>> The following error occurred while executing this line: /home/jenkins/workspace/lucene_linux_java8_64_test_only/checkout/lucene/common-build.xml:1363:
>> The following error occurred while executing this line: /home/jenkins/workspace/lucene_linux_java8_64_test_only/checkout/lucene/common-build.xml:970:
>> There were test failures: 408 suites, 3233 tests, 1 error, 60 ignored (50
>> assumptions) Total time: 2 minutes 21 seconds Build step 'Invoke Ant'
>> marked build as failure Archiving artifacts Recording test results Email
>> was triggered for: Failure - 1st Trigger Failure - Any was overridden by
>> another trigger and will not send an email. Trigger Failure - Still was
>> overridden by another trigger and will not send an email. Sending email
>> for trigger: Failure - 1st
>>
>
>

Mime
View raw message