lucene-dev mailing list archives

Site index · List index
Message view « Date » · « Thread »
Top « Date » · « Thread »
From Apache Jenkins Server <jenk...@builds.apache.org>
Subject [JENKINS] Lucene-Solr-NightlyTests-5.x - Build # 722 - Still Failing
Date Fri, 02 Jan 2015 21:06:53 GMT
Build: https://builds.apache.org/job/Lucene-Solr-NightlyTests-5.x/722/

1 tests failed.
REGRESSION:  org.apache.solr.cloud.CollectionsAPIDistributedZkTest.testDistribSearch

Error Message:
Error from server at https://127.0.0.1:62231/q_e/o: java.lang.NullPointerException 

Stack Trace:
org.apache.solr.client.solrj.impl.HttpSolrClient$RemoteSolrException: Error from server at https://127.0.0.1:62231/q_e/o: java.lang.NullPointerException

	at org.apache.solr.client.solrj.impl.HttpSolrClient.executeMethod(HttpSolrClient.java:558)
	at org.apache.solr.client.solrj.impl.HttpSolrClient.request(HttpSolrClient.java:214)
	at org.apache.solr.client.solrj.impl.HttpSolrClient.request(HttpSolrClient.java:210)
	at org.apache.solr.cloud.CollectionsAPIDistributedZkTest.testErrorHandling(CollectionsAPIDistributedZkTest.java:449)
	at org.apache.solr.cloud.CollectionsAPIDistributedZkTest.doTest(CollectionsAPIDistributedZkTest.java:201)
	at org.apache.solr.BaseDistributedSearchTestCase.testDistribSearch(BaseDistributedSearchTestCase.java:868)
	at sun.reflect.NativeMethodAccessorImpl.invoke0(Native Method)
	at sun.reflect.NativeMethodAccessorImpl.invoke(NativeMethodAccessorImpl.java:57)
	at sun.reflect.DelegatingMethodAccessorImpl.invoke(DelegatingMethodAccessorImpl.java:43)
	at java.lang.reflect.Method.invoke(Method.java:606)
	at com.carrotsearch.randomizedtesting.RandomizedRunner.invoke(RandomizedRunner.java:1618)
	at com.carrotsearch.randomizedtesting.RandomizedRunner$6.evaluate(RandomizedRunner.java:827)
	at com.carrotsearch.randomizedtesting.RandomizedRunner$7.evaluate(RandomizedRunner.java:863)
	at com.carrotsearch.randomizedtesting.RandomizedRunner$8.evaluate(RandomizedRunner.java:877)
	at com.carrotsearch.randomizedtesting.rules.SystemPropertiesRestoreRule$1.evaluate(SystemPropertiesRestoreRule.java:53)
	at org.apache.lucene.util.TestRuleSetupTeardownChained$1.evaluate(TestRuleSetupTeardownChained.java:50)
	at org.apache.lucene.util.AbstractBeforeAfterRule$1.evaluate(AbstractBeforeAfterRule.java:46)
	at com.carrotsearch.randomizedtesting.rules.SystemPropertiesInvariantRule$1.evaluate(SystemPropertiesInvariantRule.java:55)
	at org.apache.lucene.util.TestRuleThreadAndTestName$1.evaluate(TestRuleThreadAndTestName.java:49)
	at org.apache.lucene.util.TestRuleIgnoreAfterMaxFailures$1.evaluate(TestRuleIgnoreAfterMaxFailures.java:65)
	at org.apache.lucene.util.TestRuleMarkFailure$1.evaluate(TestRuleMarkFailure.java:48)
	at com.carrotsearch.randomizedtesting.rules.StatementAdapter.evaluate(StatementAdapter.java:36)
	at com.carrotsearch.randomizedtesting.ThreadLeakControl$StatementRunner.run(ThreadLeakControl.java:365)
	at com.carrotsearch.randomizedtesting.ThreadLeakControl.forkTimeoutingTask(ThreadLeakControl.java:798)
	at com.carrotsearch.randomizedtesting.ThreadLeakControl$3.evaluate(ThreadLeakControl.java:458)
	at com.carrotsearch.randomizedtesting.RandomizedRunner.runSingleTest(RandomizedRunner.java:836)
	at com.carrotsearch.randomizedtesting.RandomizedRunner$3.evaluate(RandomizedRunner.java:738)
	at com.carrotsearch.randomizedtesting.RandomizedRunner$4.evaluate(RandomizedRunner.java:772)
	at com.carrotsearch.randomizedtesting.RandomizedRunner$5.evaluate(RandomizedRunner.java:783)
	at com.carrotsearch.randomizedtesting.rules.StatementAdapter.evaluate(StatementAdapter.java:36)
	at com.carrotsearch.randomizedtesting.rules.SystemPropertiesRestoreRule$1.evaluate(SystemPropertiesRestoreRule.java:53)
	at org.apache.lucene.util.AbstractBeforeAfterRule$1.evaluate(AbstractBeforeAfterRule.java:46)
	at org.apache.lucene.util.TestRuleStoreClassName$1.evaluate(TestRuleStoreClassName.java:42)
	at com.carrotsearch.randomizedtesting.rules.SystemPropertiesInvariantRule$1.evaluate(SystemPropertiesInvariantRule.java:55)
	at com.carrotsearch.randomizedtesting.rules.NoShadowingOrOverridesOnMethodsRule$1.evaluate(NoShadowingOrOverridesOnMethodsRule.java:39)
	at com.carrotsearch.randomizedtesting.rules.NoShadowingOrOverridesOnMethodsRule$1.evaluate(NoShadowingOrOverridesOnMethodsRule.java:39)
	at com.carrotsearch.randomizedtesting.rules.StatementAdapter.evaluate(StatementAdapter.java:36)
	at com.carrotsearch.randomizedtesting.rules.StatementAdapter.evaluate(StatementAdapter.java:36)
	at com.carrotsearch.randomizedtesting.rules.StatementAdapter.evaluate(StatementAdapter.java:36)
	at org.apache.lucene.util.TestRuleAssertionsRequired$1.evaluate(TestRuleAssertionsRequired.java:54)
	at org.apache.lucene.util.TestRuleMarkFailure$1.evaluate(TestRuleMarkFailure.java:48)
	at org.apache.lucene.util.TestRuleIgnoreAfterMaxFailures$1.evaluate(TestRuleIgnoreAfterMaxFailures.java:65)
	at org.apache.lucene.util.TestRuleIgnoreTestSuites$1.evaluate(TestRuleIgnoreTestSuites.java:55)
	at com.carrotsearch.randomizedtesting.rules.StatementAdapter.evaluate(StatementAdapter.java:36)
	at com.carrotsearch.randomizedtesting.ThreadLeakControl$StatementRunner.run(ThreadLeakControl.java:365)
	at java.lang.Thread.run(Thread.java:745)




Build Log:
[...truncated 10087 lines...]
   [junit4] Suite: org.apache.solr.cloud.CollectionsAPIDistributedZkTest
   [junit4]   2> Creating dataDir: /usr/home/jenkins/jenkins-slave/workspace/Lucene-Solr-NightlyTests-5.x/solr/build/solr-core/test/J3/temp/solr.cloud.CollectionsAPIDistributedZkTest-E85A8117DC3C9366-001/init-core-data-001
   [junit4]   2> 312673 T133 oas.SolrTestCaseJ4.buildSSLConfig Randomized ssl (true) and clientAuth (false)
   [junit4]   2> 312674 T133 oas.BaseDistributedSearchTestCase.initHostContext Setting hostContext system property: /q_e/o
   [junit4]   2> 312681 T133 oas.SolrTestCaseJ4.setUp ###Starting testDistribSearch
   [junit4]   2> 312722 T133 oasc.ZkTestServer.run STARTING ZK TEST SERVER
   [junit4]   1> client port:0.0.0.0/0.0.0.0:0
   [junit4]   2> 312737 T134 oasc.ZkTestServer$ZKServerMain.runFromConfig Starting server
   [junit4]   2> 313139 T133 oasc.ZkTestServer.run start zk server on port:53551
   [junit4]   2> 313152 T133 oascc.SolrZkClient.createZkCredentialsToAddAutomatically Using default ZkCredentialsProvider
   [junit4]   2> 313410 T133 oascc.ConnectionManager.waitForConnected Waiting for client to connect to ZooKeeper
   [junit4]   2> 313588 T141 oascc.ConnectionManager.process Watcher org.apache.solr.common.cloud.ConnectionManager@2ea64c1b name:ZooKeeperConnection Watcher:127.0.0.1:53551 got event WatchedEvent state:SyncConnected type:None path:null path:null type:None
   [junit4]   2> 313588 T133 oascc.ConnectionManager.waitForConnected Client is connected to ZooKeeper
   [junit4]   2> 313589 T133 oascc.SolrZkClient.createZkACLProvider Using default ZkACLProvider
   [junit4]   2> 313600 T133 oascc.SolrZkClient.makePath makePath: /solr
   [junit4]   2> 313734 T133 oascc.SolrZkClient.createZkCredentialsToAddAutomatically Using default ZkCredentialsProvider
   [junit4]   2> 313735 T133 oascc.ConnectionManager.waitForConnected Waiting for client to connect to ZooKeeper
   [junit4]   2> 313737 T144 oascc.ConnectionManager.process Watcher org.apache.solr.common.cloud.ConnectionManager@60bd4767 name:ZooKeeperConnection Watcher:127.0.0.1:53551/solr got event WatchedEvent state:SyncConnected type:None path:null path:null type:None
   [junit4]   2> 313738 T133 oascc.ConnectionManager.waitForConnected Client is connected to ZooKeeper
   [junit4]   2> 313738 T133 oascc.SolrZkClient.createZkACLProvider Using default ZkACLProvider
   [junit4]   2> 313746 T133 oascc.SolrZkClient.makePath makePath: /collections/collection1
   [junit4]   2> 313752 T133 oascc.SolrZkClient.makePath makePath: /collections/collection1/shards
   [junit4]   2> 313756 T133 oascc.SolrZkClient.makePath makePath: /collections/control_collection
   [junit4]   2> 313760 T133 oascc.SolrZkClient.makePath makePath: /collections/control_collection/shards
   [junit4]   2> 313766 T133 oasc.AbstractZkTestCase.putConfig put /usr/home/jenkins/jenkins-slave/workspace/Lucene-Solr-NightlyTests-5.x/solr/core/src/test-files/solr/collection1/conf/solrconfig-tlog.xml to /configs/conf1/solrconfig.xml
   [junit4]   2> 313767 T133 oascc.SolrZkClient.makePath makePath: /configs/conf1/solrconfig.xml
   [junit4]   2> 313774 T133 oasc.AbstractZkTestCase.putConfig put /usr/home/jenkins/jenkins-slave/workspace/Lucene-Solr-NightlyTests-5.x/solr/core/src/test-files/solr/collection1/conf/schema.xml to /configs/conf1/schema.xml
   [junit4]   2> 313775 T133 oascc.SolrZkClient.makePath makePath: /configs/conf1/schema.xml
   [junit4]   2> 313880 T133 oasc.AbstractZkTestCase.putConfig put /usr/home/jenkins/jenkins-slave/workspace/Lucene-Solr-NightlyTests-5.x/solr/core/src/test-files/solr/collection1/conf/solrconfig.snippet.randomindexconfig.xml to /configs/conf1/solrconfig.snippet.randomindexconfig.xml
   [junit4]   2> 313881 T133 oascc.SolrZkClient.makePath makePath: /configs/conf1/solrconfig.snippet.randomindexconfig.xml
   [junit4]   2> 313886 T133 oasc.AbstractZkTestCase.putConfig put /usr/home/jenkins/jenkins-slave/workspace/Lucene-Solr-NightlyTests-5.x/solr/core/src/test-files/solr/collection1/conf/stopwords.txt to /configs/conf1/stopwords.txt
   [junit4]   2> 313887 T133 oascc.SolrZkClient.makePath makePath: /configs/conf1/stopwords.txt
   [junit4]   2> 313891 T133 oasc.AbstractZkTestCase.putConfig put /usr/home/jenkins/jenkins-slave/workspace/Lucene-Solr-NightlyTests-5.x/solr/core/src/test-files/solr/collection1/conf/protwords.txt to /configs/conf1/protwords.txt
   [junit4]   2> 313892 T133 oascc.SolrZkClient.makePath makePath: /configs/conf1/protwords.txt
   [junit4]   2> 313897 T133 oasc.AbstractZkTestCase.putConfig put /usr/home/jenkins/jenkins-slave/workspace/Lucene-Solr-NightlyTests-5.x/solr/core/src/test-files/solr/collection1/conf/currency.xml to /configs/conf1/currency.xml
   [junit4]   2> 313898 T133 oascc.SolrZkClient.makePath makePath: /configs/conf1/currency.xml
   [junit4]   2> 313903 T133 oasc.AbstractZkTestCase.putConfig put /usr/home/jenkins/jenkins-slave/workspace/Lucene-Solr-NightlyTests-5.x/solr/core/src/test-files/solr/collection1/conf/enumsConfig.xml to /configs/conf1/enumsConfig.xml
   [junit4]   2> 313904 T133 oascc.SolrZkClient.makePath makePath: /configs/conf1/enumsConfig.xml
   [junit4]   2> 313908 T133 oasc.AbstractZkTestCase.putConfig put /usr/home/jenkins/jenkins-slave/workspace/Lucene-Solr-NightlyTests-5.x/solr/core/src/test-files/solr/collection1/conf/open-exchange-rates.json to /configs/conf1/open-exchange-rates.json
   [junit4]   2> 313909 T133 oascc.SolrZkClient.makePath makePath: /configs/conf1/open-exchange-rates.json
   [junit4]   2> 313913 T133 oasc.AbstractZkTestCase.putConfig put /usr/home/jenkins/jenkins-slave/workspace/Lucene-Solr-NightlyTests-5.x/solr/core/src/test-files/solr/collection1/conf/mapping-ISOLatin1Accent.txt to /configs/conf1/mapping-ISOLatin1Accent.txt
   [junit4]   2> 313913 T133 oascc.SolrZkClient.makePath makePath: /configs/conf1/mapping-ISOLatin1Accent.txt
   [junit4]   2> 313918 T133 oasc.AbstractZkTestCase.putConfig put /usr/home/jenkins/jenkins-slave/workspace/Lucene-Solr-NightlyTests-5.x/solr/core/src/test-files/solr/collection1/conf/old_synonyms.txt to /configs/conf1/old_synonyms.txt
   [junit4]   2> 313918 T133 oascc.SolrZkClient.makePath makePath: /configs/conf1/old_synonyms.txt
   [junit4]   2> 313923 T133 oasc.AbstractZkTestCase.putConfig put /usr/home/jenkins/jenkins-slave/workspace/Lucene-Solr-NightlyTests-5.x/solr/core/src/test-files/solr/collection1/conf/synonyms.txt to /configs/conf1/synonyms.txt
   [junit4]   2> 313923 T133 oascc.SolrZkClient.makePath makePath: /configs/conf1/synonyms.txt
   [junit4]   2> 313946 T133 oascc.SolrZkClient.createZkCredentialsToAddAutomatically Using default ZkCredentialsProvider
   [junit4]   2> 313947 T133 oascc.ConnectionManager.waitForConnected Waiting for client to connect to ZooKeeper
   [junit4]   2> 313950 T147 oascc.ConnectionManager.process Watcher org.apache.solr.common.cloud.ConnectionManager@76455a0a name:ZooKeeperConnection Watcher:127.0.0.1:53551/solr got event WatchedEvent state:SyncConnected type:None path:null path:null type:None
   [junit4]   2> 313950 T133 oascc.ConnectionManager.waitForConnected Client is connected to ZooKeeper
   [junit4]   2> 313950 T133 oascc.SolrZkClient.createZkACLProvider Using default ZkACLProvider
   [junit4]   2> Using old style solr.xml
   [junit4]   2> 315745 T133 oejs.Server.doStart jetty-8.1.10.v20130312
   [junit4]   2> 315755 T133 oejus.SslContextFactory.doStart Enabled Protocols [SSLv2Hello, SSLv3, TLSv1, TLSv1.1, TLSv1.2] of [SSLv2Hello, SSLv3, TLSv1, TLSv1.1, TLSv1.2]
   [junit4]   2> 315760 T133 oejs.AbstractConnector.doStart Started SslSocketConnector@127.0.0.1:53559
   [junit4]   2> 315764 T133 oass.SolrDispatchFilter.init SolrDispatchFilter.init()sun.misc.Launcher$AppClassLoader@57bd06bf
   [junit4]   2> 315765 T133 oasc.SolrResourceLoader.locateSolrHome JNDI not configured for solr (NoInitialContextEx)
   [junit4]   2> 315765 T133 oasc.SolrResourceLoader.locateSolrHome using system property solr.solr.home: ../../../../../../../../../../../usr/home/jenkins/jenkins-slave/workspace/Lucene-Solr-NightlyTests-5.x/solr/build/solr-core/test/J3/temp/solr.cloud.CollectionsAPIDistributedZkTest-E85A8117DC3C9366-001/tempDir-002
   [junit4]   2> 315765 T133 oasc.SolrResourceLoader.<init> new SolrResourceLoader for directory: '../../../../../../../../../../../usr/home/jenkins/jenkins-slave/workspace/Lucene-Solr-NightlyTests-5.x/solr/build/solr-core/test/J3/temp/solr.cloud.CollectionsAPIDistributedZkTest-E85A8117DC3C9366-001/tempDir-002/'
   [junit4]   2> 315835 T133 oasc.ConfigSolr.fromFile Loading container configuration from /usr/home/jenkins/jenkins-slave/workspace/Lucene-Solr-NightlyTests-5.x/solr/build/solr-core/test/J3/../../../../../../../../../../../usr/home/jenkins/jenkins-slave/workspace/Lucene-Solr-NightlyTests-5.x/solr/build/solr-core/test/J3/temp/solr.cloud.CollectionsAPIDistributedZkTest-E85A8117DC3C9366-001/tempDir-002/solr.xml
   [junit4]   2> 315990 T133 oasc.CoreContainer.<init> New CoreContainer 184470565
   [junit4]   2> 315990 T133 oasc.CoreContainer.load Loading cores into CoreContainer [instanceDir=../../../../../../../../../../../usr/home/jenkins/jenkins-slave/workspace/Lucene-Solr-NightlyTests-5.x/solr/build/solr-core/test/J3/temp/solr.cloud.CollectionsAPIDistributedZkTest-E85A8117DC3C9366-001/tempDir-002/]
   [junit4]   2> 315992 T133 oashc.HttpShardHandlerFactory.getParameter Setting socketTimeout to: 120000
   [junit4]   2> 315992 T133 oashc.HttpShardHandlerFactory.getParameter Setting urlScheme to: null
   [junit4]   2> 315992 T133 oashc.HttpShardHandlerFactory.getParameter Setting connTimeout to: 15000
   [junit4]   2> 315993 T133 oashc.HttpShardHandlerFactory.getParameter Setting maxConnectionsPerHost to: 20
   [junit4]   2> 315993 T133 oashc.HttpShardHandlerFactory.getParameter Setting maxConnections to: 10000
   [junit4]   2> 315994 T133 oashc.HttpShardHandlerFactory.getParameter Setting corePoolSize to: 0
   [junit4]   2> 315994 T133 oashc.HttpShardHandlerFactory.getParameter Setting maximumPoolSize to: 2147483647
   [junit4]   2> 315994 T133 oashc.HttpShardHandlerFactory.getParameter Setting maxThreadIdleTime to: 5
   [junit4]   2> 315995 T133 oashc.HttpShardHandlerFactory.getParameter Setting sizeOfQueue to: -1
   [junit4]   2> 315995 T133 oashc.HttpShardHandlerFactory.getParameter Setting fairnessPolicy to: false
   [junit4]   2> 315999 T133 oasu.UpdateShardHandler.<init> Creating UpdateShardHandler HTTP client with params: socketTimeout=3400000&connTimeout=45000&retry=false
   [junit4]   2> 316003 T133 oasl.LogWatcher.createWatcher SLF4J impl is org.slf4j.impl.Log4jLoggerFactory
   [junit4]   2> 316004 T133 oasl.LogWatcher.newRegisteredLogWatcher Registering Log Listener [Log4j (org.slf4j.impl.Log4jLoggerFactory)]
   [junit4]   2> 316004 T133 oasc.CoreContainer.load Host Name: 127.0.0.1
   [junit4]   2> 316005 T133 oasc.ZkContainer.initZooKeeper Zookeeper client=127.0.0.1:53551/solr
   [junit4]   2> 316077 T133 oasc.ZkController.checkChrootPath zkHost includes chroot
   [junit4]   2> 316077 T133 oascc.SolrZkClient.createZkCredentialsToAddAutomatically Using default ZkCredentialsProvider
   [junit4]   2> 316078 T133 oascc.ConnectionManager.waitForConnected Waiting for client to connect to ZooKeeper
   [junit4]   2> 316081 T159 oascc.ConnectionManager.process Watcher org.apache.solr.common.cloud.ConnectionManager@462cee10 name:ZooKeeperConnection Watcher:127.0.0.1:53551 got event WatchedEvent state:SyncConnected type:None path:null path:null type:None
   [junit4]   2> 316082 T133 oascc.ConnectionManager.waitForConnected Client is connected to ZooKeeper
   [junit4]   2> 316082 T133 oascc.SolrZkClient.createZkACLProvider Using default ZkACLProvider
   [junit4]   2> 316122 T133 oascc.ConnectionManager.waitForConnected Waiting for client to connect to ZooKeeper
   [junit4]   2> 316125 T162 oascc.ConnectionManager.process Watcher org.apache.solr.common.cloud.ConnectionManager@6181b53f name:ZooKeeperConnection Watcher:127.0.0.1:53551/solr got event WatchedEvent state:SyncConnected type:None path:null path:null type:None
   [junit4]   2> 316125 T133 oascc.ConnectionManager.waitForConnected Client is connected to ZooKeeper
   [junit4]   2> 316153 T133 oascc.SolrZkClient.makePath makePath: /overseer/queue
   [junit4]   2> 316172 T133 oascc.SolrZkClient.makePath makePath: /overseer/collection-queue-work
   [junit4]   2> 316184 T133 oascc.SolrZkClient.makePath makePath: /overseer/collection-map-running
   [junit4]   2> 316189 T133 oascc.SolrZkClient.makePath makePath: /overseer/collection-map-completed
   [junit4]   2> 316194 T133 oascc.SolrZkClient.makePath makePath: /overseer/collection-map-failure
   [junit4]   2> 316226 T133 oascc.SolrZkClient.makePath makePath: /live_nodes
   [junit4]   2> 316229 T133 oasc.ZkController.createEphemeralLiveNode Register node as live in ZooKeeper:/live_nodes/127.0.0.1:53559_q_e%2Fo
   [junit4]   2> 316241 T133 oascc.SolrZkClient.makePath makePath: /live_nodes/127.0.0.1:53559_q_e%2Fo
   [junit4]   2> 316247 T133 oascc.SolrZkClient.makePath makePath: /overseer_elect
   [junit4]   2> 316251 T133 oascc.SolrZkClient.makePath makePath: /overseer_elect/election
   [junit4]   2> 316255 T133 oasc.Overseer.close Overseer (id=null) closing
   [junit4]   2> 316280 T133 oasc.OverseerElectionContext.runLeaderProcess I am going to be the leader 127.0.0.1:53559_q_e%2Fo
   [junit4]   2> 316281 T133 oascc.SolrZkClient.makePath makePath: /overseer_elect/leader
   [junit4]   2> 316284 T133 oasc.Overseer.start Overseer (id=93076086524608516-127.0.0.1:53559_q_e%2Fo-n_0000000000) starting
   [junit4]   2> 316310 T133 oascc.SolrZkClient.makePath makePath: /overseer/queue-work
   [junit4]   2> 316357 T133 oasc.OverseerAutoReplicaFailoverThread.<init> Starting OverseerAutoReplicaFailoverThread autoReplicaFailoverWorkLoopDelay=10000 autoReplicaFailoverWaitAfterExpiration=30000 autoReplicaFailoverBadNodeExpiration=60000
   [junit4]   2> 316387 T164 oasc.OverseerCollectionProcessor.run Process current queue of collection creations
   [junit4]   2> 316388 T133 oascc.SolrZkClient.makePath makePath: /clusterstate.json
   [junit4]   2> 316392 T133 oascc.SolrZkClient.makePath makePath: /aliases.json
   [junit4]   2> 316394 T133 oascc.ZkStateReader.createClusterStateWatchersAndUpdate Updating cluster state from ZooKeeper... 
   [junit4]   2> 316437 T163 oasc.Overseer$ClusterStateUpdater.run Starting to work on the main queue
   [junit4]   2> 316447 T133 oass.SolrDispatchFilter.init user.dir=/usr/home/jenkins/jenkins-slave/workspace/Lucene-Solr-NightlyTests-5.x/solr/build/solr-core/test/J3
   [junit4]   2> 316448 T133 oass.SolrDispatchFilter.init SolrDispatchFilter.init() done
   [junit4]   2> 316530 T133 oascc.SolrZkClient.createZkCredentialsToAddAutomatically Using default ZkCredentialsProvider
   [junit4]   2> 316531 T133 oascc.ConnectionManager.waitForConnected Waiting for client to connect to ZooKeeper
   [junit4]   2> 316533 T169 oascc.ConnectionManager.process Watcher org.apache.solr.common.cloud.ConnectionManager@e55c179 name:ZooKeeperConnection Watcher:127.0.0.1:53551/solr got event WatchedEvent state:SyncConnected type:None path:null path:null type:None
   [junit4]   2> 316534 T133 oascc.ConnectionManager.waitForConnected Client is connected to ZooKeeper
   [junit4]   2> 316534 T133 oascc.SolrZkClient.createZkACLProvider Using default ZkACLProvider
   [junit4]   2> 316536 T133 oascc.ZkStateReader.createClusterStateWatchersAndUpdate Updating cluster state from ZooKeeper... 
   [junit4]   2> 316544 T133 oasc.ChaosMonkey.monkeyLog monkey: init - expire sessions:false cause connection loss:false
   [junit4]   2> 316545 T133 oasc.AbstractFullDistribZkTestBase.createJettys Creating collection1 with stateFormat=2
   [junit4]   2> 316545 T133 oascc.SolrZkClient.createZkCredentialsToAddAutomatically Using default ZkCredentialsProvider
   [junit4]   2> 316546 T133 oascc.ConnectionManager.waitForConnected Waiting for client to connect to ZooKeeper
   [junit4]   2> 316548 T172 oascc.ConnectionManager.process Watcher org.apache.solr.common.cloud.ConnectionManager@4767f3e1 name:ZooKeeperConnection Watcher:127.0.0.1:53551/solr got event WatchedEvent state:SyncConnected type:None path:null path:null type:None
   [junit4]   2> 316548 T133 oascc.ConnectionManager.waitForConnected Client is connected to ZooKeeper
   [junit4]   2> 316549 T133 oascc.SolrZkClient.createZkACLProvider Using default ZkACLProvider
   [junit4]   2> 316568 T162 oasc.DistributedQueue$LatchWatcher.process NodeChildrenChanged fired on path /overseer/queue state SyncConnected
   [junit4]   2> 316581 T163 oasc.Overseer$ClusterStateUpdater.run processMessage: queueSize: 0, message = {
   [junit4]   2> 	  "operation":"create",
   [junit4]   2> 	  "name":"collection1",
   [junit4]   2> 	  "numShards":"2",
   [junit4]   2> 	  "stateFormat":2} current state version: 0
   [junit4]   2> 316607 T163 oasco.ClusterStateMutator.createCollection building a new cName: collection1
   [junit4]   2> 316678 T163 oasco.ZkStateWriter.writePendingUpdates going to create_collection /collections/collection1/state.json
   [junit4]   2> 316701 T162 oascc.ZkStateReader$2.process A cluster state change: WatchedEvent state:SyncConnected type:NodeDataChanged path:/clusterstate.json, has occurred - updating... (live nodes size: 1)
   [junit4]   2> 316702 T169 oascc.ZkStateReader$2.process A cluster state change: WatchedEvent state:SyncConnected type:NodeDataChanged path:/clusterstate.json, has occurred - updating... (live nodes size: 1)
   [junit4]   2> 318137 T133 oasc.AbstractFullDistribZkTestBase.createJettys create jetty 1
   [junit4]   2> 318138 T133 oejs.Server.doStart jetty-8.1.10.v20130312
   [junit4]   2> 318146 T133 oejus.SslContextFactory.doStart Enabled Protocols [SSLv2Hello, SSLv3, TLSv1, TLSv1.1, TLSv1.2] of [SSLv2Hello, SSLv3, TLSv1, TLSv1.1, TLSv1.2]
   [junit4]   2> 318151 T133 oejs.AbstractConnector.doStart Started SslSocketConnector@127.0.0.1:62231
   [junit4]   2> 318154 T133 oass.SolrDispatchFilter.init SolrDispatchFilter.init()sun.misc.Launcher$AppClassLoader@57bd06bf
   [junit4]   2> 318155 T133 oasc.SolrResourceLoader.locateSolrHome JNDI not configured for solr (NoInitialContextEx)
   [junit4]   2> 318155 T133 oasc.SolrResourceLoader.locateSolrHome using system property solr.solr.home: ../../../../../../../../../../../usr/home/jenkins/jenkins-slave/workspace/Lucene-Solr-NightlyTests-5.x/solr/build/solr-core/test/J3/temp/solr.cloud.CollectionsAPIDistributedZkTest-E85A8117DC3C9366-001/tempDir-003
   [junit4]   2> 318156 T133 oasc.SolrResourceLoader.<init> new SolrResourceLoader for directory: '../../../../../../../../../../../usr/home/jenkins/jenkins-slave/workspace/Lucene-Solr-NightlyTests-5.x/solr/build/solr-core/test/J3/temp/solr.cloud.CollectionsAPIDistributedZkTest-E85A8117DC3C9366-001/tempDir-003/'
   [junit4]   2> 318204 T133 oasc.ConfigSolr.fromFile Loading container configuration from /usr/home/jenkins/jenkins-slave/workspace/Lucene-Solr-NightlyTests-5.x/solr/build/solr-core/test/J3/../../../../../../../../../../../usr/home/jenkins/jenkins-slave/workspace/Lucene-Solr-NightlyTests-5.x/solr/build/solr-core/test/J3/temp/solr.cloud.CollectionsAPIDistributedZkTest-E85A8117DC3C9366-001/tempDir-003/solr.xml
   [junit4]   2> 318292 T133 oasc.CoreContainer.<init> New CoreContainer 1360022521
   [junit4]   2> 318293 T133 oasc.CoreContainer.load Loading cores into CoreContainer [instanceDir=../../../../../../../../../../../usr/home/jenkins/jenkins-slave/workspace/Lucene-Solr-NightlyTests-5.x/solr/build/solr-core/test/J3/temp/solr.cloud.CollectionsAPIDistributedZkTest-E85A8117DC3C9366-001/tempDir-003/]
   [junit4]   2> 318294 T133 oashc.HttpShardHandlerFactory.getParameter Setting socketTimeout to: 120000
   [junit4]   2> 318294 T133 oashc.HttpShardHandlerFactory.getParameter Setting urlScheme to: null
   [junit4]   2> 318295 T133 oashc.HttpShardHandlerFactory.getParameter Setting connTimeout to: 15000
   [junit4]   2> 318295 T133 oashc.HttpShardHandlerFactory.getParameter Setting maxConnectionsPerHost to: 20
   [junit4]   2> 318295 T133 oashc.HttpShardHandlerFactory.getParameter Setting maxConnections to: 10000
   [junit4]   2> 318296 T133 oashc.HttpShardHandlerFactory.getParameter Setting corePoolSize to: 0
   [junit4]   2> 318296 T133 oashc.HttpShardHandlerFactory.getParameter Setting maximumPoolSize to: 2147483647
   [junit4]   2> 318297 T133 oashc.HttpShardHandlerFactory.getParameter Setting maxThreadIdleTime to: 5
   [junit4]   2> 318297 T133 oashc.HttpShardHandlerFactory.getParameter Setting sizeOfQueue to: -1
   [junit4]   2> 318297 T133 oashc.HttpShardHandlerFactory.getParameter Setting fairnessPolicy to: false
   [junit4]   2> 318301 T133 oasu.UpdateShardHandler.<init> Creating UpdateShardHandler HTTP client with params: socketTimeout=3400000&connTimeout=45000&retry=false
   [junit4]   2> 318304 T133 oasl.LogWatcher.createWatcher SLF4J impl is org.slf4j.impl.Log4jLoggerFactory
   [junit4]   2> 318305 T133 oasl.LogWatcher.newRegisteredLogWatcher Registering Log Listener [Log4j (org.slf4j.impl.Log4jLoggerFactory)]
   [junit4]   2> 318305 T133 oasc.CoreContainer.load Host Name: 127.0.0.1
   [junit4]   2> 318305 T133 oasc.ZkContainer.initZooKeeper Zookeeper client=127.0.0.1:53551/solr
   [junit4]   2> 318306 T133 oasc.ZkController.checkChrootPath zkHost includes chroot
   [junit4]   2> 318306 T133 oascc.SolrZkClient.createZkCredentialsToAddAutomatically Using default ZkCredentialsProvider
   [junit4]   2> 318307 T133 oascc.ConnectionManager.waitForConnected Waiting for client to connect to ZooKeeper
   [junit4]   2> 318310 T184 oascc.ConnectionManager.process Watcher org.apache.solr.common.cloud.ConnectionManager@55c3c6be name:ZooKeeperConnection Watcher:127.0.0.1:53551 got event WatchedEvent state:SyncConnected type:None path:null path:null type:None
   [junit4]   2> 318311 T133 oascc.ConnectionManager.waitForConnected Client is connected to ZooKeeper
   [junit4]   2> 318311 T133 oascc.SolrZkClient.createZkACLProvider Using default ZkACLProvider
   [junit4]   2> 318314 T133 oascc.ConnectionManager.waitForConnected Waiting for client to connect to ZooKeeper
   [junit4]   2> 318316 T187 oascc.ConnectionManager.process Watcher org.apache.solr.common.cloud.ConnectionManager@6692eb4f name:ZooKeeperConnection Watcher:127.0.0.1:53551/solr got event WatchedEvent state:SyncConnected type:None path:null path:null type:None
   [junit4]   2> 318317 T133 oascc.ConnectionManager.waitForConnected Client is connected to ZooKeeper
   [junit4]   2> 318329 T133 oascc.ZkStateReader.createClusterStateWatchersAndUpdate Updating cluster state from ZooKeeper... 
   [junit4]   2> 319340 T133 oasc.ZkController.createEphemeralLiveNode Register node as live in ZooKeeper:/live_nodes/127.0.0.1:62231_q_e%2Fo
   [junit4]   2> 319342 T133 oascc.SolrZkClient.makePath makePath: /live_nodes/127.0.0.1:62231_q_e%2Fo
   [junit4]   2> 319349 T133 oasc.Overseer.close Overseer (id=null) closing
   [junit4]   2> 319363 T133 oass.SolrDispatchFilter.init user.dir=/usr/home/jenkins/jenkins-slave/workspace/Lucene-Solr-NightlyTests-5.x/solr/build/solr-core/test/J3
   [junit4]   2> 319364 T133 oass.SolrDispatchFilter.init SolrDispatchFilter.init() done
   [junit4]   2> 321050 T133 oasc.AbstractFullDistribZkTestBase.createJettys create jetty 2
   [junit4]   2> 321051 T133 oejs.Server.doStart jetty-8.1.10.v20130312
   [junit4]   2> 321060 T133 oejus.SslContextFactory.doStart Enabled Protocols [SSLv2Hello, SSLv3, TLSv1, TLSv1.1, TLSv1.2] of [SSLv2Hello, SSLv3, TLSv1, TLSv1.1, TLSv1.2]
   [junit4]   2> 321063 T133 oejs.AbstractConnector.doStart Started SslSocketConnector@127.0.0.1:27216
   [junit4]   2> 321067 T133 oass.SolrDispatchFilter.init SolrDispatchFilter.init()sun.misc.Launcher$AppClassLoader@57bd06bf
   [junit4]   2> 321067 T133 oasc.SolrResourceLoader.locateSolrHome JNDI not configured for solr (NoInitialContextEx)
   [junit4]   2> 321068 T133 oasc.SolrResourceLoader.locateSolrHome using system property solr.solr.home: ../../../../../../../../../../../usr/home/jenkins/jenkins-slave/workspace/Lucene-Solr-NightlyTests-5.x/solr/build/solr-core/test/J3/temp/solr.cloud.CollectionsAPIDistributedZkTest-E85A8117DC3C9366-001/tempDir-004
   [junit4]   2> 321068 T133 oasc.SolrResourceLoader.<init> new SolrResourceLoader for directory: '../../../../../../../../../../../usr/home/jenkins/jenkins-slave/workspace/Lucene-Solr-NightlyTests-5.x/solr/build/solr-core/test/J3/temp/solr.cloud.CollectionsAPIDistributedZkTest-E85A8117DC3C9366-001/tempDir-004/'
   [junit4]   2> 321117 T133 oasc.ConfigSolr.fromFile Loading container configuration from /usr/home/jenkins/jenkins-slave/workspace/Lucene-Solr-NightlyTests-5.x/solr/build/solr-core/test/J3/../../../../../../../../../../../usr/home/jenkins/jenkins-slave/workspace/Lucene-Solr-NightlyTests-5.x/solr/build/solr-core/test/J3/temp/solr.cloud.CollectionsAPIDistributedZkTest-E85A8117DC3C9366-001/tempDir-004/solr.xml
   [junit4]   2> 321208 T133 oasc.CoreContainer.<init> New CoreContainer 1152564872
   [junit4]   2> 321208 T133 oasc.CoreContainer.load Loading cores into CoreContainer [instanceDir=../../../../../../../../../../../usr/home/jenkins/jenkins-slave/workspace/Lucene-Solr-NightlyTests-5.x/solr/build/solr-core/test/J3/temp/solr.cloud.CollectionsAPIDistributedZkTest-E85A8117DC3C9366-001/tempDir-004/]
   [junit4]   2> 321294 T133 oashc.HttpShardHandlerFactory.getParameter Setting socketTimeout to: 120000
   [junit4]   2> 321294 T133 oashc.HttpShardHandlerFactory.getParameter Setting urlScheme to: null
   [junit4]   2> 321295 T133 oashc.HttpShardHandlerFactory.getParameter Setting connTimeout to: 15000
   [junit4]   2> 321295 T133 oashc.HttpShardHandlerFactory.getParameter Setting maxConnectionsPerHost to: 20
   [junit4]   2> 321296 T133 oashc.HttpShardHandlerFactory.getParameter Setting maxConnections to: 10000
   [junit4]   2> 321296 T133 oashc.HttpShardHandlerFactory.getParameter Setting corePoolSize to: 0
   [junit4]   2> 321296 T133 oashc.HttpShardHandlerFactory.getParameter Setting maximumPoolSize to: 2147483647
   [junit4]   2> 321297 T133 oashc.HttpShardHandlerFactory.getParameter Setting maxThreadIdleTime to: 5
   [junit4]   2> 321297 T133 oashc.HttpShardHandlerFactory.getParameter Setting sizeOfQueue to: -1
   [junit4]   2> 321297 T133 oashc.HttpShardHandlerFactory.getParameter Setting fairnessPolicy to: false
   [junit4]   2> 321301 T133 oasu.UpdateShardHandler.<init> Creating UpdateShardHandler HTTP client with params: socketTimeout=3400000&connTimeout=45000&retry=false
   [junit4]   2> 321304 T133 oasl.LogWatcher.createWatcher SLF4J impl is org.slf4j.impl.Log4jLoggerFactory
   [junit4]   2> 321305 T133 oasl.LogWatcher.newRegisteredLogWatcher Registering Log Listener [Log4j (org.slf4j.impl.Log4jLoggerFactory)]
   [junit4]   2> 321305 T133 oasc.CoreContainer.load Host Name: 127.0.0.1
   [junit4]   2> 321306 T133 oasc.ZkContainer.initZooKeeper Zookeeper client=127.0.0.1:53551/solr
   [junit4]   2> 321306 T133 oasc.ZkController.checkChrootPath zkHost includes chroot
   [junit4]   2> 321307 T133 oascc.SolrZkClient.createZkCredentialsToAddAutomatically Using default ZkCredentialsProvider
   [junit4]   2> 321308 T133 oascc.ConnectionManager.waitForConnected Waiting for client to connect to ZooKeeper
   [junit4]   2> 321311 T200 oascc.ConnectionManager.process Watcher org.apache.solr.common.cloud.ConnectionManager@28e0db68 name:ZooKeeperConnection Watcher:127.0.0.1:53551 got event WatchedEvent state:SyncConnected type:None path:null path:null type:None
   [junit4]   2> 321312 T133 oascc.ConnectionManager.waitForConnected Client is connected to ZooKeeper
   [junit4]   2> 321313 T133 oascc.SolrZkClient.createZkACLProvider Using default ZkACLProvider
   [junit4]   2> 321317 T133 oascc.ConnectionManager.waitForConnected Waiting for client to connect to ZooKeeper
   [junit4]   2> 321320 T203 oascc.ConnectionManager.process Watcher org.apache.solr.common.cloud.ConnectionManager@36bd59d4 name:ZooKeeperConnection Watcher:127.0.0.1:53551/solr got event WatchedEvent state:SyncConnected type:None path:null path:null type:None
   [junit4]   2> 321320 T133 oascc.ConnectionManager.waitForConnected Client is connected to ZooKeeper
   [junit4]   2> 321332 T133 oascc.ZkStateReader.createClusterStateWatchersAndUpdate Updating cluster state from ZooKeeper... 
   [junit4]   2> 322341 T133 oasc.ZkController.createEphemeralLiveNode Register node as live in ZooKeeper:/live_nodes/127.0.0.1:27216_q_e%2Fo
   [junit4]   2> 322343 T133 oascc.SolrZkClient.makePath makePath: /live_nodes/127.0.0.1:27216_q_e%2Fo
   [junit4]   2> 322349 T133 oasc.Overseer.close Overseer (id=null) closing
   [junit4]   2> 322356 T133 oass.SolrDispatchFilter.init user.dir=/usr/home/jenkins/jenkins-slave/workspace/Lucene-Solr-NightlyTests-5.x/solr/build/solr-core/test/J3
   [junit4]   2> 322357 T133 oass.SolrDispatchFilter.init SolrDispatchFilter.init() done
   [junit4]   2> 324113 T133 oasc.AbstractFullDistribZkTestBase.createJettys create jetty 3
   [junit4]   2> 324114 T133 oejs.Server.doStart jetty-8.1.10.v20130312
   [junit4]   2> 324122 T133 oejus.SslContextFactory.doStart Enabled Protocols [SSLv2Hello, SSLv3, TLSv1, TLSv1.1, TLSv1.2] of [SSLv2Hello, SSLv3, TLSv1, TLSv1.1, TLSv1.2]
   [junit4]   2> 324126 T133 oejs.AbstractConnector.doStart Started SslSocketConnector@127.0.0.1:43361
   [junit4]   2> 324129 T133 oass.SolrDispatchFilter.init SolrDispatchFilter.init()sun.misc.Launcher$AppClassLoader@57bd06bf
   [junit4]   2> 324130 T133 oasc.SolrResourceLoader.locateSolrHome JNDI not configured for solr (NoInitialContextEx)
   [junit4]   2> 324130 T133 oasc.SolrResourceLoader.locateSolrHome using system property solr.solr.home: ../../../../../../../../../../../usr/home/jenkins/jenkins-slave/workspace/Lucene-Solr-NightlyTests-5.x/solr/build/solr-core/test/J3/temp/solr.cloud.CollectionsAPIDistributedZkTest-E85A8117DC3C9366-001/tempDir-005
   [junit4]   2> 324131 T133 oasc.SolrResourceLoader.<init> new SolrResourceLoader for directory: '../../../../../../../../../../../usr/home/jenkins/jenkins-slave/workspace/Lucene-Solr-NightlyTests-5.x/solr/build/solr-core/test/J3/temp/solr.cloud.CollectionsAPIDistributedZkTest-E85A8117DC3C9366-001/tempDir-005/'
   [junit4]   2> 324178 T133 oasc.ConfigSolr.fromFile Loading container configuration from /usr/home/jenkins/jenkins-slave/workspace/Lucene-Solr-NightlyTests-5.x/solr/build/solr-core/test/J3/../../../../../../../../../../../usr/home/jenkins/jenkins-slave/workspace/Lucene-Solr-NightlyTests-5.x/solr/build/solr-core/test/J3/temp/solr.cloud.CollectionsAPIDistributedZkTest-E85A8117DC3C9366-001/tempDir-005/solr.xml
   [junit4]   2> 324263 T133 oasc.CoreContainer.<init> New CoreContainer 1485702028
   [junit4]   2> 324263 T133 oasc.CoreContainer.load Loading cores into CoreContainer [instanceDir=../../../../../../../../../../../usr/home/jenkins/jenkins-slave/workspace/Lucene-Solr-NightlyTests-5.x/solr/build/solr-core/test/J3/temp/solr.cloud.CollectionsAPIDistributedZkTest-E85A8117DC3C9366-001/tempDir-005/]
   [junit4]   2> 324265 T133 oashc.HttpShardHandlerFactory.getParameter Setting socketTimeout to: 120000
   [junit4]   2> 324265 T133 oashc.HttpShardHandlerFactory.getParameter Setting urlScheme to: null
   [junit4]   2> 324265 T133 oashc.HttpShardHandlerFactory.getParameter Setting connTimeout to: 15000
   [junit4]   2> 324266 T133 oashc.HttpShardHandlerFactory.getParameter Setting maxConnectionsPerHost to: 20
   [junit4]   2> 324266 T133 oashc.HttpShardHandlerFactory.getParameter Setting maxConnections to: 10000
   [junit4]   2> 324266 T133 oashc.HttpShardHandlerFactory.getParameter Setting corePoolSize to: 0
   [junit4]   2> 324267 T133 oashc.HttpShardHandlerFactory.getParameter Setting maximumPoolSize to: 2147483647
   [junit4]   2> 324267 T133 oashc.HttpShardHandlerFactory.getParameter Setting maxThreadIdleTime to: 5
   [junit4]   2> 324268 T133 oashc.HttpShardHandlerFactory.getParameter Setting sizeOfQueue to: -1
   [junit4]   2> 324268 T133 oashc.HttpShardHandlerFactory.getParameter Setting fairnessPolicy to: false
   [junit4]   2> 324271 T133 oasu.UpdateShardHandler.<init> Creating UpdateShardHandler HTTP client with params: socketTimeout=3400000&connTimeout=45000&retry=false
   [junit4]   2> 324275 T133 oasl.LogWatcher.createWatcher SLF4J impl is org.slf4j.impl.Log4jLoggerFactory
   [junit4]   2> 324275 T133 oasl.LogWatcher.newRegisteredLogWatcher Registering Log Listener [Log4j (org.slf4j.impl.Log4jLoggerFactory)]
   [junit4]   2> 324275 T133 oasc.CoreContainer.load Host Name: 127.0.0.1
   [junit4]   2> 324276 T133 oasc.ZkContainer.initZooKeeper Zookeeper client=127.0.0.1:53551/solr
   [junit4]   2> 324276 T133 oasc.ZkController.checkChrootPath zkHost includes chroot
   [junit4]   2> 324276 T133 oascc.SolrZkClient.createZkCredentialsToAddAutomatically Using default ZkCredentialsProvider
   [junit4]   2> 324277 T133 oascc.ConnectionManager.waitForConnected Waiting for client to connect to ZooKeeper
   [junit4]   2> 324280 T216 oascc.ConnectionManager.process Watcher org.apache.solr.common.cloud.ConnectionManager@4d8c64bf name:ZooKeeperConnection Watcher:127.0.0.1:53551 got event WatchedEvent state:SyncConnected type:None path:null path:null type:None
   [junit4]   2> 324281 T133 oascc.ConnectionManager.waitForConnected Client is connected to ZooKeeper
   [junit4]   2> 324281 T133 oascc.SolrZkClient.createZkACLProvider Using default ZkACLProvider
   [junit4]   2> 324284 T133 oascc.ConnectionManager.waitForConnected Waiting for client to connect to ZooKeeper
   [junit4]   2> 324286 T219 oascc.ConnectionManager.process Watcher org.apache.solr.common.cloud.ConnectionManager@262f801d name:ZooKeeperConnection Watcher:127.0.0.1:53551/solr got event WatchedEvent state:SyncConnected type:None path:null path:null type:None
   [junit4]   2> 324286 T133 oascc.ConnectionManager.waitForConnected Client is connected to ZooKeeper
   [junit4]   2> 324297 T133 oascc.ZkStateReader.createClusterStateWatchersAndUpdate Updating cluster state from ZooKeeper... 
   [junit4]   2> 325307 T133 oasc.ZkController.createEphemeralLiveNode Register node as live in ZooKeeper:/live_nodes/127.0.0.1:43361_q_e%2Fo
   [junit4]   2> 325308 T133 oascc.SolrZkClient.makePath makePath: /live_nodes/127.0.0.1:43361_q_e%2Fo
   [junit4]   2> 325316 T133 oasc.Overseer.close Overseer (id=null) closing
   [junit4]   2> 325324 T133 oass.SolrDispatchFilter.init user.dir=/usr/home/jenkins/jenkins-slave/workspace/Lucene-Solr-NightlyTests-5.x/solr/build/solr-core/test/J3
   [junit4]   2> 325325 T133 oass.SolrDispatchFilter.init SolrDispatchFilter.init() done
   [junit4]   2> 327053 T133 oasc.AbstractFullDistribZkTestBase.createJettys create jetty 4
   [junit4]   2> 327054 T133 oejs.Server.doStart jetty-8.1.10.v20130312
   [junit4]   2> 327063 T133 oejus.SslContextFactory.doStart Enabled Protocols [SSLv2Hello, SSLv3, TLSv1, TLSv1.1, TLSv1.2] of [SSLv2Hello, SSLv3, TLSv1, TLSv1.1, TLSv1.2]
   [junit4]   2> 327066 T133 oejs.AbstractConnector.doStart Started SslSocketConnector@127.0.0.1:14149
   [junit4]   2> 327070 T133 oass.SolrDispatchFilter.init SolrDispatchFilter.init()sun.misc.Launcher$AppClassLoader@57bd06bf
   [junit4]   2> 327070 T133 oasc.SolrResourceLoader.locateSolrHome JNDI not configured for solr (NoInitialContextEx)
   [junit4]   2> 327070 T133 oasc.SolrResourceLoader.locateSolrHome using system property solr.solr.home: /usr/home/jenkins/jenkins-slave/workspace/Lucene-Solr-NightlyTests-5.x/solr/build/solr-core/test/J3/temp/solr.cloud.CollectionsAPIDistributedZkTest-E85A8117DC3C9366-001/tempDir-006
   [junit4]   2> 327071 T133 oasc.SolrResourceLoader.<init> new SolrResourceLoader for directory: '/usr/home/jenkins/jenkins-slave/workspace/Lucene-Solr-NightlyTests-5.x/solr/build/solr-core/test/J3/temp/solr.cloud.CollectionsAPIDistributedZkTest-E85A8117DC3C9366-001/tempDir-006/'
   [junit4]   2> 327119 T133 oasc.ConfigSolr.fromFile Loading container configuration from /usr/home/jenkins/jenkins-slave/workspace/Lucene-Solr-NightlyTests-5.x/solr/build/solr-core/test/J3/temp/solr.cloud.CollectionsAPIDistributedZkTest-E85A8117DC3C9366-001/tempDir-006/solr.xml
   [junit4]   2> 327203 T133 oasc.CoreContainer.<init> New CoreContainer 1831728068
   [junit4]   2> 327204 T133 oasc.CoreContainer.load Loading cores into CoreContainer [instanceDir=/usr/home/jenkins/jenkins-slave/workspace/Lucene-Solr-NightlyTests-5.x/solr/build/solr-core/test/J3/temp/solr.cloud.CollectionsAPIDistributedZkTest-E85A8117DC3C9366-001/tempDir-006/]
   [junit4]   2> 327205 T133 oashc.HttpShardHandlerFactory.getParameter Setting socketTimeout to: 120000
   [junit4]   2> 327205 T133 oashc.HttpShardHandlerFactory.getParameter Setting urlScheme to: null
   [junit4]   2> 327206 T133 oashc.HttpShardHandlerFactory.getParameter Setting connTimeout to: 15000
   [junit4]   2> 327206 T133 oashc.HttpShardHandlerFactory.getParameter Setting maxConnectionsPerHost to: 20
   [junit4]   2> 327206 T133 oashc.HttpShardHandlerFactory.getParameter Setting maxConnections to: 10000
   [junit4]   2> 327207 T133 oashc.HttpShardHandlerFactory.getParameter Setting corePoolSize to: 0
   [junit4]   2> 327207 T133 oashc.HttpShardHandlerFactory.getParameter Setting maximumPoolSize to: 2147483647
   [junit4]   2> 327208 T133 oashc.HttpShardHandlerFactory.getParameter Setting maxThreadIdleTime to: 5
   [junit4]   2> 327208 T133 oashc.HttpShardHandlerFactory.getParameter Setting sizeOfQueue to: -1
   [junit4]   2> 327208 T133 oashc.HttpShardHandlerFactory.getParameter Setting fairnessPolicy to: false
   [junit4]   2> 327212 T133 oasu.UpdateShardHandler.<init> Creating UpdateShardHandler HTTP client with params: socketTimeout=3400000&connTimeout=45000&retry=false
   [junit4]   2> 327215 T133 oasl.LogWatcher.createWatcher SLF4J impl is org.slf4j.impl.Log4jLoggerFactory
   [junit4]   2> 327216 T133 oasl.LogWatcher.newRegisteredLogWatcher Registering Log Listener [Log4j (org.slf4j.impl.Log4jLoggerFactory)]
   [junit4]   2> 327216 T133 oasc.CoreContainer.load Host Name: 127.0.0.1
   [junit4]   2> 327216 T133 oasc.ZkContainer.initZooKeeper Zookeeper client=127.0.0.1:53551/solr
   [junit4]   2> 327217 T133 oasc.ZkController.checkChrootPath zkHost includes chroot
   [junit4]   2> 327217 T133 oascc.SolrZkClient.createZkCredentialsToAddAutomatically Using default ZkCredentialsProvider
   [junit4]   2> 327218 T133 oascc.ConnectionManager.waitForConnected Waiting for client to connect to ZooKeeper
   [junit4]   2> 327220 T232 oascc.ConnectionManager.process Watcher org.apache.solr.common.cloud.ConnectionManager@3c720215 name:ZooKeeperConnection Watcher:127.0.0.1:53551 got event WatchedEvent state:SyncConnected type:None path:null path:null type:None
   [junit4]   2> 327221 T133 oascc.ConnectionManager.waitForConnected Client is connected to ZooKeeper
   [junit4]   2> 327221 T133 oascc.SolrZkClient.createZkACLProvider Using default ZkACLProvider
   [junit4]   2> 327224 T133 oascc.ConnectionManager.waitForConnected Waiting for client to connect to ZooKeeper
   [junit4]   2> 327226 T235 oascc.ConnectionManager.process Watcher org.apache.solr.common.cloud.ConnectionManager@554e3bde name:ZooKeeperConnection Watcher:127.0.0.1:53551/solr got event WatchedEvent state:SyncConnected type:None path:null path:null type:None
   [junit4]   2> 327226 T133 oascc.ConnectionManager.waitForConnected Client is connected to ZooKeeper
   [junit4]   2> 327234 T133 oascc.ZkStateReader.createClusterStateWatchersAndUpdate Updating cluster state from ZooKeeper... 
   [junit4]   2> 328241 T133 oasc.ZkController.createEphemeralLiveNode Register node as live in ZooKeeper:/live_nodes/127.0.0.1:14149_q_e%2Fo
   [junit4]   2> 328243 T133 oascc.SolrZkClient.makePath makePath: /live_nodes/127.0.0.1:14149_q_e%2Fo
   [junit4]   2> 328251 T133 oasc.Overseer.close Overseer (id=null) closing
   [junit4]   2> 328259 T133 oass.SolrDispatchFilter.init user.dir=/usr/home/jenkins/jenkins-slave/workspace/Lucene-Solr-NightlyTests-5.x/solr/build/solr-core/test/J3
   [junit4]   2> 328260 T133 oass.SolrDispatchFilter.init SolrDispatchFilter.init() done
   [junit4]   2> 328417 T176 oasha.CollectionsHandler.handleCreateAction Creating Collection : version=2&wt=javabin&name=nodes_used_collection&replicationFactor=2&numShards=2&action=CREATE
   [junit4]   2> 328420 T162 oasc.DistributedQueue$LatchWatcher.process NodeChildrenChanged fired on path /overseer/collection-queue-work state SyncConnected
   [junit4]   2> 328422 T164 oasc.OverseerCollectionProcessor.run Overseer Collection Processor: Get the message id:/overseer/collection-queue-work/qn-0000000000 message:{
   [junit4]   2> 	  "operation":"create",
   [junit4]   2> 	  "fromApi":"true",
   [junit4]   2> 	  "name":"nodes_used_collection",
   [junit4]   2> 	  "replicationFactor":"2",
   [junit4]   2> 	  "numShards":"2"}
   [junit4]   2> 328430 T238 oasc.OverseerCollectionProcessor.processMessage WARN OverseerCollectionProcessor.processMessage : create , {
   [junit4]   2> 	  "operation":"create",
   [junit4]   2> 	  "fromApi":"true",
   [junit4]   2> 	  "name":"nodes_used_collection",
   [junit4]   2> 	  "replicationFactor":"2",
   [junit4]   2> 	  "numShards":"2"}
   [junit4]   2> 328439 T238 oasc.OverseerCollectionProcessor.createConfNode Only one config set found in zk - using it:conf1
   [junit4]   2> 328439 T238 oasc.OverseerCollectionProcessor.createConfNode creating collections conf node /collections/nodes_used_collection 
   [junit4]   2> 328440 T238 oascc.SolrZkClient.makePath makePath: /collections/nodes_used_collection
   [junit4]   2> 328447 T162 oasc.DistributedQueue$LatchWatcher.process NodeChildrenChanged fired on path /overseer/queue state SyncConnected
   [junit4]   2> 328450 T163 oasc.Overseer$ClusterStateUpdater.run processMessage: queueSize: 1, message = {
   [junit4]   2> 	  "operation":"create",
   [junit4]   2> 	  "fromApi":"true",
   [junit4]   2> 	  "name":"nodes_used_collection",
   [junit4]   2> 	  "replicationFactor":"2",
   [junit4]   2> 	  "numShards":"2"} current state version: 1
   [junit4]   2> 328450 T163 oasco.ClusterStateMutator.createCollection building a new cName: nodes_used_collection
   [junit4]   2> 328453 T187 oascc.ZkStateReader$2.process A cluster state change: WatchedEvent state:SyncConnected type:NodeDataChanged path:/clusterstate.json, has occurred - updating... (live nodes size: 5)
   [junit4]   2> 328454 T162 oascc.ZkStateReader$2.process A cluster state change: WatchedEvent state:SyncConnected type:NodeDataChanged path:/clusterstate.json, has occurred - updating... (live nodes size: 5)
   [junit4]   2> 328454 T169 oascc.ZkStateReader$2.process A cluster state change: WatchedEvent state:SyncConnected type:NodeDataChanged path:/clusterstate.json, has occurred - updating... (live nodes size: 5)
   [junit4]   2> 328454 T219 oascc.ZkStateReader$2.process A cluster state change: WatchedEvent state:SyncConnected type:NodeDataChanged path:/clusterstate.json, has occurred - updating... (live nodes size: 5)
   [junit4]   2> 328454 T203 oascc.ZkStateReader$2.process A cluster state change: WatchedEvent state:SyncConnected type:NodeDataChanged path:/clusterstate.json, has occurred - updating... (live nodes size: 5)
   [junit4]   2> 328453 T235 oascc.ZkStateReader$2.process A cluster state change: WatchedEvent state:SyncConnected type:NodeDataChanged path:/clusterstate.json, has occurred - updating... (live nodes size: 5)
   [junit4]   2> 328649 T238 oasc.OverseerCollectionProcessor.createCollection Creating SolrCores for new collection nodes_used_collection, shardNames [shard1, shard2] , replicationFactor : 2
   [junit4]   2> 328650 T238 oasc.OverseerCollectionProcessor.createCollection Creating shard nodes_used_collection_shard1_replica1 as part of slice shard1 of collection nodes_used_collection on 127.0.0.1:43361_q_e%2Fo
   [junit4]   2> 328674 T238 oasc.OverseerCollectionProcessor.createCollection Creating shard nodes_used_collection_shard1_replica2 as part of slice shard1 of collection nodes_used_collection on 127.0.0.1:62231_q_e%2Fo
   [junit4]   2> 328676 T238 oasc.OverseerCollectionProcessor.createCollection Creating shard nodes_used_collection_shard2_replica1 as part of slice shard2 of collection nodes_used_collection on 127.0.0.1:27216_q_e%2Fo
   [junit4]   2> 328678 T238 oasc.OverseerCollectionProcessor.createCollection Creating shard nodes_used_collection_shard2_replica2 as part of slice shard2 of collection nodes_used_collection on 127.0.0.1:14149_q_e%2Fo
   [junit4]   2> 328824 T197 oasha.CoreAdminHandler.handleCreateAction core create command version=2&wt=javabin&name=nodes_used_collection_shard2_replica1&qt=/admin/cores&numShards=2&action=CREATE&collection.configName=conf1&collection=nodes_used_collection&shard=shard2
   [junit4]   2> 328825 T175 oasha.CoreAdminHandler.handleCreateAction core create command version=2&wt=javabin&name=nodes_used_collection_shard1_replica2&qt=/admin/cores&numShards=2&action=CREATE&collection.configName=conf1&collection=nodes_used_collection&shard=shard1
   [junit4]   2> 328826 T208 oasha.CoreAdminHandler.handleCreateAction core create command version=2&wt=javabin&name=nodes_used_collection_shard1_replica1&qt=/admin/cores&numShards=2&action=CREATE&collection.configName=conf1&collection=nodes_used_collection&shard=shard1
   [junit4]   2> 328836 T225 oasha.CoreAdminHandler.handleCreateAction core create command version=2&wt=javabin&name=nodes_used_collection_shard2_replica2&qt=/admin/cores&numShards=2&action=CREATE&collection.configName=conf1&collection=nodes_used_collection&shard=shard2
   [junit4]   2> 328837 T208 oasc.ZkController.publish publishing core=nodes_used_collection_shard1_replica1 state=down collection=nodes_used_collection
   [junit4]   2> 328837 T175 oasc.ZkController.publish publishing core=nodes_used_collection_shard1_replica2 state=down collection=nodes_used_collection
   [junit4]   2> 328836 T197 oasc.ZkController.publish publishing core=nodes_used_collection_shard2_replica1 state=down collection=nodes_used_collection
   [junit4]   2> 328840 T225 oasc.ZkController.publish publishing core=nodes_used_collection_shard2_replica2 state=down collection=nodes_used_collection
   [junit4]   2> 328846 T162 oasc.DistributedQueue$LatchWatcher.process NodeChildrenChanged fired on path /overseer/queue state SyncConnected
   [junit4]   2> 328846 T175 oasc.ZkController.waitForCoreNodeName look for our core node name
   [junit4]   2> 328846 T208 oasc.ZkController.waitForCoreNodeName look for our core node name
   [junit4]   2> 328846 T197 oasc.ZkController.waitForCoreNodeName look for our core node name
   [junit4]   2> 328847 T225 oasc.ZkController.waitForCoreNodeName look for our core node name
   [junit4]   2> 328848 T163 oasc.Overseer$ClusterStateUpdater.run processMessage: queueSize: 4, message = {
   [junit4]   2> 	  "node_name":"127.0.0.1:62231_q_e%2Fo",
   [junit4]   2> 	  "base_url":"https://127.0.0.1:62231/q_e/o",
   [junit4]   2> 	  "numShards":"2",
   [junit4]   2> 	  "roles":null,
   [junit4]   2> 	  "core":"nodes_used_collection_shard1_replica2",
   [junit4]   2> 	  "state":"down",
   [junit4]   2> 	  "collection":"nodes_used_collection",
   [junit4]   2> 	  "operation":"state",
   [junit4]   2> 	  "shard":"shard1"} current state version: 2
   [junit4]   2> 328864 T163 oasco.ReplicaMutator.updateState Update state numShards=2 message={
   [junit4]   2> 	  "node_name":"127.0.0.1:62231_q_e%2Fo",
   [junit4]   2> 	  "base_url":"https://127.0.0.1:62231/q_e/o",
   [junit4]   2> 	  "numShards":"2",
   [junit4]   2> 	  "roles":null,
   [junit4]   2> 	  "core":"nodes_used_collection_shard1_replica2",
   [junit4]   2> 	  "state":"down",
   [junit4]   2> 	  "collection":"nodes_used_collection",
   [junit4]   2> 	  "operation":"state",
   [junit4]   2> 	  "shard":"shard1"}
   [junit4]   2> 328874 T163 oasc.Overseer$ClusterStateUpdater.run processMessage: queueSize: 3, message = {
   [junit4]   2> 	  "node_name":"127.0.0.1:27216_q_e%2Fo",
   [junit4]   2> 	  "base_url":"https://127.0.0.1:27216/q_e/o",
   [junit4]   2> 	  "numShards":"2",
   [junit4]   2> 	  "roles":null,
   [junit4]   2> 	  "core":"nodes_used_collection_shard2_replica1",
   [junit4]   2> 	  "state":"down",
   [junit4]   2> 	  "collection":"nodes_used_collection",
   [junit4]   2> 	  "operation":"state",
   [junit4]   2> 	  "shard":"shard2"} current state version: 2
   [junit4]   2> 328876 T163 oasco.ReplicaMutator.updateState Update state numShards=2 message={
   [junit4]   2> 	  "node_name":"127.0.0.1:27216_q_e%2Fo",
   [junit4]   2> 	  "base_url":"https://127.0.0.1:27216/q_e/o",
   [junit4]   2> 	  "numShards":"2",
   [junit4]   2> 	  "roles":null,
   [junit4]   2> 	  "core":"nodes_used_collection_shard2_replica1",
   [junit4]   2> 	  "state":"down",
   [junit4]   2> 	  "collection":"nodes_used_collection",
   [junit4]   2> 	  "operation":"state",
   [junit4]   2> 	  "shard":"shard2"}
   [junit4]   2> 328879 T162 oasc.DistributedQueue$LatchWatcher.process NodeChildrenChanged fired on path /overseer/queue state SyncConnected
   [junit4]   2> 328880 T163 oasc.Overseer$ClusterStateUpdater.run processMessage: queueSize: 3, message = {
   [junit4]   2> 	  "node_name":"127.0.0.1:43361_q_e%2Fo",
   [junit4]   2> 	  "base_url":"https://127.0.0.1:43361/q_e/o",
   [junit4]   2> 	  "numShards":"2",
   [junit4]   2> 	  "roles":null,
   [junit4]   2> 	  "core":"nodes_used_collection_shard1_replica1",
   [junit4]   2> 	  "state":"down",
   [junit4]   2> 	  "collection":"nodes_used_collection",
   [junit4]   2> 	  "operation":"state",
   [junit4]   2> 	  "shard":"shard1"} current state version: 2
   [junit4]   2> 328881 T163 oasco.ReplicaMutator.updateState Update state numShards=2 message={
   [junit4]   2> 	  "node_name":"127.0.0.1:43361_q_e%2Fo",
   [junit4]   2> 	  "base_url":"https://127.0.0.1:43361/q_e/o",
   [junit4]   2> 	  "numShards":"2",
   [junit4]   2> 	  "roles":null,
   [junit4]   2> 	  "core":"nodes_used_collection_shard1_replica1",
   [junit4]   2> 	  "state":"down",
   [junit4]   2> 	  "collection":"nodes_used_collection",
   [junit4]   2> 	  "operation":"state",
   [junit4]   2> 	  "shard":"shard1"}
   [junit4]   2> 328885 T163 oasc.Overseer$ClusterStateUpdater.run processMessage: queueSize: 1, message = {
   [junit4]   2> 	  "node_name":"127.0.0.1:14149_q_e%2Fo",
   [junit4]   2> 	  "base_url":"https://127.0.0.1:14149/q_e/o",
   [junit4]   2> 	  "numShards":"2",
   [junit4]   2> 	  "roles":null,
   [junit4]   2> 	  "core":"nodes_used_collection_shard2_replica2",
   [junit4]   2> 	  "state":"down",
   [junit4]   2> 	  "collection":"nodes_used_collection",
   [junit4]   2> 	  "operation":"state",
   [junit4]   2> 	  "shard":"shard2"} current state version: 2
   [junit4]   2> 328886 T163 oasco.ReplicaMutator.updateState Update state numShards=2 message={
   [junit4]   2> 	  "node_name":"127.0.0.1:14149_q_e%2Fo",
   [junit4]   2> 	  "base_url":"https://127.0.0.1:14149/q_e/o",
   [junit4]   2> 	  "numShards":"2",
   [junit4]   2> 	  "roles":null,
   [junit4]   2> 	  "core":"nodes_used_collection_shard2_replica2",
   [junit4]   2> 	  "state":"down",
   [junit4]   2> 	  "collection":"nodes_used_collection",
   [junit4]   2> 	  "operation":"state",
   [junit4]   2> 	  "shard":"shard2"}
   [junit4]   2> 328889 T162 oasc.DistributedQueue$LatchWatcher.process NodeChildrenChanged fired on path /overseer/queue state SyncConnected
   [junit4]   2> 328891 T235 oascc.ZkStateReader$2.process A cluster state change: WatchedEvent state:SyncConnected type:NodeDataChanged path:/clusterstate.json, has occurred - updating... (live nodes size: 5)
   [junit4]   2> 328891 T162 oascc.ZkStateReader$2.process A cluster state change: WatchedEvent state:SyncConnected type:NodeDataChanged path:/clusterstate.json, has occurred - updating... (live nodes size: 5)
   [junit4]   2> 328891 T203 oascc.ZkStateReader$2.process A cluster state change: WatchedEvent state:SyncConnected type:NodeDataChanged path:/clusterstate.json, has occurred - updating... (live nodes size: 5)
   [junit4]   2> 328891 T169 oascc.ZkStateReader$2.process A cluster state change: WatchedEvent state:SyncConnected type:NodeDataChanged path:/clusterstate.json, has occurred - updating... (live nodes size: 5)
   [junit4]   2> 328891 T219 oascc.ZkStateReader$2.process A cluster state change: WatchedEvent state:SyncConnected type:NodeDataChanged path:/clusterstate.json, has occurred - updating... (live nodes size: 5)
   [junit4]   2> 328891 T187 oascc.ZkStateReader$2.process A cluster state change: WatchedEvent state:SyncConnected type:NodeDataChanged path:/clusterstate.json, has occurred - updating... (live nodes size: 5)
   [junit4]   2> 329848 T197 oasc.ZkController.waitForShardId waiting to find shard id in clusterstate for nodes_used_collection_shard2_replica1
   [junit4]   2> 329848 T208 oasc.ZkController.waitForShardId waiting to find shard id in clusterstate for nodes_used_collection_shard1_replica1
   [junit4]   2> 329848 T225 oasc.ZkController.waitForShardId waiting to find shard id in clusterstate for nodes_used_collection_shard2_replica2
   [junit4]   2> 329848 T175 oasc.ZkController.waitForShardId waiting to find shard id in clusterstate for nodes_used_collection_shard1_replica2
   [junit4]   2> 329849 T225 oasc.ZkController.createCollectionZkNode Check for collection zkNode:nodes_used_collection
   [junit4]   2> 329849 T208 oasc.ZkController.createCollectionZkNode Check for collection zkNode:nodes_used_collection
   [junit4]   2> 329848 T197 oasc.ZkController.createCollectionZkNode Check for collection zkNode:nodes_used_collection
   [junit4]   2> 329850 T225 oasc.ZkController.createCollectionZkNode Collection zkNode exists
   [junit4]   2> 329849 T175 oasc.ZkController.createCollectionZkNode Check for collection zkNode:nodes_used_collection
   [junit4]   2> 329851 T197 oasc.ZkController.createCollectionZkNode Collection zkNode exists
   [junit4]   2> 329851 T225 oascc.ZkStateReader.readConfigName Load collection config from:/collections/nodes_used_collection
   [junit4]   2> 329851 T208 oasc.ZkController.createCollectionZkNode Collection zkNode exists
   [junit4]   2> 329853 T208 oascc.ZkStateReader.readConfigName Load collection config from:/collections/nodes_used_collection
   [junit4]   2> 329852 T175 oasc.ZkController.createCollectionZkNode Collection zkNode exists
   [junit4]   2> 329853 T175 oascc.ZkStateReader.readConfigName Load collection config from:/collections/nodes_used_collection
   [junit4]   2> 329852 T197 oascc.ZkStateReader.readConfigName Load collection config from:/collections/nodes_used_collection
   [junit4]   2> 329854 T208 oascc.ZkStateReader.readConfigName path=/collections/nodes_used_collection configName=conf1 specified config exists in ZooKeeper
   [junit4]   2> 329853 T225 oascc.ZkStateReader.readConfigName path=/collections/nodes_used_collection configName=conf1 specified config exists in ZooKeeper
   [junit4]   2> 329855 T208 oasc.SolrResourceLoader.<init> new SolrResourceLoader for directory: '../../../../../../../../../../../usr/home/jenkins/jenkins-slave/workspace/Lucene-Solr-NightlyTests-5.x/solr/build/solr-core/test/J3/temp/solr.cloud.CollectionsAPIDistributedZkTest-E85A8117DC3C9366-001/tempDir-005/nodes_used_collection_shard1_replica1/'
   [junit4]   2> 329855 T197 oascc.ZkStateReader.readConfigName path=/collections/nodes_used_collection configName=conf1 specified config exists in ZooKeeper
   [junit4]   2> 329855 T175 oascc.ZkStateReader.readConfigName path=/collections/nodes_used_collection configName=conf1 specified config exists in ZooKeeper
   [junit4]   2> 329855 T225 oasc.SolrResourceLoader.<init> new SolrResourceLoader for directory: '/usr/home/jenkins/jenkins-slave/workspace/Lucene-Solr-NightlyTests-5.x/solr/build/solr-core/test/J3/temp/solr.cloud.CollectionsAPIDistributedZkTest-E85A8117DC3C9366-001/tempDir-006/nodes_used_collection_shard2_replica2/'
   [junit4]   2> 329856 T175 oasc.SolrResourceLoader.<init> new SolrResourceLoader for directory: '../../../../../../../../../../../usr/home/jenkins/jenkins-slave/workspace/Lucene-Solr-NightlyTests-5.x/solr/build/solr-core/test/J3/temp/solr.cloud.CollectionsAPIDistributedZkTest-E85A8117DC3C9366-001/tempDir-003/nodes_used_collection_shard1_replica2/'
   [junit4]   2> 329856 T197 oasc.SolrResourceLoader.<init> new SolrResourceLoader for directory: '../../../../../../../../../../../usr/home/jenkins/jenkins-slave/workspace/Lucene-Solr-NightlyTests-5.x/solr/build/solr-core/test/J3/temp/solr.cloud.CollectionsAPIDistributedZkTest-E85A8117DC3C9366-001/tempDir-004/nodes_used_collection_shard2_replica1/'
   [junit4]   2> 329915 T208 oasc.ZkController.watchZKConfDir watch zkdir /configs/conf1
   [junit4]   2> 329917 T225 oasc.ZkController.watchZKConfDir watch zkdir /configs/conf1
   [junit4]   2> 329922 T197 oasc.ZkController.watchZKConfDir watch zkdir /configs/conf1
   [junit4]   2> 329928 T175 oasc.ZkController.watchZKConfDir watch zkdir /configs/conf1
   [junit4]   2> 329957 T225 oasc.Config.<init> loaded config solrconfig.xml with version 0 
   [junit4]   2> 329957 T208 oasc.Config.<init> loaded config solrconfig.xml with version 0 
   [junit4]   2> 329958 T175 oasc.Config.<init> loaded config solrconfig.xml with version 0 
   [junit4]   2> 329958 T197 oasc.Config.<init> loaded config solrconfig.xml with version 0 
   [junit4]   2> 330020 T175 oasc.SolrConfig.refreshRequestParams current version of requestparams : -1
   [junit4]   2> 330021 T225 oasc.SolrConfig.refreshRequestParams current version of requestparams : -1
   [junit4]   2> 330021 T197 oasc.SolrConfig.refreshRequestParams current version of requestparams : -1
   [junit4]   2> 330020 T208 oasc.SolrConfig.refreshRequestParams current version of requestparams : -1
   [junit4]   2> 330085 T225 oasc.SolrConfig.<init> Using Lucene MatchVersion: 5.0.0
   [junit4]   2> 330086 T208 oasc.SolrConfig.<init> Using Lucene MatchVersion: 5.0.0
   [junit4]   2> 330087 T175 oasc.SolrConfig.<init> Using Lucene MatchVersion: 5.0.0
   [junit4]   2> 330089 T197 oasc.SolrConfig.<init> Using Lucene MatchVersion: 5.0.0
   [junit4]   2> 330152 T208 oasc.SolrConfig.<init> Loaded SolrConfig: solrconfig.xml
   [junit4]   2> 330155 T175 oasc.SolrConfig.<init> Loaded SolrConfig: solrconfig.xml
   [junit4]   2> 330155 T225 oasc.SolrConfig.<init> Loaded SolrConfig: solrconfig.xml
   [junit4]   2> 330157 T197 oasc.SolrConfig.<init> Loaded SolrConfig: solrconfig.xml
   [junit4]   2> 330253 T208 oass.IndexSchema.readSchema Reading Solr Schema from /configs/conf1/schema.xml
   [junit4]   2> 330256 T175 oass.IndexSchema.readSchema Reading Solr Schema from /configs/conf1/schema.xml
   [junit4]   2> 330257 T225 oass.IndexSchema.readSchema Reading Solr Schema from /configs/conf1/schema.xml
   [junit4]   2> 330258 T197 oass.IndexSchema.readSchema Reading Solr Schema from /configs/conf1/schema.xml
   [junit4]   2> 330282 T208 oass.IndexSchema.readSchema [nodes_used_collection_shard1_replica1] Schema name=test
   [junit4]   2> 330286 T175 oass.IndexSchema.readSchema [nodes_used_collection_shard1_replica2] Schema name=test
   [junit4]   2> 330288 T225 oass.IndexSchema.readSchema [nodes_used_collection_shard2_replica2] Schema name=test
   [junit4]   2> 330289 T197 oass.IndexSchema.readSchema [nodes_used_collection_shard2_replica1] Schema name=test
   [junit4]   2> 331087 T175 oass.OpenExchangeRatesOrgProvider.init Initialized with rates=open-exchange-rates.json, refreshInterval=1440.
   [junit4]   2> 331097 T208 oass.OpenExchangeRatesOrgProvider.init Initialized with rates=open-exchange-rates.json, refreshInterval=1440.
   [junit4]   2> 331104 T197 oass.OpenExchangeRatesOrgProvider.init Initialized with rates=open-exchange-rates.json, refreshInterval=1440.
   [junit4]   2> 331108 T225 oass.OpenExchangeRatesOrgProvider.init Initialized with rates=open-exchange-rates.json, refreshInterval=1440.
   [junit4]   2> 331112 T175 oass.IndexSchema.readSchema default search field in schema is text
   [junit4]   2> 331112 T208 oass.IndexSchema.readSchema default search field in schema is text
   [junit4]   2> 331115 T175 oass.IndexSchema.readSchema unique key field: id
   [junit4]   2> 331116 T208 oass.IndexSchema.readSchema unique key field: id
   [junit4]   2> 331116 T197 oass.IndexSchema.readSchema default search field in schema is text
   [junit4]   2> 331120 T197 oass.IndexSchema.readSchema unique key field: id
   [junit4]   2> 331126 T225 oass.IndexSchema.readSchema default search field in schema is text
   [junit4]   2> 331131 T225 oass.IndexSchema.readSchema unique key field: id
   [junit4]   2> 331143 T208 oass.FileExchangeRateProvider.reload Reloading exchange rates from file currency.xml
   [junit4]   2> 331144 T175 oass.FileExchangeRateProvider.reload Reloading exchange rates from file currency.xml
   [junit4]   2> 331148 T197 oass.FileExchangeRateProvider.reload Reloading exchange rates from file currency.xml
   [junit4]   2> 331150 T208 oass.FileExchangeRateProvider.reload Reloading exchange rates from file currency.xml
   [junit4]   2> 331150 T175 oass.FileExchangeRateProvider.reload Reloading exchange rates from file currency.xml
   [junit4]   2> 331155 T197 oass.FileExchangeRateProvider.reload Reloading exchange rates from file currency.xml
   [junit4]   2> 331156 T208 oass.OpenExchangeRatesOrgProvider.reload Reloading exchange rates from open-exchange-rates.json
   [junit4]   2> 331156 T175 oass.OpenExchangeRatesOrgProvider.reload Reloading exchange rates from open-exchange-rates.json
   [junit4]   2> 331157 T208 oass.OpenExchangeRatesOrgProvider$OpenExchangeRates.<init> WARN Unknown key IMPORTANT NOTE
   [junit4]   2> 331159 T208 oass.OpenExchangeRatesOrgProvider$OpenExchangeRates.<init> WARN Expected key, got STRING
   [junit4]   2> 331159 T175 oass.OpenExchangeRatesOrgProvider$OpenExchangeRates.<init> WARN Unknown key IMPORTANT NOTE
   [junit4]   2> 331159 T208 oass.OpenExchangeRatesOrgProvider.reload Reloading exchange rates from open-exchange-rates.json
   [junit4]   2> 331160 T225 oass.FileExchangeRateProvider.reload Reloading exchange rates from file currency.xml
   [junit4]   2> 331160 T175 oass.OpenExchangeRatesOrgProvider$OpenExchangeRates.<init> WARN Expected key, got STRING
   [junit4]   2> 331161 T208 oass.OpenExchangeRatesOrgProvider$OpenExchangeRates.<init> WARN Unknown key IMPORTANT NOTE
   [junit4]   2> 331161 T175 oass.OpenExchangeRatesOrgProvider.reload Reloading exchange rates from open-exchange-rates.json
   [junit4]   2> 331161 T208 oass.OpenExchangeRatesOrgProvider$OpenExchangeRates.<init> WARN Expected key, got STRING
   [junit4]   2> 331162 T197 oass.OpenExchangeRatesOrgProvider.reload Reloading exchange rates from open-exchange-rates.json
   [junit4]   2> 331162 T208 oasc.CoreContainer.create Creating SolrCore 'nodes_used_collection_shard1_replica1' using configuration from collection nodes_used_collection
   [junit4]   2> 331163 T175 oass.OpenExchangeRatesOrgProvider$OpenExchangeRates.<init> WARN Unknown key IMPORTANT NOTE
   [junit4]   2> 331163 T208 oasc.SolrCore.initDirectoryFactory org.apache.solr.core.MockDirectoryFactory
   [junit4]   2> 331164 T175 oass.OpenExchangeRatesOrgProvider$OpenExchangeRates.<init> WARN Expected key, got STRING
   [junit4]   2> 331164 T208 oasc.SolrCore.<init> [nodes_used_collection_shard1_replica1] Opening new SolrCore at ../../../../../../../../../../../usr/home/jenkins/jenkins-slave/workspace/Lucene-Solr-NightlyTests-5.x/solr/build/solr-core/test/J3/temp/solr.cloud.CollectionsAPIDistributedZkTest-E85A8117DC3C9366-001/tempDir-005/nodes_used_collection_shard1_replica1/, dataDir=/usr/home/jenkins/jenkins-slave/workspace/Lucene-Solr-NightlyTests-5.x/solr/build/solr-core/test/J3/../../../../../../../../../../../usr/home/jenkins/jenkins-slave/workspace/Lucene-Solr-NightlyTests-5.x/solr/build/solr-core/test/J3/temp/solr.cloud.CollectionsAPIDistributedZkTest-E85A8117DC3C9366-001/tempDir-005/nodes_used_collection_shard1_replica1/data/
   [junit4]   2> 331164 T175 oasc.CoreContainer.create Creating SolrCore 'nodes_used_collection_shard1_replica2' using configuration from collection nodes_used_collection
   [junit4]   2> 331166 T197 oass.OpenExchangeRatesOrgProvider$OpenExchangeRates.<init> WARN Unknown key IMPORTANT NOTE
   [junit4]   2> 331166 T197 oass.OpenExchangeRatesOrgProvider$OpenExchangeRates.<init> WARN Expected key, got STRING
   [junit4]   2> 331166 T208 oasc.JmxMonitoredMap.<init> JMX monitoring is enabled. Adding Solr mbeans to JMX Server: com.sun.jmx.mbeanserver.JmxMBeanServer@51983697
   [junit4]   2> 331166 T197 oass.OpenExchangeRatesOrgProvider.reload Reloading exchange rates from open-exchange-rates.json
   [junit4]   2> 331166 T175 oasc.SolrCore.initDirectoryFactory org.apache.solr.core.MockDirectoryFactory
   [junit4]   2> 331167 T225 oass.FileExchangeRateProvider.reload Reloading exchange rates from file currency.xml
   [junit4]   2> 331168 T175 oasc.SolrCore.<init> [nodes_used_collection_shard1_replica2] Opening new SolrCore at ../../../../../../../../../../../usr/home/jenkins/jenkins-slave/workspace/Lucene-Solr-NightlyTests-5.x/solr/build/solr-core/test/J3/temp/solr.cloud.CollectionsAPIDistributedZkTest-E85A8117DC3C9366-001/tempDir-003/nodes_used_collection_shard1_replica2/, dataDir=/usr/home/jenkins/jenkins-slave/workspace/Lucene-Solr-NightlyTests-5.x/solr/build/solr-core/test/J3/../../../../../../../../../../../usr/home/jenkins/jenkins-slave/workspace/Lucene-Solr-NightlyTests-5.x/solr/build/solr-core/test/J3/temp/solr.cloud.CollectionsAPIDistributedZkTest-E85A8117DC3C9366-001/tempDir-003/nodes_used_collection_shard1_replica2/data/
   [junit4]   2> 331168 T197 oass.OpenExchangeRatesOrgProvider$OpenExchangeRates.<init> WARN Unknown key IMPORTANT NOTE
   [junit4]   2> 331169 T175 oasc.JmxMonitoredMap.<init> JMX monitoring is enabled. Adding Solr mbeans to JMX Server: com.sun.jmx.mbeanserver.JmxMBeanServer@51983697
   [junit4]   2> 331169 T197 oass.OpenExchangeRatesOrgProvider$OpenExchangeRates.<init> WARN Expected key, got STRING
   [junit4]   2> 331170 T197 oasc.CoreContainer.create Creating SolrCore 'nodes_used_collection_shard2_replica1' using configuration from collection nodes_used_collection
   [junit4]   2> 331170 T197 oasc.SolrCore.initDirectoryFactory org.apache.solr.core.MockDirectoryFactory
   [junit4]   2> 331171 T197 oasc.SolrCore.<init> [nodes_used_collection_shard2_replica1] Opening new SolrCore at ../../../../../../../../../../../usr/home/jenkins/jenkins-slave/workspace/Lucene-Solr-NightlyTests-5.x/solr/build/solr-core/test/J3/temp/solr.cloud.CollectionsAPIDistributedZkTest-E85A8117DC3C9366-001/tempDir-004/nodes_used_collection_shard2_replica1/, dataDir=/usr/home/jenkins/jenkins-slave/workspace/Lucene-Solr-NightlyTests-5.x/solr/build/solr-core/test/J3/../../../../../../../../../../../usr/home/jenkins/jenkins-slave/workspace/Lucene-Solr-NightlyTests-5.x/solr/build/solr-core/test/J3/temp/solr.cloud.CollectionsAPIDistributedZkTest-E85A8117DC3C9366-001/tempDir-004/nodes_used_collection_shard2_replica1/data/
   [junit4]   2> 331171 T197 oasc.JmxMonitoredMap.<init> JMX monitoring is enabled. Adding Solr mbeans to JMX Server: com.sun.jmx.mbeanserver.JmxMBeanServer@51983697
   [junit4]   2> 331173 T225 oass.OpenExchangeRatesOrgProvider.reload Reloading exchange rates from open-exchange-rates.json
   [junit4]   2> 331174 T225 oass.OpenExchangeRatesOrgProvider$OpenExchangeRates.<init> WARN Unknown key IMPORTANT NOTE
   [junit4]   2> 331175 T225 oass.OpenExchangeRatesOrgProvider$OpenExchangeRates.<init> WARN Expected key, got STRING
   [junit4]   2> 331175 T225 oass.OpenExchangeRatesOrgProvider.reload Reloading exchange rates from open-exchange-rates.json
   [junit4]   2> 331176 T225 oass.OpenExchangeRatesOrgProvider$OpenExchangeRates.<init> WARN Unknown key IMPORTANT NOTE
   [junit4]   2> 331176 T225 oass.OpenExchangeRatesOrgProvider$OpenExchangeRates.<init> WARN Expected key, got STRING
   [junit4]   2> 331177 T225 oasc.CoreContainer.create Creating SolrCore 'nodes_used_collection_shard2_replica2' using configuration from collection nodes_used_collection
   [junit4]   2> 331177 T225 oasc.SolrCore.initDirectoryFactory org.apache.solr.core.MockDirectoryFactory
   [junit4]   2> 331178 T225 oasc.SolrCore.<init> [nodes_used_collection_shard2_replica2] Opening new SolrCore at /usr/home/jenkins/jenkins-slave/workspace/Lucene-Solr-NightlyTests-5.x/solr/build/solr-core/test/J3/temp/solr.cloud.CollectionsAPIDistributedZkTest-E85A8117DC3C9366-001/tempDir-006/nodes_used_collection_shard2_replica2/, dataDir=/usr/home/jenkins/jenkins-slave/workspace/Lucene-Solr-NightlyTests-5.x/solr/build/solr-core/test/J3/temp/solr.cloud.CollectionsAPIDistributedZkTest-E85A8117DC3C9366-001/tempDir-006/nodes_used_collection_shard2_replica2/data/
   [junit4]   2> 331178 T225 oasc.JmxMonitoredMap.<init> JMX monitoring is enabled. Adding Solr mbeans to JMX Server: com.sun.jmx.mbeanserver.JmxMBeanServer@51983697
   [junit4]   2> 331185 T225 oasc.CachingDirectoryFactory.get return new directory for /usr/home/jenkins/jenkins-slave/workspace/Lucene-Solr-NightlyTests-5.x/solr/build/solr-core/test/J3/temp/solr.cloud.CollectionsAPIDistributedZkTest-E85A8117DC3C9366-001/tempDir-006/nodes_used_collection_shard2_replica2/data
   [junit4]   2> 331186 T225 oasc.SolrCore.getNewIndexDir New index directory detected: old=null new=/usr/home/jenkins/jenkins-slave/workspace/Lucene-Solr-NightlyTests-5.x/solr/build/solr-core/test/J3/temp/solr.cloud.CollectionsAPIDistributedZkTest-E85A8117DC3C9366-001/tempDir-006/nodes_used_collection_shard2_replica2/data/index/
   [junit4]   2> 331186 T208 oasc.CachingDirectoryFactory.get return new directory for /usr/home/jenkins/jenkins-slave/workspace/Lucene-Solr-NightlyTests-5.x/solr/build/solr-core/test/J3/../../../../../../../../../../../usr/home/jenkins/jenkins-slave/workspace/Lucene-Solr-NightlyTests-5.x/solr/build/solr-core/test/J3/temp/solr.cloud.CollectionsAPIDistributedZkTest-E85A8117DC3C9366-001/tempDir-005/nodes_used_collection_shard1_replica1/data
   [junit4]   2> 331187 T175 oasc.CachingDirectoryFactory.get return new directory for /usr/home/jenkins/jenkins-slave/workspace/Lucene-Solr-NightlyTests-5.x/solr/build/solr-core/test/J3/../../../../../../../../../../../usr/home/jenkins/jenkins-slave/workspace/Lucene-Solr-NightlyTests-5.x/solr/build/solr-core/test/J3/temp/solr.cloud.CollectionsAPIDistributedZkTest-E85A8117DC3C9366-001/tempDir-003/nodes_used_collection_shard1_replica2/data
   [junit4]   2> 331186 T197 oasc.CachingDirectoryFactory.get return new directory for /usr/home/jenkins/jenkins-slave/workspace/Lucene-Solr-NightlyTests-5.x/solr/build/solr-core/test/J3/../../../../../../../../../../../usr/home/jenkins/jenkins-slave/workspace/Lucene-Solr-NightlyTests-5.x/solr/build/solr-core/test/J3/temp/solr.cloud.CollectionsAPIDistributedZkTest-E85A8117DC3C9366-001/tempDir-004/nodes_used_collection_shard2_replica1/data
   [junit4]   2> 331186 T225 oasc.SolrCore.initIndex WARN [nodes_used_collection_shard2_replica2] Solr index directory '/usr/home/jenkins/jenkins-slave/workspace/Lucene-Solr-NightlyTests-5.x/solr/build/solr-core/test/J3/temp/solr.cloud.CollectionsAPIDistributedZkTest-E85A8117DC3C9366-001/tempDir-006/nodes_used_collection_shard2_replica2/data/index' doesn't exist. Creating new index...
   [junit4]   2> 331188 T197 oasc.SolrCore.getNewIndexDir New index directory detected: old=null new=/usr/home/jenkins/jenkins-slave/workspace/Lucene-Solr-NightlyTests-5.x/solr/build/solr-core/test/J3/../../../../../../../../../../../usr/home/jenkins/jenkins-slave/workspace/Lucene-Solr-NightlyTests-5.x/solr/build/solr-core/test/J3/temp/solr.cloud.CollectionsAPIDistributedZkTest-E85A8117DC3C9366-001/tempDir-004/nodes_used_collection_shard2_replica1/data/index/
   [junit4]   2> 331188 T225 oasc.CachingDirectoryFactory.get return new directory for /usr/home/jenkins/jenkins-slave/workspace/Lucene-Solr-NightlyTests-5.x/solr/build/solr-core/test/J3/temp/solr.cloud.CollectionsAPIDistributedZkTest-E85A8117DC3C9366-001/tempDir-006/nodes_used_collection_shard2_replica2/data/index
   [junit4]   2> 331187 T175 oasc.SolrCore.getNewIndexDir New index directory detected: old=null new=/usr/home/jenkins/jenkins-slave/workspace/Lucene-Solr-NightlyTests-5.x/solr/build/solr-core/test/J3/../../../../../../../../../../../usr/home/jenkins/jenkins-slave/workspace/Lucene-Solr-NightlyTests-5.x/solr/build/solr-core/test/J3/temp/solr.cloud.CollectionsAPIDistributedZkTest-E85A8117DC3C9366-001/tempDir-003/nodes_used_collection_shard1_replica2/data/index/
   [junit4]   2> 331187 T208 oasc.SolrCore.getNewIndexDir New index directory detected: old=null new=/usr/home/jenkins/jenkins-slave/workspace/Lucene-Solr-NightlyTests-5.x/solr/build/solr-core/test/J3/../../../../../../../../../../../usr/home/jenkins/jenkins-slave/workspace/Lucene-Solr-NightlyTests-5.x/solr/build/solr-core/test/J3/temp/solr.cloud.CollectionsAPIDistributedZkTest-E85A8117DC3C9366-001/tempDir-005/nodes_used_collection_shard1_replica1/data/index/
   [junit4]   2> 331189 T175 oasc.SolrCore.initIndex WARN [nodes_used_collection_shard1_replica2] Solr index directory '/usr/home/jenkins/jenkins-slave/workspace/Lucene-Solr-NightlyTests-5.x/solr/build/solr-core/test/J3/../../../../../../../../../../../usr/home/jenkins/jenkins-slave/workspace/Lucene-Solr-NightlyTests-5.x/solr/build/solr-core/test/J3/temp/solr.cloud.CollectionsAPIDistributedZkTest-E85A8117DC3C9366-001/tempDir-003/nodes_used_collection_shard1_replica2/data/index' doesn't exist. Creating new index...
   [junit4]   2> 331189 T225 oasu.RandomMergePolicy.<init> RandomMergePolicy wrapping class org.apache.lucene.index.MockRandomMergePolicy: org.apache.lucene.index.MockRandomMergePolicy@88c374
   [junit4]   2> 331188 T197 oasc.SolrCore.initIndex WARN [nodes_used_collection_shard2_replica1] Solr index directory '/usr/home/jenkins/jenkins-slave/workspace/Lucene-Solr-NightlyTests-5.x/solr/build/solr-core/test/J3/../../../../../../../../../../../usr/home/jenkins/jenkins-slave/workspace/Lucene-Solr-NightlyTests-5.x/solr/build/solr-core/test/J3/temp/solr.cloud.CollectionsAPIDistributedZkTest-E85A8117DC3C9366-001/tempDir-004/nodes_used_collection_shard2_replica1/data/index' doesn't exist. Creating new index...
   [junit4]   2> 331190 T175 oasc.CachingDirectoryFactory.get return new directory for /usr/home/jenkins/jenkins-slave/workspace/Lucene-Solr-NightlyTests-5.x/solr/build/solr-core/test/J3/../../../../../../../../../../../usr/home/jenkins/jenkins-slave/workspace/Lucene-Solr-NightlyTests-5.x/solr/build/solr-core/test/J3/temp/solr.cloud.CollectionsAPIDistributedZkTest-E85A8117DC3C9366-001/tempDir-003/nodes_used_collection_shard1_replica2/data/index
   [junit4]   2> 331192 T225 oasc.SolrDeletionPolicy.onCommit SolrDeletionPolicy.onCommit: commits: num=1
   [junit4]   2> 		commit{dir=MockDirectoryWrapper(RAMDirectory@f92f42b lockFactory=org.apache.lucene.store.SingleInstanceLockFactory@78dc3b09),segFN=segments_1,generation=1}
   [junit4]   2> 331189 T208 oasc.SolrCore.initIndex WARN [nodes_used_collection_shard1_replica1] Solr index directory '/usr/home/jenkins/jenkins-slave/workspace/Lucene-Solr-NightlyTests-5.x/solr/build/solr-core/test/J3/../../../../../../../../../../../usr/home/jenkins/jenkins-slave/workspace/Lucene-Solr-NightlyTests-5.x/solr/build/solr-core/test/J3/temp/solr.cloud.CollectionsAPIDistributedZkTest-E85A8117DC3C9366-001/tempDir-005/nodes_used_collection_shard1_replica1/data/index' doesn't exist. Creating new index...
   [junit4]   2> 331192 T225 oasc.SolrDeletionPolicy.updateCommits newest commit generation = 1
   [junit4]   2> 331192 T175 oasu.RandomMergePolicy.<init> RandomMergePolicy wrapping class org.apache.lucene.index.MockRandomMergePolicy: org.apache.lucene.index.MockRandomMergePolicy@3f265a83
   [junit4]   2> 331192 T197 oasc.CachingDirectoryFactory.get return new directory for /usr/home/jenkins/jenkins-slave/workspace/Lucene-Solr-NightlyTests-5.x/solr/build/solr-core/test/J3/../../../../../../../../../../../usr/home/jenkins/jenkins-slave/workspace/Lucene-Solr-NightlyTests-5.x/solr/build/solr-core/test/J3/temp/solr.cloud.CollectionsAPIDistributedZkTest-E85A8117DC3C9366-001/tempDir-004/nodes_used_collection_shard2_replica1/data/index
   [junit4]   2> 331194 T208 oasc.CachingDirectoryFactory.get return new directory for /usr/home/jenkins/jenkins-slave/workspace/Lucene-Solr-NightlyTests-5.x/solr/build/solr-core/test/J3/../../../../../../../../../../../usr/home/jenkins/jenkins-slave/workspace/Lucene-Solr-NightlyTests-5.x/solr/build/solr-core/test/J3/temp/solr.cloud.CollectionsAPIDistributedZkTest-E85A8117DC3C9366-001/tempDir-005/nodes_used_collection_shard1_replica1/data/index
   [junit4]   2> 331195 T197 oasu.RandomMergePolicy.<init> RandomMergePolicy wrapping class org.apache.lucene.index.MockRandomMergePolicy: org.apache.lucene.index.MockRandomMergePolicy@254a2d56
   [junit4]   2> 331201 T175 oasc.SolrDeletionPolicy.onCommit SolrDeletionPolicy.onCommit: commits: num=1
   [junit4]   2> 		commit{dir=MockDirectoryWrapper(RAMDirectory@7ff009e0 lockFactory=org.apache.lucene.store.SingleInstanceLockFactory@681892be),segFN=segments_1,generation=1}
   [junit4]   2> 331202 T175 oasc.SolrDeletionPolicy.updateCommits newest commit generation = 1
   [junit4]   2> 331201 T208 oasu.RandomMergePolicy.<init> RandomMergePolicy wrapping class org.apache.lucene.index.MockRandomMergePolicy: org.apache.lucene.index.MockRandomMergePolicy@5b7fb110
   [junit4]   2> 331202 T197 oasc.SolrDeletionPolicy.onCommit SolrDeletionPolicy.onCommit: commits: num=1
   [junit4]   2> 		commit{dir=MockDirectoryWrapper(RAMDirectory@1c41c05e lockFactory=org.apache.lucene.store.SingleInstanceLockFactory@20bc69d0),segFN=segments_1,generation=1}
   [junit4]   2> 331203 T208 oasc.SolrDeletionPolicy.onCommit SolrDeletionPolicy.onCommit: commits: num=1
   [junit4]   2> 		commit{dir=MockDirectoryWrapper(RAMDirectory@7987141d lockFactory=org.apache.lucene.store.SingleInstanceLockFactory@1339ba40),segFN=segments_1,generation=1}
   [junit4]   2> 331203 T197 oasc.SolrDeletionPolicy.updateCommits newest commit generation = 1
   [junit4]   2> 331204 T208 oasc.SolrDeletionPolicy.updateCommits newest commit generation = 1
   [junit4]   2> 331222 T225 oasup.UpdateRequestProcessorChain.init creating updateRequestProcessorChain "nodistrib"
   [junit4]   2> 331224 T225 oasup.UpdateRequestProcessorChain.init creating updateRequestProcessorChain "dedupe"
   [junit4]   2> 331225 T225 oasup.UpdateRequestProcessorChain.init inserting DistributedUpdateProcessorFactory into updateRequestProcessorChain "dedupe"
   [junit4]   2> 331226 T225 oasup.UpdateRequestProcessorChain.init creating updateRequestProcessorChain "stored_sig"
   [junit4]   2> 331227 T225 oasup.UpdateRequestProcessorChain.init inserting DistributedUpdateProcessorFactory into updateRequestProcessorChain "stored_sig"
   [junit4]   2> 331227 T225 oasup.UpdateRequestProcessorChain.init creating updateRequestProcessorChain "distrib-dup-test-chain-explicit"
   [junit4]   2> 331229 T225 oasup.UpdateRequestProcessorChain.init creating updateRequestProcessorChain "distrib-dup-test-chain-implicit"
   [junit4]   2> 331229 T197 oasup.UpdateRequestProcessorChain.init creating updateRequestProcessorChain "nodistrib"
   [junit4]   2> 331230 T197 oasup.UpdateRequestProcessorChain.init creating updateRequestProcessorChain "dedupe"
   [junit4]   2> 331230 T225 oasup.UpdateRequestProcessorChain.init inserting DistributedUpdateProcessorFactory into updateRequestProcessorChain "distrib-dup-test-chain-implicit"
   [junit4]   2> 331230 T197 oasup.UpdateRequestProcessorChain.init inserting DistributedUpdateProcessorFactory into updateRequestProcessorChain "dedupe"
   [junit4]   2> 331231 T225 oasc.SolrCore.loadUpdateProcessorChains no updateRequestProcessorChain defined as default, creating implicit default
   [junit4]   2> 331232 T175 oasup.UpdateRequestProcessorChain.init creating updateRequestProcessorChain "nodistrib"
   [junit4]   2> 331232 T197 oasup.UpdateRequestProcessorChain.init creating updateRequestProcessorChain "stored_sig"
   [junit4]   2> 331233 T175 oasup.UpdateRequestProcessorChain.init creating updateRequestProcessorChain "dedupe"
   [junit4]   2> 331234 T208 oasup.UpdateRequestProcessorChain.init creating updateRequestProcessorChain "nodistrib"
   [junit4]   2> 331234 T197 oasup.UpdateRequestProcessorChain.init inserting DistributedUpdateProcessorFactory into updateRequestProcessorChain "stored_sig"
   [junit4]   2> 331235 T208 oasup.UpdateRequestProcessorChain.init creating updateRequestProcessorChain "dedupe"
   [junit4]   2> 331235 T197 oasup.UpdateRequestProcessorChain.init creating updateRequestProcessorChain "distrib-dup-test-chain-explicit"
   [junit4]   2> 331236 T208 oasup.UpdateRequestProcessorChain.init inserting DistributedUpdateProcessorFactory into updateRequestProcessorChain "dedupe"
   [junit4]   2> 331234 T175 oasup.UpdateRequestProcessorChain.init inserting DistributedUpdateProcessorFactory into updateRequestProcessorChain "dedupe"
   [junit4]   2> 331236 T208 oasup.UpdateRequestProcessorChain.init creating updateRequestProcessorChain "stored_sig"
   [junit4]   2> 331236 T197 oasup.UpdateRequestProcessorChain.init creating updateRequestProcessorChain "distrib-dup-test-chain-implicit"
   [junit4]   2> 331237 T208 oasup.UpdateRequestProcessorChain.init inserting DistributedUpdateProcessorFactory into updateRequestProcessorChain "stored_sig"
   [junit4]   2> 331237 T175 oasup.UpdateRequestProcessorChain.init creating updateRequestProcessorChain "stored_sig"
   [junit4]   2> 331238 T208 oasup.UpdateRequestProcessorChain.init creating updateRequestProcessorChain "distrib-dup-test-chain-explicit"
   [junit4]   2> 331238 T197 oasup.UpdateRequestProcessorChain.init inserting DistributedUpdateProcessorFactory into updateRequestProcessorChain "distrib-dup-test-chain-implicit"
   [junit4]   2> 331239 T175 oasup.UpdateRequestProcessorChain.init inserting DistributedUpdateProcessorFactory into updateRequestProcessorChain "stored_sig"
   [junit4]   2> 331240 T208 oasup.UpdateRequestProcessorChain.init creating updateRequestProcessorChain "distrib-dup-test-chain-implicit"
   [junit4]   2> 331240 T197 oasc.SolrCore.loadUpdateProcessorChains no updateRequestProcessorChain defined as default, creating implicit default
   [junit4]   2> 331241 T208 oasup.UpdateRequestProcessorChain.init inserting DistributedUpdateProcessorFactory into updateRequestProcessorChain "distrib-dup-test-chain-implicit"
   [junit4]   2> 331240 T175 oasup.UpdateRequestProcessorChain.init creating updateRequestProcessorChain "distrib-dup-test-chain-explicit"
   [junit4]   2> 331241 T208 oasc.SolrCore.loadUpdateProcessorChains no updateRequestProcessorChain defined as default, creating implicit default
   [junit4]   2> 331242 T175 oasup.UpdateRequestProcessorChain.init creating updateRequestProcessorChain "distrib-dup-test-chain-implicit"
   [junit4]   2> 331243 T175 oasup.UpdateRequestProcessorChain.init inserting DistributedUpdateProcessorFactory into updateRequestProcessorChain "distrib-dup-test-chain-implicit"
   [junit4]   2> 331243 T175 oasc.SolrCore.loadUpdateProcessorChains no updateRequestProcessorChain defined as default, creating implicit default
   [junit4]   2> 331248 T175 oasc.RequestHandlers.initHandlersFromConfig created /update: org.apache.solr.handler.UpdateRequestHandler
   [junit4]   2> 331248 T225 oasc.RequestHandlers.initHandlersFromConfig created /update: org.apache.solr.handler.UpdateRequestHandler
   [junit4]   2> 331248 T208 oasc.RequestHandlers.initHandlersFromConfig created /update: org.apache.solr.handler.UpdateRequestHandler
   [junit4]   2> 331250 T175 oasc.RequestHandlers.initHandlersFromConfig created /update/json: org.apache.solr.handler.UpdateRequestHandler
   [junit4]   2> 331248 T197 oasc.RequestHandlers.initHandlersFromConfig created /update: org.apache.solr.handler.UpdateRequestHandler
   [junit4]   2> 331251 T225 oasc.RequestHandlers.initHandlersFromConfig created /update/json: org.apache.solr.handler.UpdateRequestHandler
   [junit4]   2> 331251 T175 oasc.RequestHandlers.initHandlersFromConfig created /update/csv: org.apache.solr.handler.UpdateRequestHandler
   [junit4]   2> 331251 T208 oasc.RequestHandlers.initHandlersFromConfig created /update/json: org.apache.solr.handler.UpdateRequestHandler
   [junit4]   2> 331252 T197 oasc.RequestHandlers.initHandlersFromConfig created /update/json: org.apache.solr.handler.UpdateRequestHandler
   [junit4]   2> 331252 T225 oasc.RequestHandlers.initHandlersFromConfig created /update/csv: org.apache.solr.handler.UpdateRequestHandler
   [junit4]   2> 331252 T175 oasc.RequestHandlers.initHandlersFromConfig created /update/json/docs: org.apache.solr.handler.UpdateRequestHandler
   [junit4]   2> 331253 T208 oasc.RequestHandlers.initHandlersFromConfig created /update/csv: org.apache.solr.handler.UpdateRequestHandler
   [junit4]   2> 331253 T197 oasc.RequestHandlers.initHandlersFromConfig created

[...truncated too long message...]

j.impl.LBHttpSolrClient.request(LBHttpSolrClient.java:332)
   [junit4]    > 	at org.apache.solr.client.solrj.impl.CloudSolrClient.sendRequest(CloudSolrClient.java:1015)
   [junit4]    > 	at org.apache.solr.client.solrj.impl.CloudSolrClient.requestWithRetryOnStaleState(CloudSolrClient.java:793)
   [junit4]    > 	at org.apache.solr.client.solrj.impl.CloudSolrClient.request(CloudSolrClient.java:736)
   [junit4]    > 	at org.apache.solr.cloud.AbstractFullDistribZkTestBase.createCollection(AbstractFullDistribZkTestBase.java:1640)
   [junit4]    > 	at org.apache.solr.cloud.AbstractFullDistribZkTestBase.createCollection(AbstractFullDistribZkTestBase.java:1661)
   [junit4]    > 	at org.apache.solr.cloud.CollectionsAPIDistributedZkTest$1CollectionThread.run(CollectionsAPIDistributedZkTest.java:905)
   [junit4]    > Caused by: org.apache.solr.client.solrj.impl.HttpSolrClient$RemoteSolrException: Error from server at https://127.0.0.1:14149/q_e/o: Could not fully create collection: awholynewstresscollection_collection1_5
   [junit4]    > 	at org.apache.solr.client.solrj.impl.HttpSolrClient.executeMethod(HttpSolrClient.java:558)
   [junit4]    > 	at org.apache.solr.client.solrj.impl.HttpSolrClient.request(HttpSolrClient.java:214)
   [junit4]    > 	at org.apache.solr.client.solrj.impl.HttpSolrClient.request(HttpSolrClient.java:210)
   [junit4]    > 	at org.apache.solr.client.solrj.impl.LBHttpSolrClient.doRequest(LBHttpSolrClient.java:353)
   [junit4]    > 	at org.apache.solr.client.solrj.impl.LBHttpSolrClient.request(LBHttpSolrClient.java:312)
   [junit4]    > 	... 6 moreThrowable #6: com.carrotsearch.randomizedtesting.UncaughtExceptionError: Captured an uncaught exception in thread: Thread[id=821, name=Thread-309, state=RUNNABLE, group=TGRP-CollectionsAPIDistributedZkTest]
   [junit4]    > Caused by: java.lang.RuntimeException: org.apache.solr.client.solrj.SolrServerException: No live SolrServers available to handle this request:[https://127.0.0.1:62231/q_e/o, https://127.0.0.1:53559/q_e/o, https://127.0.0.1:14149/q_e/o, https://127.0.0.1:27216/q_e/o, https://127.0.0.1:43361/q_e/o]
   [junit4]    > 	at __randomizedtesting.SeedInfo.seed([E85A8117DC3C9366]:0)
   [junit4]    > 	at org.apache.solr.cloud.CollectionsAPIDistributedZkTest$1CollectionThread.run(CollectionsAPIDistributedZkTest.java:915)
   [junit4]    > Caused by: org.apache.solr.client.solrj.SolrServerException: No live SolrServers available to handle this request:[https://127.0.0.1:62231/q_e/o, https://127.0.0.1:53559/q_e/o, https://127.0.0.1:14149/q_e/o, https://127.0.0.1:27216/q_e/o, https://127.0.0.1:43361/q_e/o]
   [junit4]    > 	at org.apache.solr.client.solrj.impl.LBHttpSolrClient.request(LBHttpSolrClient.java:332)
   [junit4]    > 	at org.apache.solr.client.solrj.impl.CloudSolrClient.sendRequest(CloudSolrClient.java:1015)
   [junit4]    > 	at org.apache.solr.client.solrj.impl.CloudSolrClient.requestWithRetryOnStaleState(CloudSolrClient.java:793)
   [junit4]    > 	at org.apache.solr.client.solrj.impl.CloudSolrClient.request(CloudSolrClient.java:736)
   [junit4]    > 	at org.apache.solr.cloud.AbstractFullDistribZkTestBase.createCollection(AbstractFullDistribZkTestBase.java:1640)
   [junit4]    > 	at org.apache.solr.cloud.AbstractFullDistribZkTestBase.createCollection(AbstractFullDistribZkTestBase.java:1661)
   [junit4]    > 	at org.apache.solr.cloud.CollectionsAPIDistributedZkTest$1CollectionThread.run(CollectionsAPIDistributedZkTest.java:905)
   [junit4]    > Caused by: org.apache.solr.client.solrj.impl.HttpSolrClient$RemoteSolrException: Error from server at https://127.0.0.1:14149/q_e/o: Could not fully create collection: awholynewstresscollection_collection4_7
   [junit4]    > 	at org.apache.solr.client.solrj.impl.HttpSolrClient.executeMethod(HttpSolrClient.java:558)
   [junit4]    > 	at org.apache.solr.client.solrj.impl.HttpSolrClient.request(HttpSolrClient.java:214)
   [junit4]    > 	at org.apache.solr.client.solrj.impl.HttpSolrClient.request(HttpSolrClient.java:210)
   [junit4]    > 	at org.apache.solr.client.solrj.impl.LBHttpSolrClient.doRequest(LBHttpSolrClient.java:353)
   [junit4]    > 	at org.apache.solr.client.solrj.impl.LBHttpSolrClient.request(LBHttpSolrClient.java:312)
   [junit4]    > 	... 6 moreThrowable #7: com.carrotsearch.randomizedtesting.UncaughtExceptionError: Captured an uncaught exception in thread: Thread[id=822, name=Thread-310, state=RUNNABLE, group=TGRP-CollectionsAPIDistributedZkTest]
   [junit4]    > Caused by: java.lang.RuntimeException: org.apache.solr.client.solrj.SolrServerException: No live SolrServers available to handle this request:[https://127.0.0.1:62231/q_e/o, https://127.0.0.1:53559/q_e/o, https://127.0.0.1:14149/q_e/o, https://127.0.0.1:27216/q_e/o, https://127.0.0.1:43361/q_e/o]
   [junit4]    > 	at __randomizedtesting.SeedInfo.seed([E85A8117DC3C9366]:0)
   [junit4]    > 	at org.apache.solr.cloud.CollectionsAPIDistributedZkTest$1CollectionThread.run(CollectionsAPIDistributedZkTest.java:915)
   [junit4]    > Caused by: org.apache.solr.client.solrj.SolrServerException: No live SolrServers available to handle this request:[https://127.0.0.1:62231/q_e/o, https://127.0.0.1:53559/q_e/o, https://127.0.0.1:14149/q_e/o, https://127.0.0.1:27216/q_e/o, https://127.0.0.1:43361/q_e/o]
   [junit4]    > 	at org.apache.solr.client.solrj.impl.LBHttpSolrClient.request(LBHttpSolrClient.java:332)
   [junit4]    > 	at org.apache.solr.client.solrj.impl.CloudSolrClient.sendRequest(CloudSolrClient.java:1015)
   [junit4]    > 	at org.apache.solr.client.solrj.impl.CloudSolrClient.requestWithRetryOnStaleState(CloudSolrClient.java:793)
   [junit4]    > 	at org.apache.solr.client.solrj.impl.CloudSolrClient.request(CloudSolrClient.java:736)
   [junit4]    > 	at org.apache.solr.cloud.AbstractFullDistribZkTestBase.createCollection(AbstractFullDistribZkTestBase.java:1640)
   [junit4]    > 	at org.apache.solr.cloud.AbstractFullDistribZkTestBase.createCollection(AbstractFullDistribZkTestBase.java:1661)
   [junit4]    > 	at org.apache.solr.cloud.CollectionsAPIDistributedZkTest$1CollectionThread.run(CollectionsAPIDistributedZkTest.java:905)
   [junit4]    > Caused by: org.apache.solr.client.solrj.impl.HttpSolrClient$RemoteSolrException: Error from server at https://127.0.0.1:14149/q_e/o: Could not fully create collection: awholynewstresscollection_collection5_6
   [junit4]    > 	at org.apache.solr.client.solrj.impl.HttpSolrClient.executeMethod(HttpSolrClient.java:558)
   [junit4]    > 	at org.apache.solr.client.solrj.impl.HttpSolrClient.request(HttpSolrClient.java:214)
   [junit4]    > 	at org.apache.solr.client.solrj.impl.HttpSolrClient.request(HttpSolrClient.java:210)
   [junit4]    > 	at org.apache.solr.client.solrj.impl.LBHttpSolrClient.doRequest(LBHttpSolrClient.java:353)
   [junit4]    > 	at org.apache.solr.client.solrj.impl.LBHttpSolrClient.request(LBHttpSolrClient.java:312)
   [junit4]    > 	... 6 more
   [junit4]   2> 1463213 T133 oas.SolrTestCaseJ4.deleteCore ###deleteCore
   [junit4]   2> NOTE: leaving temporary files on disk at: /usr/home/jenkins/jenkins-slave/workspace/Lucene-Solr-NightlyTests-5.x/solr/build/solr-core/test/J3/temp/solr.cloud.CollectionsAPIDistributedZkTest-E85A8117DC3C9366-001
   [junit4]   2> NOTE: test params are: codec=Asserting(Lucene50): {id=PostingsFormat(name=LuceneVarGapFixedInterval), a_i1=Lucene50(blocksize=128), multiDefault=Lucene50(blocksize=128), timestamp=Lucene50(blocksize=128), a_t=Lucene50(blocksize=128), other_tl1=Lucene50(blocksize=128), intDefault=Lucene50(blocksize=128), _version_=Lucene50(blocksize=128), text=BlockTreeOrds(blocksize=128), range_facet_l=Lucene50(blocksize=128)}, docValues:{timestamp=DocValuesFormat(name=Memory)}, sim=DefaultSimilarity, locale=ca, timezone=Mideast/Riyadh89
   [junit4]   2> NOTE: FreeBSD 9.1-RELEASE-p3 amd64/Oracle Corporation 1.7.0_65 (64-bit)/cpus=16,threads=1,free=347501960,total=513277952
   [junit4]   2> NOTE: All tests run in this JVM: [TestManagedSynonymFilterFactory, HdfsCollectionsAPIDistributedZkTest, IndexSchemaRuntimeFieldTest, SolrIndexConfigTest, DocValuesMultiTest, TestStressRecovery, TestIntervalFaceting, URLClassifyProcessorTest, TestNoOpRegenerator, HdfsBasicDistributedZkTest, TestCursorMarkWithoutUniqueKey, AddBlockUpdateTest, CollectionsAPIDistributedZkTest]
   [junit4] Completed on J3 in 1150.62s, 1 test, 1 error <<< FAILURES!

[...truncated 1118 lines...]
BUILD FAILED
/usr/home/jenkins/jenkins-slave/workspace/Lucene-Solr-NightlyTests-5.x/build.xml:536: The following error occurred while executing this line:
/usr/home/jenkins/jenkins-slave/workspace/Lucene-Solr-NightlyTests-5.x/build.xml:477: The following error occurred while executing this line:
/usr/home/jenkins/jenkins-slave/workspace/Lucene-Solr-NightlyTests-5.x/build.xml:61: The following error occurred while executing this line:
/usr/home/jenkins/jenkins-slave/workspace/Lucene-Solr-NightlyTests-5.x/extra-targets.xml:39: The following error occurred while executing this line:
/usr/home/jenkins/jenkins-slave/workspace/Lucene-Solr-NightlyTests-5.x/solr/build.xml:190: The following error occurred while executing this line:
/usr/home/jenkins/jenkins-slave/workspace/Lucene-Solr-NightlyTests-5.x/solr/common-build.xml:508: The following error occurred while executing this line:
/usr/home/jenkins/jenkins-slave/workspace/Lucene-Solr-NightlyTests-5.x/lucene/common-build.xml:1363: The following error occurred while executing this line:
/usr/home/jenkins/jenkins-slave/workspace/Lucene-Solr-NightlyTests-5.x/lucene/common-build.xml:970: There were test failures: 458 suites, 1858 tests, 1 error, 57 ignored (10 assumptions)

Total time: 222 minutes 1 second
Build step 'Invoke Ant' marked build as failure
Archiving artifacts
Sending artifact delta relative to Lucene-Solr-NightlyTests-5.x #716
Archived 5 artifacts
Archive block size is 32768
Received 0 blocks and 913464105 bytes
Compression is 0.0%
Took 2 min 43 sec
Recording test results
Email was triggered for: Failure
Sending email for trigger: Failure



Mime
View raw message