lucene-dev mailing list archives

Site index · List index
Message view « Date » · « Thread »
Top « Date » · « Thread »
From Apache Jenkins Server <jenk...@builds.apache.org>
Subject [JENKINS] Lucene-Solr-Tests-5.x-Java7 - Build # 2460 - Still Failing
Date Sat, 10 Jan 2015 17:08:05 GMT
Build: https://builds.apache.org/job/Lucene-Solr-Tests-5.x-Java7/2460/

4 tests failed.
FAILED:  org.apache.solr.cloud.HttpPartitionTest.testDistribSearch

Error Message:
org.apache.solr.client.solrj.SolrServerException: IOException occured when talking to server at: http://127.0.0.1:34685/c8n_1x2_shard1_replica2

Stack Trace:
org.apache.solr.client.solrj.SolrServerException: org.apache.solr.client.solrj.SolrServerException: IOException occured when talking to server at: http://127.0.0.1:34685/c8n_1x2_shard1_replica2
	at __randomizedtesting.SeedInfo.seed([381A2844D856258D:B9FCA65CAF0945B1]:0)
	at org.apache.solr.client.solrj.impl.CloudSolrClient.directUpdate(CloudSolrClient.java:581)
	at org.apache.solr.client.solrj.impl.CloudSolrClient.sendRequest(CloudSolrClient.java:890)
	at org.apache.solr.client.solrj.impl.CloudSolrClient.requestWithRetryOnStaleState(CloudSolrClient.java:793)
	at org.apache.solr.client.solrj.impl.CloudSolrClient.request(CloudSolrClient.java:736)
	at org.apache.solr.cloud.HttpPartitionTest.sendDoc(HttpPartitionTest.java:480)
	at org.apache.solr.cloud.HttpPartitionTest.testRf2(HttpPartitionTest.java:201)
	at org.apache.solr.cloud.HttpPartitionTest.doTest(HttpPartitionTest.java:114)
	at org.apache.solr.BaseDistributedSearchTestCase.testDistribSearch(BaseDistributedSearchTestCase.java:868)
	at sun.reflect.NativeMethodAccessorImpl.invoke0(Native Method)
	at sun.reflect.NativeMethodAccessorImpl.invoke(NativeMethodAccessorImpl.java:57)
	at sun.reflect.DelegatingMethodAccessorImpl.invoke(DelegatingMethodAccessorImpl.java:43)
	at java.lang.reflect.Method.invoke(Method.java:606)
	at com.carrotsearch.randomizedtesting.RandomizedRunner.invoke(RandomizedRunner.java:1618)
	at com.carrotsearch.randomizedtesting.RandomizedRunner$6.evaluate(RandomizedRunner.java:827)
	at com.carrotsearch.randomizedtesting.RandomizedRunner$7.evaluate(RandomizedRunner.java:863)
	at com.carrotsearch.randomizedtesting.RandomizedRunner$8.evaluate(RandomizedRunner.java:877)
	at com.carrotsearch.randomizedtesting.rules.SystemPropertiesRestoreRule$1.evaluate(SystemPropertiesRestoreRule.java:53)
	at org.apache.lucene.util.TestRuleSetupTeardownChained$1.evaluate(TestRuleSetupTeardownChained.java:50)
	at org.apache.lucene.util.AbstractBeforeAfterRule$1.evaluate(AbstractBeforeAfterRule.java:46)
	at com.carrotsearch.randomizedtesting.rules.SystemPropertiesInvariantRule$1.evaluate(SystemPropertiesInvariantRule.java:55)
	at org.apache.lucene.util.TestRuleThreadAndTestName$1.evaluate(TestRuleThreadAndTestName.java:49)
	at org.apache.lucene.util.TestRuleIgnoreAfterMaxFailures$1.evaluate(TestRuleIgnoreAfterMaxFailures.java:65)
	at org.apache.lucene.util.TestRuleMarkFailure$1.evaluate(TestRuleMarkFailure.java:48)
	at com.carrotsearch.randomizedtesting.rules.StatementAdapter.evaluate(StatementAdapter.java:36)
	at com.carrotsearch.randomizedtesting.ThreadLeakControl$StatementRunner.run(ThreadLeakControl.java:365)
	at com.carrotsearch.randomizedtesting.ThreadLeakControl.forkTimeoutingTask(ThreadLeakControl.java:798)
	at com.carrotsearch.randomizedtesting.ThreadLeakControl$3.evaluate(ThreadLeakControl.java:458)
	at com.carrotsearch.randomizedtesting.RandomizedRunner.runSingleTest(RandomizedRunner.java:836)
	at com.carrotsearch.randomizedtesting.RandomizedRunner$3.evaluate(RandomizedRunner.java:738)
	at com.carrotsearch.randomizedtesting.RandomizedRunner$4.evaluate(RandomizedRunner.java:772)
	at com.carrotsearch.randomizedtesting.RandomizedRunner$5.evaluate(RandomizedRunner.java:783)
	at com.carrotsearch.randomizedtesting.rules.StatementAdapter.evaluate(StatementAdapter.java:36)
	at com.carrotsearch.randomizedtesting.rules.SystemPropertiesRestoreRule$1.evaluate(SystemPropertiesRestoreRule.java:53)
	at org.apache.lucene.util.AbstractBeforeAfterRule$1.evaluate(AbstractBeforeAfterRule.java:46)
	at org.apache.lucene.util.TestRuleStoreClassName$1.evaluate(TestRuleStoreClassName.java:42)
	at com.carrotsearch.randomizedtesting.rules.SystemPropertiesInvariantRule$1.evaluate(SystemPropertiesInvariantRule.java:55)
	at com.carrotsearch.randomizedtesting.rules.NoShadowingOrOverridesOnMethodsRule$1.evaluate(NoShadowingOrOverridesOnMethodsRule.java:39)
	at com.carrotsearch.randomizedtesting.rules.NoShadowingOrOverridesOnMethodsRule$1.evaluate(NoShadowingOrOverridesOnMethodsRule.java:39)
	at com.carrotsearch.randomizedtesting.rules.StatementAdapter.evaluate(StatementAdapter.java:36)
	at com.carrotsearch.randomizedtesting.rules.StatementAdapter.evaluate(StatementAdapter.java:36)
	at com.carrotsearch.randomizedtesting.rules.StatementAdapter.evaluate(StatementAdapter.java:36)
	at org.apache.lucene.util.TestRuleAssertionsRequired$1.evaluate(TestRuleAssertionsRequired.java:54)
	at org.apache.lucene.util.TestRuleMarkFailure$1.evaluate(TestRuleMarkFailure.java:48)
	at org.apache.lucene.util.TestRuleIgnoreAfterMaxFailures$1.evaluate(TestRuleIgnoreAfterMaxFailures.java:65)
	at org.apache.lucene.util.TestRuleIgnoreTestSuites$1.evaluate(TestRuleIgnoreTestSuites.java:55)
	at com.carrotsearch.randomizedtesting.rules.StatementAdapter.evaluate(StatementAdapter.java:36)
	at com.carrotsearch.randomizedtesting.ThreadLeakControl$StatementRunner.run(ThreadLeakControl.java:365)
	at java.lang.Thread.run(Thread.java:745)
Caused by: org.apache.solr.client.solrj.SolrServerException: IOException occured when talking to server at: http://127.0.0.1:34685/c8n_1x2_shard1_replica2
	at org.apache.solr.client.solrj.impl.HttpSolrClient.executeMethod(HttpSolrClient.java:572)
	at org.apache.solr.client.solrj.impl.HttpSolrClient.request(HttpSolrClient.java:214)
	at org.apache.solr.client.solrj.impl.HttpSolrClient.request(HttpSolrClient.java:210)
	at org.apache.solr.client.solrj.impl.LBHttpSolrClient.doRequest(LBHttpSolrClient.java:353)
	at org.apache.solr.client.solrj.impl.LBHttpSolrClient.request(LBHttpSolrClient.java:312)
	at org.apache.solr.client.solrj.impl.CloudSolrClient.directUpdate(CloudSolrClient.java:578)
	... 47 more
Caused by: org.apache.http.NoHttpResponseException: The target server failed to respond
	at org.apache.http.impl.conn.DefaultHttpResponseParser.parseHead(DefaultHttpResponseParser.java:143)
	at org.apache.http.impl.conn.DefaultHttpResponseParser.parseHead(DefaultHttpResponseParser.java:57)
	at org.apache.http.impl.io.AbstractMessageParser.parse(AbstractMessageParser.java:260)
	at org.apache.http.impl.AbstractHttpClientConnection.receiveResponseHeader(AbstractHttpClientConnection.java:283)
	at org.apache.http.impl.conn.DefaultClientConnection.receiveResponseHeader(DefaultClientConnection.java:251)
	at org.apache.http.impl.conn.ManagedClientConnectionImpl.receiveResponseHeader(ManagedClientConnectionImpl.java:197)
	at org.apache.http.protocol.HttpRequestExecutor.doReceiveResponse(HttpRequestExecutor.java:271)
	at org.apache.http.protocol.HttpRequestExecutor.execute(HttpRequestExecutor.java:123)
	at org.apache.http.impl.client.DefaultRequestDirector.tryExecute(DefaultRequestDirector.java:682)
	at org.apache.http.impl.client.DefaultRequestDirector.execute(DefaultRequestDirector.java:486)
	at org.apache.http.impl.client.AbstractHttpClient.doExecute(AbstractHttpClient.java:863)
	at org.apache.http.impl.client.CloseableHttpClient.execute(CloseableHttpClient.java:82)
	at org.apache.http.impl.client.CloseableHttpClient.execute(CloseableHttpClient.java:106)
	at org.apache.http.impl.client.CloseableHttpClient.execute(CloseableHttpClient.java:57)
	at org.apache.solr.client.solrj.impl.HttpSolrClient.executeMethod(HttpSolrClient.java:464)
	... 52 more


FAILED:  org.apache.solr.cloud.LeaderFailoverAfterPartitionTest.testDistribSearch

Error Message:
org.apache.solr.client.solrj.SolrServerException: IOException occured when talking to server at: http://127.0.0.1:34292/c8n_1x3_lf_shard1_replica2

Stack Trace:
org.apache.solr.client.solrj.SolrServerException: org.apache.solr.client.solrj.SolrServerException: IOException occured when talking to server at: http://127.0.0.1:34292/c8n_1x3_lf_shard1_replica2
	at __randomizedtesting.SeedInfo.seed([381A2844D856258D:B9FCA65CAF0945B1]:0)
	at org.apache.solr.client.solrj.impl.CloudSolrClient.directUpdate(CloudSolrClient.java:581)
	at org.apache.solr.client.solrj.impl.CloudSolrClient.sendRequest(CloudSolrClient.java:890)
	at org.apache.solr.client.solrj.impl.CloudSolrClient.requestWithRetryOnStaleState(CloudSolrClient.java:793)
	at org.apache.solr.client.solrj.impl.CloudSolrClient.request(CloudSolrClient.java:736)
	at org.apache.solr.cloud.HttpPartitionTest.sendDoc(HttpPartitionTest.java:480)
	at org.apache.solr.cloud.LeaderFailoverAfterPartitionTest.testRf3WithLeaderFailover(LeaderFailoverAfterPartitionTest.java:77)
	at org.apache.solr.cloud.LeaderFailoverAfterPartitionTest.doTest(LeaderFailoverAfterPartitionTest.java:50)
	at org.apache.solr.BaseDistributedSearchTestCase.testDistribSearch(BaseDistributedSearchTestCase.java:868)
	at sun.reflect.NativeMethodAccessorImpl.invoke0(Native Method)
	at sun.reflect.NativeMethodAccessorImpl.invoke(NativeMethodAccessorImpl.java:57)
	at sun.reflect.DelegatingMethodAccessorImpl.invoke(DelegatingMethodAccessorImpl.java:43)
	at java.lang.reflect.Method.invoke(Method.java:606)
	at com.carrotsearch.randomizedtesting.RandomizedRunner.invoke(RandomizedRunner.java:1618)
	at com.carrotsearch.randomizedtesting.RandomizedRunner$6.evaluate(RandomizedRunner.java:827)
	at com.carrotsearch.randomizedtesting.RandomizedRunner$7.evaluate(RandomizedRunner.java:863)
	at com.carrotsearch.randomizedtesting.RandomizedRunner$8.evaluate(RandomizedRunner.java:877)
	at com.carrotsearch.randomizedtesting.rules.SystemPropertiesRestoreRule$1.evaluate(SystemPropertiesRestoreRule.java:53)
	at org.apache.lucene.util.TestRuleSetupTeardownChained$1.evaluate(TestRuleSetupTeardownChained.java:50)
	at org.apache.lucene.util.AbstractBeforeAfterRule$1.evaluate(AbstractBeforeAfterRule.java:46)
	at com.carrotsearch.randomizedtesting.rules.SystemPropertiesInvariantRule$1.evaluate(SystemPropertiesInvariantRule.java:55)
	at org.apache.lucene.util.TestRuleThreadAndTestName$1.evaluate(TestRuleThreadAndTestName.java:49)
	at org.apache.lucene.util.TestRuleIgnoreAfterMaxFailures$1.evaluate(TestRuleIgnoreAfterMaxFailures.java:65)
	at org.apache.lucene.util.TestRuleMarkFailure$1.evaluate(TestRuleMarkFailure.java:48)
	at com.carrotsearch.randomizedtesting.rules.StatementAdapter.evaluate(StatementAdapter.java:36)
	at com.carrotsearch.randomizedtesting.ThreadLeakControl$StatementRunner.run(ThreadLeakControl.java:365)
	at com.carrotsearch.randomizedtesting.ThreadLeakControl.forkTimeoutingTask(ThreadLeakControl.java:798)
	at com.carrotsearch.randomizedtesting.ThreadLeakControl$3.evaluate(ThreadLeakControl.java:458)
	at com.carrotsearch.randomizedtesting.RandomizedRunner.runSingleTest(RandomizedRunner.java:836)
	at com.carrotsearch.randomizedtesting.RandomizedRunner$3.evaluate(RandomizedRunner.java:738)
	at com.carrotsearch.randomizedtesting.RandomizedRunner$4.evaluate(RandomizedRunner.java:772)
	at com.carrotsearch.randomizedtesting.RandomizedRunner$5.evaluate(RandomizedRunner.java:783)
	at com.carrotsearch.randomizedtesting.rules.StatementAdapter.evaluate(StatementAdapter.java:36)
	at com.carrotsearch.randomizedtesting.rules.SystemPropertiesRestoreRule$1.evaluate(SystemPropertiesRestoreRule.java:53)
	at org.apache.lucene.util.AbstractBeforeAfterRule$1.evaluate(AbstractBeforeAfterRule.java:46)
	at org.apache.lucene.util.TestRuleStoreClassName$1.evaluate(TestRuleStoreClassName.java:42)
	at com.carrotsearch.randomizedtesting.rules.SystemPropertiesInvariantRule$1.evaluate(SystemPropertiesInvariantRule.java:55)
	at com.carrotsearch.randomizedtesting.rules.NoShadowingOrOverridesOnMethodsRule$1.evaluate(NoShadowingOrOverridesOnMethodsRule.java:39)
	at com.carrotsearch.randomizedtesting.rules.NoShadowingOrOverridesOnMethodsRule$1.evaluate(NoShadowingOrOverridesOnMethodsRule.java:39)
	at com.carrotsearch.randomizedtesting.rules.StatementAdapter.evaluate(StatementAdapter.java:36)
	at com.carrotsearch.randomizedtesting.rules.StatementAdapter.evaluate(StatementAdapter.java:36)
	at com.carrotsearch.randomizedtesting.rules.StatementAdapter.evaluate(StatementAdapter.java:36)
	at org.apache.lucene.util.TestRuleAssertionsRequired$1.evaluate(TestRuleAssertionsRequired.java:54)
	at org.apache.lucene.util.TestRuleMarkFailure$1.evaluate(TestRuleMarkFailure.java:48)
	at org.apache.lucene.util.TestRuleIgnoreAfterMaxFailures$1.evaluate(TestRuleIgnoreAfterMaxFailures.java:65)
	at org.apache.lucene.util.TestRuleIgnoreTestSuites$1.evaluate(TestRuleIgnoreTestSuites.java:55)
	at com.carrotsearch.randomizedtesting.rules.StatementAdapter.evaluate(StatementAdapter.java:36)
	at com.carrotsearch.randomizedtesting.ThreadLeakControl$StatementRunner.run(ThreadLeakControl.java:365)
	at java.lang.Thread.run(Thread.java:745)
Caused by: org.apache.solr.client.solrj.SolrServerException: IOException occured when talking to server at: http://127.0.0.1:34292/c8n_1x3_lf_shard1_replica2
	at org.apache.solr.client.solrj.impl.HttpSolrClient.executeMethod(HttpSolrClient.java:572)
	at org.apache.solr.client.solrj.impl.HttpSolrClient.request(HttpSolrClient.java:214)
	at org.apache.solr.client.solrj.impl.HttpSolrClient.request(HttpSolrClient.java:210)
	at org.apache.solr.client.solrj.impl.LBHttpSolrClient.doRequest(LBHttpSolrClient.java:353)
	at org.apache.solr.client.solrj.impl.LBHttpSolrClient.request(LBHttpSolrClient.java:312)
	at org.apache.solr.client.solrj.impl.CloudSolrClient.directUpdate(CloudSolrClient.java:578)
	... 47 more
Caused by: org.apache.http.NoHttpResponseException: The target server failed to respond
	at org.apache.http.impl.conn.DefaultHttpResponseParser.parseHead(DefaultHttpResponseParser.java:143)
	at org.apache.http.impl.conn.DefaultHttpResponseParser.parseHead(DefaultHttpResponseParser.java:57)
	at org.apache.http.impl.io.AbstractMessageParser.parse(AbstractMessageParser.java:260)
	at org.apache.http.impl.AbstractHttpClientConnection.receiveResponseHeader(AbstractHttpClientConnection.java:283)
	at org.apache.http.impl.conn.DefaultClientConnection.receiveResponseHeader(DefaultClientConnection.java:251)
	at org.apache.http.impl.conn.ManagedClientConnectionImpl.receiveResponseHeader(ManagedClientConnectionImpl.java:197)
	at org.apache.http.protocol.HttpRequestExecutor.doReceiveResponse(HttpRequestExecutor.java:271)
	at org.apache.http.protocol.HttpRequestExecutor.execute(HttpRequestExecutor.java:123)
	at org.apache.http.impl.client.DefaultRequestDirector.tryExecute(DefaultRequestDirector.java:682)
	at org.apache.http.impl.client.DefaultRequestDirector.execute(DefaultRequestDirector.java:486)
	at org.apache.http.impl.client.AbstractHttpClient.doExecute(AbstractHttpClient.java:863)
	at org.apache.http.impl.client.CloseableHttpClient.execute(CloseableHttpClient.java:82)
	at org.apache.http.impl.client.CloseableHttpClient.execute(CloseableHttpClient.java:106)
	at org.apache.http.impl.client.CloseableHttpClient.execute(CloseableHttpClient.java:57)
	at org.apache.solr.client.solrj.impl.HttpSolrClient.executeMethod(HttpSolrClient.java:464)
	... 52 more


FAILED:  org.apache.solr.cloud.LeaderInitiatedRecoveryOnCommitTest.testDistribSearch

Error Message:
IOException occured when talking to server at: http://127.0.0.1:40755/iyotk/t/c8n_1x3_commits_shard1_replica2

Stack Trace:
org.apache.solr.client.solrj.SolrServerException: IOException occured when talking to server at: http://127.0.0.1:40755/iyotk/t/c8n_1x3_commits_shard1_replica2
	at __randomizedtesting.SeedInfo.seed([381A2844D856258D:B9FCA65CAF0945B1]:0)
	at org.apache.solr.client.solrj.impl.HttpSolrClient.executeMethod(HttpSolrClient.java:572)
	at org.apache.solr.client.solrj.impl.HttpSolrClient.request(HttpSolrClient.java:214)
	at org.apache.solr.client.solrj.impl.HttpSolrClient.request(HttpSolrClient.java:210)
	at org.apache.solr.client.solrj.request.AbstractUpdateRequest.process(AbstractUpdateRequest.java:124)
	at org.apache.solr.client.solrj.SolrClient.commit(SolrClient.java:169)
	at org.apache.solr.client.solrj.SolrClient.commit(SolrClient.java:147)
	at org.apache.solr.cloud.LeaderInitiatedRecoveryOnCommitTest.oneShardTest(LeaderInitiatedRecoveryOnCommitTest.java:141)
	at org.apache.solr.cloud.LeaderInitiatedRecoveryOnCommitTest.doTest(LeaderInitiatedRecoveryOnCommitTest.java:70)
	at org.apache.solr.BaseDistributedSearchTestCase.testDistribSearch(BaseDistributedSearchTestCase.java:868)
	at sun.reflect.NativeMethodAccessorImpl.invoke0(Native Method)
	at sun.reflect.NativeMethodAccessorImpl.invoke(NativeMethodAccessorImpl.java:57)
	at sun.reflect.DelegatingMethodAccessorImpl.invoke(DelegatingMethodAccessorImpl.java:43)
	at java.lang.reflect.Method.invoke(Method.java:606)
	at com.carrotsearch.randomizedtesting.RandomizedRunner.invoke(RandomizedRunner.java:1618)
	at com.carrotsearch.randomizedtesting.RandomizedRunner$6.evaluate(RandomizedRunner.java:827)
	at com.carrotsearch.randomizedtesting.RandomizedRunner$7.evaluate(RandomizedRunner.java:863)
	at com.carrotsearch.randomizedtesting.RandomizedRunner$8.evaluate(RandomizedRunner.java:877)
	at com.carrotsearch.randomizedtesting.rules.SystemPropertiesRestoreRule$1.evaluate(SystemPropertiesRestoreRule.java:53)
	at org.apache.lucene.util.TestRuleSetupTeardownChained$1.evaluate(TestRuleSetupTeardownChained.java:50)
	at org.apache.lucene.util.AbstractBeforeAfterRule$1.evaluate(AbstractBeforeAfterRule.java:46)
	at com.carrotsearch.randomizedtesting.rules.SystemPropertiesInvariantRule$1.evaluate(SystemPropertiesInvariantRule.java:55)
	at org.apache.lucene.util.TestRuleThreadAndTestName$1.evaluate(TestRuleThreadAndTestName.java:49)
	at org.apache.lucene.util.TestRuleIgnoreAfterMaxFailures$1.evaluate(TestRuleIgnoreAfterMaxFailures.java:65)
	at org.apache.lucene.util.TestRuleMarkFailure$1.evaluate(TestRuleMarkFailure.java:48)
	at com.carrotsearch.randomizedtesting.rules.StatementAdapter.evaluate(StatementAdapter.java:36)
	at com.carrotsearch.randomizedtesting.ThreadLeakControl$StatementRunner.run(ThreadLeakControl.java:365)
	at com.carrotsearch.randomizedtesting.ThreadLeakControl.forkTimeoutingTask(ThreadLeakControl.java:798)
	at com.carrotsearch.randomizedtesting.ThreadLeakControl$3.evaluate(ThreadLeakControl.java:458)
	at com.carrotsearch.randomizedtesting.RandomizedRunner.runSingleTest(RandomizedRunner.java:836)
	at com.carrotsearch.randomizedtesting.RandomizedRunner$3.evaluate(RandomizedRunner.java:738)
	at com.carrotsearch.randomizedtesting.RandomizedRunner$4.evaluate(RandomizedRunner.java:772)
	at com.carrotsearch.randomizedtesting.RandomizedRunner$5.evaluate(RandomizedRunner.java:783)
	at com.carrotsearch.randomizedtesting.rules.StatementAdapter.evaluate(StatementAdapter.java:36)
	at com.carrotsearch.randomizedtesting.rules.SystemPropertiesRestoreRule$1.evaluate(SystemPropertiesRestoreRule.java:53)
	at org.apache.lucene.util.AbstractBeforeAfterRule$1.evaluate(AbstractBeforeAfterRule.java:46)
	at org.apache.lucene.util.TestRuleStoreClassName$1.evaluate(TestRuleStoreClassName.java:42)
	at com.carrotsearch.randomizedtesting.rules.SystemPropertiesInvariantRule$1.evaluate(SystemPropertiesInvariantRule.java:55)
	at com.carrotsearch.randomizedtesting.rules.NoShadowingOrOverridesOnMethodsRule$1.evaluate(NoShadowingOrOverridesOnMethodsRule.java:39)
	at com.carrotsearch.randomizedtesting.rules.NoShadowingOrOverridesOnMethodsRule$1.evaluate(NoShadowingOrOverridesOnMethodsRule.java:39)
	at com.carrotsearch.randomizedtesting.rules.StatementAdapter.evaluate(StatementAdapter.java:36)
	at com.carrotsearch.randomizedtesting.rules.StatementAdapter.evaluate(StatementAdapter.java:36)
	at com.carrotsearch.randomizedtesting.rules.StatementAdapter.evaluate(StatementAdapter.java:36)
	at org.apache.lucene.util.TestRuleAssertionsRequired$1.evaluate(TestRuleAssertionsRequired.java:54)
	at org.apache.lucene.util.TestRuleMarkFailure$1.evaluate(TestRuleMarkFailure.java:48)
	at org.apache.lucene.util.TestRuleIgnoreAfterMaxFailures$1.evaluate(TestRuleIgnoreAfterMaxFailures.java:65)
	at org.apache.lucene.util.TestRuleIgnoreTestSuites$1.evaluate(TestRuleIgnoreTestSuites.java:55)
	at com.carrotsearch.randomizedtesting.rules.StatementAdapter.evaluate(StatementAdapter.java:36)
	at com.carrotsearch.randomizedtesting.ThreadLeakControl$StatementRunner.run(ThreadLeakControl.java:365)
	at java.lang.Thread.run(Thread.java:745)
Caused by: org.apache.http.NoHttpResponseException: The target server failed to respond
	at org.apache.http.impl.conn.DefaultHttpResponseParser.parseHead(DefaultHttpResponseParser.java:143)
	at org.apache.http.impl.conn.DefaultHttpResponseParser.parseHead(DefaultHttpResponseParser.java:57)
	at org.apache.http.impl.io.AbstractMessageParser.parse(AbstractMessageParser.java:260)
	at org.apache.http.impl.AbstractHttpClientConnection.receiveResponseHeader(AbstractHttpClientConnection.java:283)
	at org.apache.http.impl.conn.DefaultClientConnection.receiveResponseHeader(DefaultClientConnection.java:251)
	at org.apache.http.impl.conn.ManagedClientConnectionImpl.receiveResponseHeader(ManagedClientConnectionImpl.java:197)
	at org.apache.http.protocol.HttpRequestExecutor.doReceiveResponse(HttpRequestExecutor.java:271)
	at org.apache.http.protocol.HttpRequestExecutor.execute(HttpRequestExecutor.java:123)
	at org.apache.http.impl.client.DefaultRequestDirector.tryExecute(DefaultRequestDirector.java:682)
	at org.apache.http.impl.client.DefaultRequestDirector.execute(DefaultRequestDirector.java:486)
	at org.apache.http.impl.client.AbstractHttpClient.doExecute(AbstractHttpClient.java:863)
	at org.apache.http.impl.client.CloseableHttpClient.execute(CloseableHttpClient.java:82)
	at org.apache.http.impl.client.CloseableHttpClient.execute(CloseableHttpClient.java:106)
	at org.apache.http.impl.client.CloseableHttpClient.execute(CloseableHttpClient.java:57)
	at org.apache.solr.client.solrj.impl.HttpSolrClient.executeMethod(HttpSolrClient.java:464)
	... 48 more


FAILED:  org.apache.solr.cloud.ReplicationFactorTest.testDistribSearch

Error Message:
org.apache.solr.client.solrj.SolrServerException: IOException occured when talking to server at: http://127.0.0.1:34537/d_o/repfacttest_c8n_1x3_shard1_replica3

Stack Trace:
org.apache.solr.client.solrj.SolrServerException: org.apache.solr.client.solrj.SolrServerException: IOException occured when talking to server at: http://127.0.0.1:34537/d_o/repfacttest_c8n_1x3_shard1_replica3
	at __randomizedtesting.SeedInfo.seed([381A2844D856258D:B9FCA65CAF0945B1]:0)
	at org.apache.solr.client.solrj.impl.CloudSolrClient.directUpdate(CloudSolrClient.java:581)
	at org.apache.solr.client.solrj.impl.CloudSolrClient.sendRequest(CloudSolrClient.java:890)
	at org.apache.solr.client.solrj.impl.CloudSolrClient.requestWithRetryOnStaleState(CloudSolrClient.java:793)
	at org.apache.solr.client.solrj.impl.CloudSolrClient.request(CloudSolrClient.java:736)
	at org.apache.solr.cloud.ReplicationFactorTest.sendDoc(ReplicationFactorTest.java:312)
	at org.apache.solr.cloud.ReplicationFactorTest.testRf3(ReplicationFactorTest.java:226)
	at org.apache.solr.cloud.ReplicationFactorTest.doTest(ReplicationFactorTest.java:123)
	at org.apache.solr.BaseDistributedSearchTestCase.testDistribSearch(BaseDistributedSearchTestCase.java:868)
	at sun.reflect.NativeMethodAccessorImpl.invoke0(Native Method)
	at sun.reflect.NativeMethodAccessorImpl.invoke(NativeMethodAccessorImpl.java:57)
	at sun.reflect.DelegatingMethodAccessorImpl.invoke(DelegatingMethodAccessorImpl.java:43)
	at java.lang.reflect.Method.invoke(Method.java:606)
	at com.carrotsearch.randomizedtesting.RandomizedRunner.invoke(RandomizedRunner.java:1618)
	at com.carrotsearch.randomizedtesting.RandomizedRunner$6.evaluate(RandomizedRunner.java:827)
	at com.carrotsearch.randomizedtesting.RandomizedRunner$7.evaluate(RandomizedRunner.java:863)
	at com.carrotsearch.randomizedtesting.RandomizedRunner$8.evaluate(RandomizedRunner.java:877)
	at com.carrotsearch.randomizedtesting.rules.SystemPropertiesRestoreRule$1.evaluate(SystemPropertiesRestoreRule.java:53)
	at org.apache.lucene.util.TestRuleSetupTeardownChained$1.evaluate(TestRuleSetupTeardownChained.java:50)
	at org.apache.lucene.util.AbstractBeforeAfterRule$1.evaluate(AbstractBeforeAfterRule.java:46)
	at com.carrotsearch.randomizedtesting.rules.SystemPropertiesInvariantRule$1.evaluate(SystemPropertiesInvariantRule.java:55)
	at org.apache.lucene.util.TestRuleThreadAndTestName$1.evaluate(TestRuleThreadAndTestName.java:49)
	at org.apache.lucene.util.TestRuleIgnoreAfterMaxFailures$1.evaluate(TestRuleIgnoreAfterMaxFailures.java:65)
	at org.apache.lucene.util.TestRuleMarkFailure$1.evaluate(TestRuleMarkFailure.java:48)
	at com.carrotsearch.randomizedtesting.rules.StatementAdapter.evaluate(StatementAdapter.java:36)
	at com.carrotsearch.randomizedtesting.ThreadLeakControl$StatementRunner.run(ThreadLeakControl.java:365)
	at com.carrotsearch.randomizedtesting.ThreadLeakControl.forkTimeoutingTask(ThreadLeakControl.java:798)
	at com.carrotsearch.randomizedtesting.ThreadLeakControl$3.evaluate(ThreadLeakControl.java:458)
	at com.carrotsearch.randomizedtesting.RandomizedRunner.runSingleTest(RandomizedRunner.java:836)
	at com.carrotsearch.randomizedtesting.RandomizedRunner$3.evaluate(RandomizedRunner.java:738)
	at com.carrotsearch.randomizedtesting.RandomizedRunner$4.evaluate(RandomizedRunner.java:772)
	at com.carrotsearch.randomizedtesting.RandomizedRunner$5.evaluate(RandomizedRunner.java:783)
	at com.carrotsearch.randomizedtesting.rules.StatementAdapter.evaluate(StatementAdapter.java:36)
	at com.carrotsearch.randomizedtesting.rules.SystemPropertiesRestoreRule$1.evaluate(SystemPropertiesRestoreRule.java:53)
	at org.apache.lucene.util.AbstractBeforeAfterRule$1.evaluate(AbstractBeforeAfterRule.java:46)
	at org.apache.lucene.util.TestRuleStoreClassName$1.evaluate(TestRuleStoreClassName.java:42)
	at com.carrotsearch.randomizedtesting.rules.SystemPropertiesInvariantRule$1.evaluate(SystemPropertiesInvariantRule.java:55)
	at com.carrotsearch.randomizedtesting.rules.NoShadowingOrOverridesOnMethodsRule$1.evaluate(NoShadowingOrOverridesOnMethodsRule.java:39)
	at com.carrotsearch.randomizedtesting.rules.NoShadowingOrOverridesOnMethodsRule$1.evaluate(NoShadowingOrOverridesOnMethodsRule.java:39)
	at com.carrotsearch.randomizedtesting.rules.StatementAdapter.evaluate(StatementAdapter.java:36)
	at com.carrotsearch.randomizedtesting.rules.StatementAdapter.evaluate(StatementAdapter.java:36)
	at com.carrotsearch.randomizedtesting.rules.StatementAdapter.evaluate(StatementAdapter.java:36)
	at org.apache.lucene.util.TestRuleAssertionsRequired$1.evaluate(TestRuleAssertionsRequired.java:54)
	at org.apache.lucene.util.TestRuleMarkFailure$1.evaluate(TestRuleMarkFailure.java:48)
	at org.apache.lucene.util.TestRuleIgnoreAfterMaxFailures$1.evaluate(TestRuleIgnoreAfterMaxFailures.java:65)
	at org.apache.lucene.util.TestRuleIgnoreTestSuites$1.evaluate(TestRuleIgnoreTestSuites.java:55)
	at com.carrotsearch.randomizedtesting.rules.StatementAdapter.evaluate(StatementAdapter.java:36)
	at com.carrotsearch.randomizedtesting.ThreadLeakControl$StatementRunner.run(ThreadLeakControl.java:365)
	at java.lang.Thread.run(Thread.java:745)
Caused by: org.apache.solr.client.solrj.SolrServerException: IOException occured when talking to server at: http://127.0.0.1:34537/d_o/repfacttest_c8n_1x3_shard1_replica3
	at org.apache.solr.client.solrj.impl.HttpSolrClient.executeMethod(HttpSolrClient.java:572)
	at org.apache.solr.client.solrj.impl.HttpSolrClient.request(HttpSolrClient.java:214)
	at org.apache.solr.client.solrj.impl.HttpSolrClient.request(HttpSolrClient.java:210)
	at org.apache.solr.client.solrj.impl.LBHttpSolrClient.doRequest(LBHttpSolrClient.java:353)
	at org.apache.solr.client.solrj.impl.LBHttpSolrClient.request(LBHttpSolrClient.java:312)
	at org.apache.solr.client.solrj.impl.CloudSolrClient.directUpdate(CloudSolrClient.java:578)
	... 47 more
Caused by: org.apache.http.NoHttpResponseException: The target server failed to respond
	at org.apache.http.impl.conn.DefaultHttpResponseParser.parseHead(DefaultHttpResponseParser.java:143)
	at org.apache.http.impl.conn.DefaultHttpResponseParser.parseHead(DefaultHttpResponseParser.java:57)
	at org.apache.http.impl.io.AbstractMessageParser.parse(AbstractMessageParser.java:260)
	at org.apache.http.impl.AbstractHttpClientConnection.receiveResponseHeader(AbstractHttpClientConnection.java:283)
	at org.apache.http.impl.conn.DefaultClientConnection.receiveResponseHeader(DefaultClientConnection.java:251)
	at org.apache.http.impl.conn.ManagedClientConnectionImpl.receiveResponseHeader(ManagedClientConnectionImpl.java:197)
	at org.apache.http.protocol.HttpRequestExecutor.doReceiveResponse(HttpRequestExecutor.java:271)
	at org.apache.http.protocol.HttpRequestExecutor.execute(HttpRequestExecutor.java:123)
	at org.apache.http.impl.client.DefaultRequestDirector.tryExecute(DefaultRequestDirector.java:682)
	at org.apache.http.impl.client.DefaultRequestDirector.execute(DefaultRequestDirector.java:486)
	at org.apache.http.impl.client.AbstractHttpClient.doExecute(AbstractHttpClient.java:863)
	at org.apache.http.impl.client.CloseableHttpClient.execute(CloseableHttpClient.java:82)
	at org.apache.http.impl.client.CloseableHttpClient.execute(CloseableHttpClient.java:106)
	at org.apache.http.impl.client.CloseableHttpClient.execute(CloseableHttpClient.java:57)
	at org.apache.solr.client.solrj.impl.HttpSolrClient.executeMethod(HttpSolrClient.java:464)
	... 52 more




Build Log:
[...truncated 9129 lines...]
   [junit4] Suite: org.apache.solr.cloud.LeaderInitiatedRecoveryOnCommitTest
   [junit4]   2> Creating dataDir: /usr/home/jenkins/jenkins-slave/workspace/Lucene-Solr-Tests-5.x-Java7/solr/build/solr-core/test/J2/temp/solr.cloud.LeaderInitiatedRecoveryOnCommitTest 381A2844D856258D-001/init-core-data-001
   [junit4]   2> 115871 T293 oas.BaseDistributedSearchTestCase.initHostContext Setting hostContext system property: /iyotk/t
   [junit4]   2> 115878 T293 oas.SolrTestCaseJ4.setUp ###Starting testDistribSearch
   [junit4]   2> 115883 T293 oasc.ZkTestServer.run STARTING ZK TEST SERVER
   [junit4]   1> client port:0.0.0.0/0.0.0.0:0
   [junit4]   2> 115884 T294 oasc.ZkTestServer$ZKServerMain.runFromConfig Starting server
   [junit4]   2> 115984 T293 oasc.ZkTestServer.run start zk server on port:14378
   [junit4]   2> 115986 T293 oascc.SolrZkClient.createZkCredentialsToAddAutomatically Using default ZkCredentialsProvider
   [junit4]   2> 115987 T293 oascc.ConnectionManager.waitForConnected Waiting for client to connect to ZooKeeper
   [junit4]   2> 115997 T301 oascc.ConnectionManager.process Watcher org.apache.solr.common.cloud.ConnectionManager@5f21b6e7 name:ZooKeeperConnection Watcher:127.0.0.1:14378 got event WatchedEvent state:SyncConnected type:None path:null path:null type:None
   [junit4]   2> 115998 T293 oascc.ConnectionManager.waitForConnected Client is connected to ZooKeeper
   [junit4]   2> 115999 T293 oascc.SolrZkClient.createZkACLProvider Using default ZkACLProvider
   [junit4]   2> 115999 T293 oascc.SolrZkClient.makePath makePath: /solr
   [junit4]   2> 116005 T293 oascc.SolrZkClient.createZkCredentialsToAddAutomatically Using default ZkCredentialsProvider
   [junit4]   2> 116007 T293 oascc.ConnectionManager.waitForConnected Waiting for client to connect to ZooKeeper
   [junit4]   2> 116021 T304 oascc.ConnectionManager.process Watcher org.apache.solr.common.cloud.ConnectionManager@59124a9f name:ZooKeeperConnection Watcher:127.0.0.1:14378/solr got event WatchedEvent state:SyncConnected type:None path:null path:null type:None
   [junit4]   2> 116021 T293 oascc.ConnectionManager.waitForConnected Client is connected to ZooKeeper
   [junit4]   2> 116023 T293 oascc.SolrZkClient.createZkACLProvider Using default ZkACLProvider
   [junit4]   2> 116023 T293 oascc.SolrZkClient.makePath makePath: /collections/collection1
   [junit4]   2> 116034 T293 oascc.SolrZkClient.makePath makePath: /collections/collection1/shards
   [junit4]   2> 116040 T293 oascc.SolrZkClient.makePath makePath: /collections/control_collection
   [junit4]   2> 116047 T293 oascc.SolrZkClient.makePath makePath: /collections/control_collection/shards
   [junit4]   2> 116052 T293 oasc.AbstractZkTestCase.putConfig put /usr/home/jenkins/jenkins-slave/workspace/Lucene-Solr-Tests-5.x-Java7/solr/core/src/test-files/solr/collection1/conf/solrconfig-tlog.xml to /configs/conf1/solrconfig.xml
   [junit4]   2> 116054 T293 oascc.SolrZkClient.makePath makePath: /configs/conf1/solrconfig.xml
   [junit4]   2> 116059 T293 oasc.AbstractZkTestCase.putConfig put /usr/home/jenkins/jenkins-slave/workspace/Lucene-Solr-Tests-5.x-Java7/solr/core/src/test-files/solr/collection1/conf/schema.xml to /configs/conf1/schema.xml
   [junit4]   2> 116061 T293 oascc.SolrZkClient.makePath makePath: /configs/conf1/schema.xml
   [junit4]   2> 116066 T293 oasc.AbstractZkTestCase.putConfig put /usr/home/jenkins/jenkins-slave/workspace/Lucene-Solr-Tests-5.x-Java7/solr/core/src/test-files/solr/collection1/conf/solrconfig.snippet.randomindexconfig.xml to /configs/conf1/solrconfig.snippet.randomindexconfig.xml
   [junit4]   2> 116067 T293 oascc.SolrZkClient.makePath makePath: /configs/conf1/solrconfig.snippet.randomindexconfig.xml
   [junit4]   2> 116072 T293 oasc.AbstractZkTestCase.putConfig put /usr/home/jenkins/jenkins-slave/workspace/Lucene-Solr-Tests-5.x-Java7/solr/core/src/test-files/solr/collection1/conf/stopwords.txt to /configs/conf1/stopwords.txt
   [junit4]   2> 116074 T293 oascc.SolrZkClient.makePath makePath: /configs/conf1/stopwords.txt
   [junit4]   2> 116082 T293 oasc.AbstractZkTestCase.putConfig put /usr/home/jenkins/jenkins-slave/workspace/Lucene-Solr-Tests-5.x-Java7/solr/core/src/test-files/solr/collection1/conf/protwords.txt to /configs/conf1/protwords.txt
   [junit4]   2> 116083 T293 oascc.SolrZkClient.makePath makePath: /configs/conf1/protwords.txt
   [junit4]   2> 116089 T293 oasc.AbstractZkTestCase.putConfig put /usr/home/jenkins/jenkins-slave/workspace/Lucene-Solr-Tests-5.x-Java7/solr/core/src/test-files/solr/collection1/conf/currency.xml to /configs/conf1/currency.xml
   [junit4]   2> 116091 T293 oascc.SolrZkClient.makePath makePath: /configs/conf1/currency.xml
   [junit4]   2> 116099 T293 oasc.AbstractZkTestCase.putConfig put /usr/home/jenkins/jenkins-slave/workspace/Lucene-Solr-Tests-5.x-Java7/solr/core/src/test-files/solr/collection1/conf/enumsConfig.xml to /configs/conf1/enumsConfig.xml
   [junit4]   2> 116101 T293 oascc.SolrZkClient.makePath makePath: /configs/conf1/enumsConfig.xml
   [junit4]   2> 116106 T293 oasc.AbstractZkTestCase.putConfig put /usr/home/jenkins/jenkins-slave/workspace/Lucene-Solr-Tests-5.x-Java7/solr/core/src/test-files/solr/collection1/conf/open-exchange-rates.json to /configs/conf1/open-exchange-rates.json
   [junit4]   2> 116108 T293 oascc.SolrZkClient.makePath makePath: /configs/conf1/open-exchange-rates.json
   [junit4]   2> 116114 T293 oasc.AbstractZkTestCase.putConfig put /usr/home/jenkins/jenkins-slave/workspace/Lucene-Solr-Tests-5.x-Java7/solr/core/src/test-files/solr/collection1/conf/mapping-ISOLatin1Accent.txt to /configs/conf1/mapping-ISOLatin1Accent.txt
   [junit4]   2> 116116 T293 oascc.SolrZkClient.makePath makePath: /configs/conf1/mapping-ISOLatin1Accent.txt
   [junit4]   2> 116190 T293 oasc.AbstractZkTestCase.putConfig put /usr/home/jenkins/jenkins-slave/workspace/Lucene-Solr-Tests-5.x-Java7/solr/core/src/test-files/solr/collection1/conf/old_synonyms.txt to /configs/conf1/old_synonyms.txt
   [junit4]   2> 116191 T293 oascc.SolrZkClient.makePath makePath: /configs/conf1/old_synonyms.txt
   [junit4]   2> 116196 T293 oasc.AbstractZkTestCase.putConfig put /usr/home/jenkins/jenkins-slave/workspace/Lucene-Solr-Tests-5.x-Java7/solr/core/src/test-files/solr/collection1/conf/synonyms.txt to /configs/conf1/synonyms.txt
   [junit4]   2> 116198 T293 oascc.SolrZkClient.makePath makePath: /configs/conf1/synonyms.txt
   [junit4]   2> 120684 T293 oejs.Server.doStart jetty-8.1.10.v20130312
   [junit4]   2> 120692 T293 oejs.AbstractConnector.doStart Started SocketConnector@127.0.0.1:65480
   [junit4]   2> 120694 T293 oass.SolrDispatchFilter.init SolrDispatchFilter.init()sun.misc.Launcher$AppClassLoader@749cd006
   [junit4]   2> 120695 T293 oasc.SolrResourceLoader.locateSolrHome JNDI not configured for solr (NoInitialContextEx)
   [junit4]   2> 120695 T293 oasc.SolrResourceLoader.locateSolrHome using system property solr.solr.home: /usr/home/jenkins/jenkins-slave/workspace/Lucene-Solr-Tests-5.x-Java7/solr/build/solr-core/test/J2/temp/solr.cloud.LeaderInitiatedRecoveryOnCommitTest 381A2844D856258D-001/tempDir-002
   [junit4]   2> 120696 T293 oasc.SolrResourceLoader.<init> new SolrResourceLoader for directory: '/usr/home/jenkins/jenkins-slave/workspace/Lucene-Solr-Tests-5.x-Java7/solr/build/solr-core/test/J2/temp/solr.cloud.LeaderInitiatedRecoveryOnCommitTest 381A2844D856258D-001/tempDir-002/'
   [junit4]   2> 120810 T293 oasc.ConfigSolr.fromFile Loading container configuration from /usr/home/jenkins/jenkins-slave/workspace/Lucene-Solr-Tests-5.x-Java7/solr/build/solr-core/test/J2/temp/solr.cloud.LeaderInitiatedRecoveryOnCommitTest 381A2844D856258D-001/tempDir-002/solr.xml
   [junit4]   2> 120994 T293 oasc.CoreContainer.<init> New CoreContainer 1472578136
   [junit4]   2> 120995 T293 oasc.CoreContainer.load Loading cores into CoreContainer [instanceDir=/usr/home/jenkins/jenkins-slave/workspace/Lucene-Solr-Tests-5.x-Java7/solr/build/solr-core/test/J2/temp/solr.cloud.LeaderInitiatedRecoveryOnCommitTest 381A2844D856258D-001/tempDir-002/]
   [junit4]   2> 120996 T293 oashc.HttpShardHandlerFactory.getParameter Setting socketTimeout to: 90000
   [junit4]   2> 120997 T293 oashc.HttpShardHandlerFactory.getParameter Setting urlScheme to: 
   [junit4]   2> 120998 T293 oashc.HttpShardHandlerFactory.getParameter Setting connTimeout to: 15000
   [junit4]   2> 120998 T293 oashc.HttpShardHandlerFactory.getParameter Setting maxConnectionsPerHost to: 20
   [junit4]   2> 120999 T293 oashc.HttpShardHandlerFactory.getParameter Setting maxConnections to: 10000
   [junit4]   2> 120999 T293 oashc.HttpShardHandlerFactory.getParameter Setting corePoolSize to: 0
   [junit4]   2> 121000 T293 oashc.HttpShardHandlerFactory.getParameter Setting maximumPoolSize to: 2147483647
   [junit4]   2> 121000 T293 oashc.HttpShardHandlerFactory.getParameter Setting maxThreadIdleTime to: 5
   [junit4]   2> 121001 T293 oashc.HttpShardHandlerFactory.getParameter Setting sizeOfQueue to: -1
   [junit4]   2> 121001 T293 oashc.HttpShardHandlerFactory.getParameter Setting fairnessPolicy to: false
   [junit4]   2> 121002 T293 oasu.UpdateShardHandler.<init> Creating UpdateShardHandler HTTP client with params: socketTimeout=340000&connTimeout=45000&retry=false
   [junit4]   2> 121003 T293 oasl.LogWatcher.createWatcher SLF4J impl is org.slf4j.impl.Log4jLoggerFactory
   [junit4]   2> 121003 T293 oasl.LogWatcher.newRegisteredLogWatcher Registering Log Listener [Log4j (org.slf4j.impl.Log4jLoggerFactory)]
   [junit4]   2> 121004 T293 oasc.CoreContainer.load Host Name: 127.0.0.1
   [junit4]   2> 121004 T293 oasc.ZkContainer.initZooKeeper Zookeeper client=127.0.0.1:14378/solr
   [junit4]   2> 121005 T293 oasc.ZkController.checkChrootPath zkHost includes chroot
   [junit4]   2> 121006 T293 oascc.SolrZkClient.createZkCredentialsToAddAutomatically Using default ZkCredentialsProvider
   [junit4]   2> 121007 T293 oascc.ConnectionManager.waitForConnected Waiting for client to connect to ZooKeeper
   [junit4]   2> 121010 T316 oascc.ConnectionManager.process Watcher org.apache.solr.common.cloud.ConnectionManager@3608d746 name:ZooKeeperConnection Watcher:127.0.0.1:14378 got event WatchedEvent state:SyncConnected type:None path:null path:null type:None
   [junit4]   2> 121011 T293 oascc.ConnectionManager.waitForConnected Client is connected to ZooKeeper
   [junit4]   2> 121013 T293 oascc.SolrZkClient.createZkACLProvider Using default ZkACLProvider
   [junit4]   2> 121017 T293 oascc.ConnectionManager.waitForConnected Waiting for client to connect to ZooKeeper
   [junit4]   2> 121021 T319 oascc.ConnectionManager.process Watcher org.apache.solr.common.cloud.ConnectionManager@4623ddda name:ZooKeeperConnection Watcher:127.0.0.1:14378/solr got event WatchedEvent state:SyncConnected type:None path:null path:null type:None
   [junit4]   2> 121021 T293 oascc.ConnectionManager.waitForConnected Client is connected to ZooKeeper
   [junit4]   2> 121025 T293 oascc.SolrZkClient.makePath makePath: /overseer/queue
   [junit4]   2> 121031 T293 oascc.SolrZkClient.makePath makePath: /overseer/collection-queue-work
   [junit4]   2> 121036 T293 oascc.SolrZkClient.makePath makePath: /overseer/collection-map-running
   [junit4]   2> 121041 T293 oascc.SolrZkClient.makePath makePath: /overseer/collection-map-completed
   [junit4]   2> 121046 T293 oascc.SolrZkClient.makePath makePath: /overseer/collection-map-failure
   [junit4]   2> 121052 T293 oascc.SolrZkClient.makePath makePath: /live_nodes
   [junit4]   2> 121054 T293 oasc.ZkController.createEphemeralLiveNode Register node as live in ZooKeeper:/live_nodes/127.0.0.1:23954_iyotk%2Ft
   [junit4]   2> 121056 T293 oascc.SolrZkClient.makePath makePath: /live_nodes/127.0.0.1:23954_iyotk%2Ft
   [junit4]   2> 121060 T293 oascc.SolrZkClient.makePath makePath: /overseer_elect
   [junit4]   2> 121064 T293 oascc.SolrZkClient.makePath makePath: /overseer_elect/election
   [junit4]   2> 121067 T293 oasc.Overseer.close Overseer (id=null) closing
   [junit4]   2> 121070 T293 oasc.OverseerElectionContext.runLeaderProcess I am going to be the leader 127.0.0.1:23954_iyotk%2Ft
   [junit4]   2> 121071 T293 oascc.SolrZkClient.makePath makePath: /overseer_elect/leader
   [junit4]   2> 121075 T293 oasc.Overseer.start Overseer (id=93120564722401283-127.0.0.1:23954_iyotk%2Ft-n_0000000000) starting
   [junit4]   2> 121080 T293 oascc.SolrZkClient.makePath makePath: /overseer/queue-work
   [junit4]   2> 121095 T293 oasc.OverseerAutoReplicaFailoverThread.<init> Starting OverseerAutoReplicaFailoverThread autoReplicaFailoverWorkLoopDelay=10000 autoReplicaFailoverWaitAfterExpiration=30000 autoReplicaFailoverBadNodeExpiration=60000
   [junit4]   2> 121096 T321 oasc.OverseerCollectionProcessor.run Process current queue of collection creations
   [junit4]   2> 121097 T293 oascc.SolrZkClient.makePath makePath: /clusterstate.json
   [junit4]   2> 121102 T293 oascc.SolrZkClient.makePath makePath: /aliases.json
   [junit4]   2> 121105 T293 oascc.ZkStateReader.createClusterStateWatchersAndUpdate Updating cluster state from ZooKeeper... 
   [junit4]   2> 121113 T320 oasc.Overseer$ClusterStateUpdater.run Starting to work on the main queue
   [junit4]   2> 121144 T323 oasc.ZkController.publish publishing core=collection1 state=down collection=control_collection
   [junit4]   2> 121145 T323 oasc.ZkController.publish numShards not found on descriptor - reading it from system property
   [junit4]   2> 121146 T319 oasc.DistributedQueue$LatchWatcher.process NodeChildrenChanged fired on path /overseer/queue state SyncConnected
   [junit4]   2> 121146 T323 oasc.ZkController.waitForCoreNodeName look for our core node name
   [junit4]   2> 121152 T320 oasc.Overseer$ClusterStateUpdater.run processMessage: queueSize: 0, message = {
   [junit4]   2> 	  "numShards":"1",
   [junit4]   2> 	  "state":"down",
   [junit4]   2> 	  "core":"collection1",
   [junit4]   2> 	  "shard":null,
   [junit4]   2> 	  "base_url":"http://127.0.0.1:23954/iyotk/t",
   [junit4]   2> 	  "operation":"state",
   [junit4]   2> 	  "collection":"control_collection",
   [junit4]   2> 	  "roles":null,
   [junit4]   2> 	  "node_name":"127.0.0.1:23954_iyotk%2Ft"} current state version: 0
   [junit4]   2> 121153 T320 oasco.ReplicaMutator.updateState Update state numShards=1 message={
   [junit4]   2> 	  "numShards":"1",
   [junit4]   2> 	  "state":"down",
   [junit4]   2> 	  "core":"collection1",
   [junit4]   2> 	  "shard":null,
   [junit4]   2> 	  "base_url":"http://127.0.0.1:23954/iyotk/t",
   [junit4]   2> 	  "operation":"state",
   [junit4]   2> 	  "collection":"control_collection",
   [junit4]   2> 	  "roles":null,
   [junit4]   2> 	  "node_name":"127.0.0.1:23954_iyotk%2Ft"}
   [junit4]   2> 121154 T320 oasco.ClusterStateMutator.createCollection building a new cName: control_collection
   [junit4]   2> 121154 T320 oasco.ReplicaMutator.updateState Assigning new node to shard shard=shard1
   [junit4]   2> 121157 T319 oascc.ZkStateReader$2.process A cluster state change: WatchedEvent state:SyncConnected type:NodeDataChanged path:/clusterstate.json, has occurred - updating... (live nodes size: 1)
   [junit4]   2> 122148 T323 oasc.ZkController.waitForShardId waiting to find shard id in clusterstate for collection1
   [junit4]   2> 122149 T323 oasc.ZkController.createCollectionZkNode Check for collection zkNode:control_collection
   [junit4]   2> 122150 T323 oasc.ZkController.createCollectionZkNode Collection zkNode exists
   [junit4]   2> 122151 T323 oascc.ZkStateReader.readConfigName Load collection config from:/collections/control_collection
   [junit4]   2> 122153 T323 oascc.ZkStateReader.readConfigName path=/collections/control_collection configName=conf1 specified config exists in ZooKeeper
   [junit4]   2> 122153 T323 oasc.SolrResourceLoader.<init> new SolrResourceLoader for directory: '/usr/home/jenkins/jenkins-slave/workspace/Lucene-Solr-Tests-5.x-Java7/solr/build/solr-core/test/J2/temp/solr.cloud.LeaderInitiatedRecoveryOnCommitTest 381A2844D856258D-001/tempDir-002/collection1/'
   [junit4]   2> 122159 T323 oasc.SolrResourceLoader.replaceClassLoader Adding 'file:/usr/home/jenkins/jenkins-slave/workspace/Lucene-Solr-Tests-5.x-Java7/solr/build/solr-core/test/J2/temp/solr.cloud.LeaderInitiatedRecoveryOnCommitTest%20381A2844D856258D-001/tempDir-002/collection1/lib/.svn/' to classloader
   [junit4]   2> 122161 T323 oasc.SolrResourceLoader.replaceClassLoader Adding 'file:/usr/home/jenkins/jenkins-slave/workspace/Lucene-Solr-Tests-5.x-Java7/solr/build/solr-core/test/J2/temp/solr.cloud.LeaderInitiatedRecoveryOnCommitTest%20381A2844D856258D-001/tempDir-002/collection1/lib/README' to classloader
   [junit4]   2> 122164 T323 oasc.SolrResourceLoader.replaceClassLoader Adding 'file:/usr/home/jenkins/jenkins-slave/workspace/Lucene-Solr-Tests-5.x-Java7/solr/build/solr-core/test/J2/temp/solr.cloud.LeaderInitiatedRecoveryOnCommitTest%20381A2844D856258D-001/tempDir-002/collection1/lib/classes/' to classloader
   [junit4]   2> 122221 T323 oasc.ZkController.watchZKConfDir watch zkdir /configs/conf1
   [junit4]   2> 122225 T323 oasc.Config.<init> loaded config solrconfig.xml with version 0 
   [junit4]   2> 122240 T323 oasc.SolrConfig.refreshRequestParams current version of requestparams : -1
   [junit4]   2> 122266 T323 oasc.SolrConfig.<init> Using Lucene MatchVersion: 5.0.0
   [junit4]   2> 122334 T323 oasc.SolrConfig.<init> Loaded SolrConfig: solrconfig.xml
   [junit4]   2> 122337 T323 oass.IndexSchema.readSchema Reading Solr Schema from /configs/conf1/schema.xml
   [junit4]   2> 122356 T323 oass.IndexSchema.readSchema [collection1] Schema name=test
   [junit4]   2> 123244 T323 oass.OpenExchangeRatesOrgProvider.init Initialized with rates=open-exchange-rates.json, refreshInterval=1440.
   [junit4]   2> 123286 T323 oass.IndexSchema.readSchema default search field in schema is text
   [junit4]   2> 123293 T323 oass.IndexSchema.readSchema unique key field: id
   [junit4]   2> 123325 T323 oass.FileExchangeRateProvider.reload Reloading exchange rates from file currency.xml
   [junit4]   2> 123337 T323 oass.FileExchangeRateProvider.reload Reloading exchange rates from file currency.xml
   [junit4]   2> 123348 T323 oass.OpenExchangeRatesOrgProvider.reload Reloading exchange rates from open-exchange-rates.json
   [junit4]   2> 123351 T323 oass.OpenExchangeRatesOrgProvider$OpenExchangeRates.<init> WARN Unknown key IMPORTANT NOTE
   [junit4]   2> 123352 T323 oass.OpenExchangeRatesOrgProvider$OpenExchangeRates.<init> WARN Expected key, got STRING
   [junit4]   2> 123353 T323 oass.OpenExchangeRatesOrgProvider.reload Reloading exchange rates from open-exchange-rates.json
   [junit4]   2> 123355 T323 oass.OpenExchangeRatesOrgProvider$OpenExchangeRates.<init> WARN Unknown key IMPORTANT NOTE
   [junit4]   2> 123356 T323 oass.OpenExchangeRatesOrgProvider$OpenExchangeRates.<init> WARN Expected key, got STRING
   [junit4]   2> 123356 T323 oasc.CoreContainer.create Creating SolrCore 'collection1' using configuration from collection control_collection
   [junit4]   2> 123357 T323 oasc.SolrCore.initDirectoryFactory org.apache.solr.core.MockDirectoryFactory
   [junit4]   2> 123358 T323 oasc.SolrCore.<init> [collection1] Opening new SolrCore at /usr/home/jenkins/jenkins-slave/workspace/Lucene-Solr-Tests-5.x-Java7/solr/build/solr-core/test/J2/temp/solr.cloud.LeaderInitiatedRecoveryOnCommitTest 381A2844D856258D-001/tempDir-002/collection1/, dataDir=/usr/home/jenkins/jenkins-slave/workspace/Lucene-Solr-Tests-5.x-Java7/solr/build/solr-core/test/J2/temp/solr.cloud.LeaderInitiatedRecoveryOnCommitTest 381A2844D856258D-001/tempDir-001/control/data/
   [junit4]   2> 123358 T323 oasc.JmxMonitoredMap.<init> JMX monitoring is enabled. Adding Solr mbeans to JMX Server: com.sun.jmx.mbeanserver.JmxMBeanServer@4de43413
   [junit4]   2> 123360 T323 oasc.CachingDirectoryFactory.get return new directory for /usr/home/jenkins/jenkins-slave/workspace/Lucene-Solr-Tests-5.x-Java7/solr/build/solr-core/test/J2/temp/solr.cloud.LeaderInitiatedRecoveryOnCommitTest 381A2844D856258D-001/tempDir-001/control/data
   [junit4]   2> 123360 T323 oasc.SolrCore.getNewIndexDir New index directory detected: old=null new=/usr/home/jenkins/jenkins-slave/workspace/Lucene-Solr-Tests-5.x-Java7/solr/build/solr-core/test/J2/temp/solr.cloud.LeaderInitiatedRecoveryOnCommitTest 381A2844D856258D-001/tempDir-001/control/data/index/
   [junit4]   2> 123361 T323 oasc.SolrCore.initIndex WARN [collection1] Solr index directory '/usr/home/jenkins/jenkins-slave/workspace/Lucene-Solr-Tests-5.x-Java7/solr/build/solr-core/test/J2/temp/solr.cloud.LeaderInitiatedRecoveryOnCommitTest 381A2844D856258D-001/tempDir-001/control/data/index' doesn't exist. Creating new index...
   [junit4]   2> 123361 T323 oasc.CachingDirectoryFactory.get return new directory for /usr/home/jenkins/jenkins-slave/workspace/Lucene-Solr-Tests-5.x-Java7/solr/build/solr-core/test/J2/temp/solr.cloud.LeaderInitiatedRecoveryOnCommitTest 381A2844D856258D-001/tempDir-001/control/data/index
   [junit4]   2> 123362 T323 oasu.RandomMergePolicy.<init> RandomMergePolicy wrapping class org.apache.lucene.index.TieredMergePolicy: [TieredMergePolicy: maxMergeAtOnce=23, maxMergeAtOnceExplicit=30, maxMergedSegmentMB=53.2734375, floorSegmentMB=1.869140625, forceMergeDeletesPctAllowed=17.353021184473246, segmentsPerTier=24.0, maxCFSSegmentSizeMB=8.796093022207999E12, noCFSRatio=1.0
   [junit4]   2> 123364 T323 oasc.SolrDeletionPolicy.onCommit SolrDeletionPolicy.onCommit: commits: num=1
   [junit4]   2> 		commit{dir=MockDirectoryWrapper(RAMDirectory@1c4d2646 lockFactory=org.apache.lucene.store.SingleInstanceLockFactory@d0bcc2e),segFN=segments_1,generation=1}
   [junit4]   2> 123364 T323 oasc.SolrDeletionPolicy.updateCommits newest commit generation = 1
   [junit4]   2> 123371 T323 oasup.UpdateRequestProcessorChain.init creating updateRequestProcessorChain "nodistrib"
   [junit4]   2> 123372 T323 oasup.UpdateRequestProcessorChain.init creating updateRequestProcessorChain "dedupe"
   [junit4]   2> 123372 T323 oasup.UpdateRequestProcessorChain.init inserting DistributedUpdateProcessorFactory into updateRequestProcessorChain "dedupe"
   [junit4]   2> 123373 T323 oasup.UpdateRequestProcessorChain.init creating updateRequestProcessorChain "stored_sig"
   [junit4]   2> 123373 T323 oasup.UpdateRequestProcessorChain.init inserting DistributedUpdateProcessorFactory into updateRequestProcessorChain "stored_sig"
   [junit4]   2> 123373 T323 oasup.UpdateRequestProcessorChain.init creating updateRequestProcessorChain "distrib-dup-test-chain-explicit"
   [junit4]   2> 123374 T323 oasup.UpdateRequestProcessorChain.init creating updateRequestProcessorChain "distrib-dup-test-chain-implicit"
   [junit4]   2> 123374 T323 oasup.UpdateRequestProcessorChain.init inserting DistributedUpdateProcessorFactory into updateRequestProcessorChain "distrib-dup-test-chain-implicit"
   [junit4]   2> 123374 T323 oasc.SolrCore.loadUpdateProcessorChains no updateRequestProcessorChain defined as default, creating implicit default
   [junit4]   2> 123376 T323 oasc.RequestHandlers.initHandlersFromConfig created /update: org.apache.solr.handler.UpdateRequestHandler
   [junit4]   2> 123376 T323 oasc.RequestHandlers.initHandlersFromConfig created /update/json: org.apache.solr.handler.UpdateRequestHandler
   [junit4]   2> 123377 T323 oasc.RequestHandlers.initHandlersFromConfig created /update/csv: org.apache.solr.handler.UpdateRequestHandler
   [junit4]   2> 123378 T323 oasc.RequestHandlers.initHandlersFromConfig created /update/json/docs: org.apache.solr.handler.UpdateRequestHandler
   [junit4]   2> 123378 T323 oasc.RequestHandlers.initHandlersFromConfig created /config: org.apache.solr.handler.SolrConfigHandler
   [junit4]   2> 123379 T323 oasc.RequestHandlers.initHandlersFromConfig created /schema: org.apache.solr.handler.SchemaHandler
   [junit4]   2> 123380 T323 oasc.RequestHandlers.initHandlersFromConfig created /replication: org.apache.solr.handler.ReplicationHandler
   [junit4]   2> 123380 T323 oasc.RequestHandlers.initHandlersFromConfig created /get: org.apache.solr.handler.RealTimeGetHandler
   [junit4]   2> 123381 T323 oasc.RequestHandlers.initHandlersFromConfig created /admin/luke: org.apache.solr.handler.admin.LukeRequestHandler
   [junit4]   2> 123382 T323 oasc.RequestHandlers.initHandlersFromConfig created /admin/system: org.apache.solr.handler.admin.SystemInfoHandler
   [junit4]   2> 123383 T323 oasc.RequestHandlers.initHandlersFromConfig created /admin/mbeans: org.apache.solr.handler.admin.SolrInfoMBeanHandler
   [junit4]   2> 123384 T323 oasc.RequestHandlers.initHandlersFromConfig created /admin/plugins: org.apache.solr.handler.admin.PluginInfoHandler
   [junit4]   2> 123385 T323 oasc.RequestHandlers.initHandlersFromConfig created /admin/threads: org.apache.solr.handler.admin.ThreadDumpHandler
   [junit4]   2> 123385 T323 oasc.RequestHandlers.initHandlersFromConfig created /admin/properties: org.apache.solr.handler.admin.PropertiesRequestHandler
   [junit4]   2> 123386 T323 oasc.RequestHandlers.initHandlersFromConfig created /admin/logging: org.apache.solr.handler.admin.LoggingHandler
   [junit4]   2> 123387 T323 oasc.RequestHandlers.initHandlersFromConfig created /admin/ping: org.apache.solr.handler.PingRequestHandler
   [junit4]   2> 123387 T323 oasc.RequestHandlers.initHandlersFromConfig created standard: solr.StandardRequestHandler
   [junit4]   2> 123388 T323 oasc.RequestHandlers.initHandlersFromConfig created /admin/file: solr.admin.ShowFileRequestHandler
   [junit4]   2> 123427 T323 oashl.XMLLoader.init xsltCacheLifetimeSeconds=60
   [junit4]   2> 123430 T323 oashl.XMLLoader.init xsltCacheLifetimeSeconds=60
   [junit4]   2> 123432 T323 oashl.XMLLoader.init xsltCacheLifetimeSeconds=60
   [junit4]   2> 123434 T323 oashl.XMLLoader.init xsltCacheLifetimeSeconds=60
   [junit4]   2> 123436 T323 oasc.SolrCore.initStatsCache Using default statsCache cache: org.apache.solr.search.stats.LocalStatsCache
   [junit4]   2> 123441 T323 oasu.CommitTracker.<init> Hard AutoCommit: disabled
   [junit4]   2> 123441 T323 oasu.CommitTracker.<init> Soft AutoCommit: disabled
   [junit4]   2> 123442 T323 oasu.RandomMergePolicy.<init> RandomMergePolicy wrapping class org.apache.lucene.index.LogByteSizeMergePolicy: [LogByteSizeMergePolicy: minMergeSize=1677721, mergeFactor=41, maxMergeSize=2147483648, maxMergeSizeForForcedMerge=9223372036854775807, calibrateSizeByDeletes=false, maxMergeDocs=2147483647, maxCFSSegmentSizeMB=8.796093022207999E12, noCFSRatio=1.0]
   [junit4]   2> 123443 T323 oasc.SolrDeletionPolicy.onInit SolrDeletionPolicy.onInit: commits: num=1
   [junit4]   2> 		commit{dir=MockDirectoryWrapper(RAMDirectory@1c4d2646 lockFactory=org.apache.lucene.store.SingleInstanceLockFactory@d0bcc2e),segFN=segments_1,generation=1}
   [junit4]   2> 123443 T323 oasc.SolrDeletionPolicy.updateCommits newest commit generation = 1
   [junit4]   2> 123444 T323 oass.SolrIndexSearcher.<init> Opening Searcher@2ffd5a29[collection1] main
   [junit4]   2> 123444 T323 oascc.ZkStateReader.readConfigName Load collection config from:/collections/control_collection
   [junit4]   2> 123446 T323 oascc.ZkStateReader.readConfigName path=/collections/control_collection configName=conf1 specified config exists in ZooKeeper
   [junit4]   2> 123446 T323 oasr.ManagedResourceStorage.newStorageIO Setting up ZooKeeper-based storage for the RestManager with znodeBase: /configs/conf1
   [junit4]   2> 123447 T323 oasr.ManagedResourceStorage$ZooKeeperStorageIO.configure Configured ZooKeeperStorageIO with znodeBase: /configs/conf1
   [junit4]   2> 123447 T323 oasr.RestManager.init Initializing RestManager with initArgs: {}
   [junit4]   2> 123448 T323 oasr.ManagedResourceStorage.load Reading _rest_managed.json using ZooKeeperStorageIO:path=/configs/conf1
   [junit4]   2> 123449 T323 oasr.ManagedResourceStorage$ZooKeeperStorageIO.openInputStream No data found for znode /configs/conf1/_rest_managed.json
   [junit4]   2> 123449 T323 oasr.ManagedResourceStorage.load Loaded null at path _rest_managed.json using ZooKeeperStorageIO:path=/configs/conf1
   [junit4]   2> 123449 T323 oasr.RestManager.init Initializing 0 registered ManagedResources
   [junit4]   2> 123450 T323 oash.ReplicationHandler.inform Commits will be reserved for  10000
   [junit4]   2> 123452 T324 oasc.SolrCore.registerSearcher [collection1] Registered new searcher Searcher@2ffd5a29[collection1] main{ExitableDirectoryReader(UninvertingDirectoryReader())}
   [junit4]   2> 123453 T323 oasc.CoreContainer.registerCore registering core: collection1
   [junit4]   2> 123454 T327 oasc.ZkController.register Register replica - core:collection1 address:http://127.0.0.1:23954/iyotk/t collection:control_collection shard:shard1
   [junit4]   2> 123455 T293 oass.SolrDispatchFilter.init user.dir=/usr/home/jenkins/jenkins-slave/workspace/Lucene-Solr-Tests-5.x-Java7/solr/build/solr-core/test/J2
   [junit4]   2> 123455 T293 oass.SolrDispatchFilter.init SolrDispatchFilter.init() done
   [junit4]   2> 123456 T327 oascc.SolrZkClient.makePath makePath: /collections/control_collection/leader_elect/shard1/election
   [junit4]   2> 123464 T293 oascc.SolrZkClient.createZkCredentialsToAddAutomatically Using default ZkCredentialsProvider
   [junit4]   2> 123466 T327 oasc.ShardLeaderElectionContext.runLeaderProcess Running the leader process for shard shard1
   [junit4]   2> 123466 T293 oascc.ConnectionManager.waitForConnected Waiting for client to connect to ZooKeeper
   [junit4]   2> 123469 T331 oascc.ConnectionManager.process Watcher org.apache.solr.common.cloud.ConnectionManager@3c9f832d name:ZooKeeperConnection Watcher:127.0.0.1:14378/solr got event WatchedEvent state:SyncConnected type:None path:null path:null type:None
   [junit4]   2> 123469 T293 oascc.ConnectionManager.waitForConnected Client is connected to ZooKeeper
   [junit4]   2> 123471 T293 oascc.SolrZkClient.createZkACLProvider Using default ZkACLProvider
   [junit4]   2> 123472 T319 oasc.DistributedQueue$LatchWatcher.process NodeChildrenChanged fired on path /overseer/queue state SyncConnected
   [junit4]   2> 123473 T327 oasc.ShardLeaderElectionContext.waitForReplicasToComeUp Enough replicas found to continue.
   [junit4]   2> 123473 T327 oasc.ShardLeaderElectionContext.runLeaderProcess I may be the new leader - try and sync
   [junit4]   2> 123474 T293 oascc.ZkStateReader.createClusterStateWatchersAndUpdate Updating cluster state from ZooKeeper... 
   [junit4]   2> 123474 T320 oasc.Overseer$ClusterStateUpdater.run processMessage: queueSize: 1, message = {
   [junit4]   2> 	  "operation":"leader",
   [junit4]   2> 	  "shard":"shard1",
   [junit4]   2> 	  "collection":"control_collection"} current state version: 1
   [junit4]   2> ASYNC  NEW_CORE C18 name=collection1 org.apache.solr.core.SolrCore@1c2b7850 url=http://127.0.0.1:23954/iyotk/t/collection1 node=127.0.0.1:23954_iyotk%2Ft C18_STATE=coll:control_collection core:collection1 props:{state=down, core=collection1, base_url=http://127.0.0.1:23954/iyotk/t, node_name=127.0.0.1:23954_iyotk%2Ft}
   [junit4]   2> 123474 T327 C18 P23954 oasc.SyncStrategy.sync Sync replicas to http://127.0.0.1:23954/iyotk/t/collection1/
   [junit4]   2> 123475 T327 C18 P23954 oasc.SyncStrategy.syncReplicas Sync Success - now sync replicas to me
   [junit4]   2> 123476 T327 C18 P23954 oasc.SyncStrategy.syncToMe http://127.0.0.1:23954/iyotk/t/collection1/ has no replicas
   [junit4]   2> 123476 T327 oasc.ShardLeaderElectionContext.runLeaderProcess I am the new leader: http://127.0.0.1:23954/iyotk/t/collection1/ shard1
   [junit4]   2> 123477 T327 oascc.SolrZkClient.makePath makePath: /collections/control_collection/leaders/shard1
   [junit4]   2> 123477 T331 oascc.ZkStateReader$2.process A cluster state change: WatchedEvent state:SyncConnected type:NodeDataChanged path:/clusterstate.json, has occurred - updating... (live nodes size: 0)
   [junit4]   2> 123478 T319 oascc.ZkStateReader$2.process A cluster state change: WatchedEvent state:SyncConnected type:NodeDataChanged path:/clusterstate.json, has occurred - updating... (live nodes size: 1)
   [junit4]   2> 123481 T293 oasc.ChaosMonkey.monkeyLog monkey: init - expire sessions:false cause connection loss:false
   [junit4]   2> 123481 T293 oasc.AbstractFullDistribZkTestBase.createJettys Creating collection1 with stateFormat=2
   [junit4]   2> 123482 T293 oascc.SolrZkClient.createZkCredentialsToAddAutomatically Using default ZkCredentialsProvider
   [junit4]   2> 123485 T293 oascc.ConnectionManager.waitForConnected Waiting for client to connect to ZooKeeper
   [junit4]   2> 123487 T334 oascc.ConnectionManager.process Watcher org.apache.solr.common.cloud.ConnectionManager@597fff3f name:ZooKeeperConnection Watcher:127.0.0.1:14378/solr got event WatchedEvent state:SyncConnected type:None path:null path:null type:None
   [junit4]   2> 123487 T335 oasc.DistributedQueue$LatchWatcher.process NodeChildrenChanged fired on path /overseer/queue state SyncConnected
   [junit4]   2> 123488 T293 oascc.ConnectionManager.waitForConnected Client is connected to ZooKeeper
   [junit4]   2> 123489 T293 oascc.SolrZkClient.createZkACLProvider Using default ZkACLProvider
   [junit4]   2> 123490 T320 oasc.Overseer$ClusterStateUpdater.run processMessage: queueSize: 1, message = {
   [junit4]   2> 	  "operation":"leader",
   [junit4]   2> 	  "shard":"shard1",
   [junit4]   2> 	  "collection":"control_collection",
   [junit4]   2> 	  "base_url":"http://127.0.0.1:23954/iyotk/t",
   [junit4]   2> 	  "core":"collection1",
   [junit4]   2> 	  "state":"active"} current state version: 2
   [junit4]   2> 123497 T320 oasc.Overseer$ClusterStateUpdater.run processMessage: queueSize: 1, message = {
   [junit4]   2> 	  "operation":"create",
   [junit4]   2> 	  "name":"collection1",
   [junit4]   2> 	  "numShards":"1",
   [junit4]   2> 	  "stateFormat":2} current state version: 2
   [junit4]   2> 123498 T320 oasco.ClusterStateMutator.createCollection building a new cName: collection1
   [junit4]   2> 123499 T331 oascc.ZkStateReader$2.process A cluster state change: WatchedEvent state:SyncConnected type:NodeDataChanged path:/clusterstate.json, has occurred - updating... (live nodes size: 1)
   [junit4]   2> 123505 T335 oasc.DistributedQueue$LatchWatcher.process NodeChildrenChanged fired on path /overseer/queue state SyncConnected
   [junit4]   2> 123507 T320 oasco.ZkStateWriter.writePendingUpdates going to create_collection /collections/collection1/state.json
   [junit4]   2> 123509 T331 oascc.ZkStateReader$2.process A cluster state change: WatchedEvent state:SyncConnected type:NodeDataChanged path:/clusterstate.json, has occurred - updating... (live nodes size: 1)
   [junit4]   2> 123539 T327 oasc.ZkController.register We are http://127.0.0.1:23954/iyotk/t/collection1/ and leader is http://127.0.0.1:23954/iyotk/t/collection1/
   [junit4]   2> 123540 T327 oasc.ZkController.register No LogReplay needed for core=collection1 baseURL=http://127.0.0.1:23954/iyotk/t
   [junit4]   2> 123540 T327 oasc.ZkController.checkRecovery I am the leader, no recovery necessary
   [junit4]   2> 123540 T327 oasc.ZkController.publish publishing core=collection1 state=active collection=control_collection
   [junit4]   2> 123541 T327 oasc.ZkController.publish numShards not found on descriptor - reading it from system property
   [junit4]   2> 123543 T319 oasc.DistributedQueue$LatchWatcher.process NodeChildrenChanged fired on path /overseer/queue state SyncConnected
   [junit4]   2> 123547 T320 oasc.Overseer$ClusterStateUpdater.run processMessage: queueSize: 1, message = {
   [junit4]   2> 	  "numShards":"1",
   [junit4]   2> 	  "state":"active",
   [junit4]   2> 	  "core":"collection1",
   [junit4]   2> 	  "shard":"shard1",
   [junit4]   2> 	  "base_url":"http://127.0.0.1:23954/iyotk/t",
   [junit4]   2> 	  "operation":"state",
   [junit4]   2> 	  "collection":"control_collection",
   [junit4]   2> 	  "roles":null,
   [junit4]   2> 	  "node_name":"127.0.0.1:23954_iyotk%2Ft",
   [junit4]   2> 	  "core_node_name":"core_node1"} current state version: 4
   [junit4]   2> 123548 T320 oasco.ReplicaMutator.updateState Update state numShards=1 message={
   [junit4]   2> 	  "numShards":"1",
   [junit4]   2> 	  "state":"active",
   [junit4]   2> 	  "core":"collection1",
   [junit4]   2> 	  "shard":"shard1",
   [junit4]   2> 	  "base_url":"http://127.0.0.1:23954/iyotk/t",
   [junit4]   2> 	  "operation":"state",
   [junit4]   2> 	  "collection":"control_collection",
   [junit4]   2> 	  "roles":null,
   [junit4]   2> 	  "node_name":"127.0.0.1:23954_iyotk%2Ft",
   [junit4]   2> 	  "core_node_name":"core_node1"}
   [junit4]   2> 123655 T319 oascc.ZkStateReader$2.process A cluster state change: WatchedEvent state:SyncConnected type:NodeDataChanged path:/clusterstate.json, has occurred - updating... (live nodes size: 1)
   [junit4]   2> 123655 T331 oascc.ZkStateReader$2.process A cluster state change: WatchedEvent state:SyncConnected type:NodeDataChanged path:/clusterstate.json, has occurred - updating... (live nodes size: 1)
   [junit4]   2> 128439 T293 oasc.AbstractFullDistribZkTestBase.createJettys create jetty 1
   [junit4]   2> 128441 T293 oejs.Server.doStart jetty-8.1.10.v20130312
   [junit4]   2> 128446 T293 oejs.AbstractConnector.doStart Started SocketConnector@127.0.0.1:41305
   [junit4]   2> 128447 T293 oass.SolrDispatchFilter.init SolrDispatchFilter.init()sun.misc.Launcher$AppClassLoader@749cd006
   [junit4]   2> 128447 T293 oasc.SolrResourceLoader.locateSolrHome JNDI not configured for solr (NoInitialContextEx)
   [junit4]   2> 128448 T293 oasc.SolrResourceLoader.locateSolrHome using system property solr.solr.home: /usr/home/jenkins/jenkins-slave/workspace/Lucene-Solr-Tests-5.x-Java7/solr/build/solr-core/test/J2/temp/solr.cloud.LeaderInitiatedRecoveryOnCommitTest 381A2844D856258D-001/tempDir-003
   [junit4]   2> 128448 T293 oasc.SolrResourceLoader.<init> new SolrResourceLoader for directory: '/usr/home/jenkins/jenkins-slave/workspace/Lucene-Solr-Tests-5.x-Java7/solr/build/solr-core/test/J2/temp/solr.cloud.LeaderInitiatedRecoveryOnCommitTest 381A2844D856258D-001/tempDir-003/'
   [junit4]   2> 128560 T293 oasc.ConfigSolr.fromFile Loading container configuration from /usr/home/jenkins/jenkins-slave/workspace/Lucene-Solr-Tests-5.x-Java7/solr/build/solr-core/test/J2/temp/solr.cloud.LeaderInitiatedRecoveryOnCommitTest 381A2844D856258D-001/tempDir-003/solr.xml
   [junit4]   2> 128731 T293 oasc.CoreContainer.<init> New CoreContainer 537426196
   [junit4]   2> 128732 T293 oasc.CoreContainer.load Loading cores into CoreContainer [instanceDir=/usr/home/jenkins/jenkins-slave/workspace/Lucene-Solr-Tests-5.x-Java7/solr/build/solr-core/test/J2/temp/solr.cloud.LeaderInitiatedRecoveryOnCommitTest 381A2844D856258D-001/tempDir-003/]
   [junit4]   2> 128735 T293 oashc.HttpShardHandlerFactory.getParameter Setting socketTimeout to: 90000
   [junit4]   2> 128735 T293 oashc.HttpShardHandlerFactory.getParameter Setting urlScheme to: 
   [junit4]   2> 128736 T293 oashc.HttpShardHandlerFactory.getParameter Setting connTimeout to: 15000
   [junit4]   2> 128736 T293 oashc.HttpShardHandlerFactory.getParameter Setting maxConnectionsPerHost to: 20
   [junit4]   2> 128737 T293 oashc.HttpShardHandlerFactory.getParameter Setting maxConnections to: 10000
   [junit4]   2> 128738 T293 oashc.HttpShardHandlerFactory.getParameter Setting corePoolSize to: 0
   [junit4]   2> 128738 T293 oashc.HttpShardHandlerFactory.getParameter Setting maximumPoolSize to: 2147483647
   [junit4]   2> 128739 T293 oashc.HttpShardHandlerFactory.getParameter Setting maxThreadIdleTime to: 5
   [junit4]   2> 128740 T293 oashc.HttpShardHandlerFactory.getParameter Setting sizeOfQueue to: -1
   [junit4]   2> 128740 T293 oashc.HttpShardHandlerFactory.getParameter Setting fairnessPolicy to: false
   [junit4]   2> 128742 T293 oasu.UpdateShardHandler.<init> Creating UpdateShardHandler HTTP client with params: socketTimeout=340000&connTimeout=45000&retry=false
   [junit4]   2> 128742 T293 oasl.LogWatcher.createWatcher SLF4J impl is org.slf4j.impl.Log4jLoggerFactory
   [junit4]   2> 128743 T293 oasl.LogWatcher.newRegisteredLogWatcher Registering Log Listener [Log4j (org.slf4j.impl.Log4jLoggerFactory)]
   [junit4]   2> 128744 T293 oasc.CoreContainer.load Host Name: 127.0.0.1
   [junit4]   2> 128744 T293 oasc.ZkContainer.initZooKeeper Zookeeper client=127.0.0.1:14378/solr
   [junit4]   2> 128745 T293 oasc.ZkController.checkChrootPath zkHost includes chroot
   [junit4]   2> 128746 T293 oascc.SolrZkClient.createZkCredentialsToAddAutomatically Using default ZkCredentialsProvider
   [junit4]   2> 128747 T293 oascc.ConnectionManager.waitForConnected Waiting for client to connect to ZooKeeper
   [junit4]   2> 128750 T347 oascc.ConnectionManager.process Watcher org.apache.solr.common.cloud.ConnectionManager@54eca9de name:ZooKeeperConnection Watcher:127.0.0.1:14378 got event WatchedEvent state:SyncConnected type:None path:null path:null type:None
   [junit4]   2> 128751 T293 oascc.ConnectionManager.waitForConnected Client is connected to ZooKeeper
   [junit4]   2> 128753 T293 oascc.SolrZkClient.createZkACLProvider Using default ZkACLProvider
   [junit4]   2> 128759 T293 oascc.ConnectionManager.waitForConnected Waiting for client to connect to ZooKeeper
   [junit4]   2> 128762 T350 oascc.ConnectionManager.process Watcher org.apache.solr.common.cloud.ConnectionManager@6bf2abbd name:ZooKeeperConnection Watcher:127.0.0.1:14378/solr got event WatchedEvent state:SyncConnected type:None path:null path:null type:None
   [junit4]   2> 128763 T293 oascc.ConnectionManager.waitForConnected Client is connected to ZooKeeper
   [junit4]   2> 128774 T293 oascc.ZkStateReader.createClusterStateWatchersAndUpdate Updating cluster state from ZooKeeper... 
   [junit4]   2> 129788 T293 oasc.ZkController.createEphemeralLiveNode Register node as live in ZooKeeper:/live_nodes/127.0.0.1:25547_iyotk%2Ft
   [junit4]   2> 129789 T293 oascc.SolrZkClient.makePath makePath: /live_nodes/127.0.0.1:25547_iyotk%2Ft
   [junit4]   2> 129795 T293 oasc.Overseer.close Overseer (id=null) closing
   [junit4]   2> 129815 T351 oasc.ZkController.publish publishing core=collection1 state=down collection=collection1
   [junit4]   2> 129815 T351 oasc.ZkController.publish numShards not found on descriptor - reading it from system property
   [junit4]   2> 129819 T319 oasc.DistributedQueue$LatchWatcher.process NodeChildrenChanged fired on path /overseer/queue state SyncConnected
   [junit4]   2> 129820 T351 oasc.ZkController.preRegister Registering watch for external collection collection1
   [junit4]   2> 129820 T351 oascc.ZkStateReader.addZkWatch addZkWatch collection1
   [junit4]   2> 129821 T320 oasc.Overseer$ClusterStateUpdater.run processMessage: queueSize: 1, message = {
   [junit4]   2> 	  "numShards":"1",
   [junit4]   2> 	  "state":"down",
   [junit4]   2> 	  "core":"collection1",
   [junit4]   2> 	  "shard":null,
   [junit4]   2> 	  "base_url":"http://127.0.0.1:25547/iyotk/t",
   [junit4]   2> 	  "operation":"state",
   [junit4]   2> 	  "collection":"collection1",
   [junit4]   2> 	  "roles":null,
   [junit4]   2> 	  "node_name":"127.0.0.1:25547_iyotk%2Ft"} current state version: 5
   [junit4]   2> 129821 T351 oascc.ZkStateReader.addZkWatch Updating collection state at /collections/collection1/state.json from ZooKeeper... 
   [junit4]   2> 129822 T320 oasco.ReplicaMutator.updateState Update state numShards=1 message={
   [junit4]   2> 	  "numShards":"1",
   [junit4]   2> 	  "state":"down",
   [junit4]   2> 	  "core":"collection1",
   [junit4]   2> 	  "shard":null,
   [junit4]   2> 	  "base_url":"http://127.0.0.1:25547/iyotk/t",
   [junit4]   2> 	  "operation":"state",
   [junit4]   2> 	  "collection":"collection1",
   [junit4]   2> 	  "roles":null,
   [junit4]   2> 	  "node_name":"127.0.0.1:25547_iyotk%2Ft"}
   [junit4]   2> 129822 T320 oasco.ReplicaMutator.updateState Collection already exists with numShards=1
   [junit4]   2> 129823 T320 oasco.ReplicaMutator.updateState Assigning new node to shard shard=shard1
   [junit4]   2> 129823 T351 oascc.ZkStateReader.updateWatchedCollection Updating data for collection1 to ver 0 
   [junit4]   2> 129823 T351 oasc.ZkController.waitForCoreNodeName look for our core node name
   [junit4]   2> 129826 T320 oasco.ZkStateWriter.writePendingUpdates going to update_collection /collections/collection1/state.json version: 0
   [junit4]   2> 129827 T350 oascc.ZkStateReader$7.process A cluster state change: WatchedEvent state:SyncConnected type:NodeDataChanged path:/collections/collection1/state.json, has occurred - updating... 
   [junit4]   2> 129829 T350 oascc.ZkStateReader.updateWatchedCollection Updating data for collection1 to ver 1 
   [junit4]   2> 130824 T351 oasc.ZkController.waitForShardId waiting to find shard id in clusterstate for collection1
   [junit4]   2> 130825 T351 oasc.ZkController.createCollectionZkNode Check for collection zkNode:collection1
   [junit4]   2> 130827 T351 oasc.ZkController.createCollectionZkNode Collection zkNode exists
   [junit4]   2> 130827 T351 oascc.ZkStateReader.readConfigName Load collection config from:/collections/collection1
   [junit4]   2> 130829 T351 oascc.ZkStateReader.readConfigName path=/collections/collection1 configName=conf1 specified config exists in ZooKeeper
   [junit4]   2> 130829 T351 oasc.SolrResourceLoader.<init> new SolrResourceLoader for directory: '/usr/home/jenkins/jenkins-slave/workspace/Lucene-Solr-Tests-5.x-Java7/solr/build/solr-core/test/J2/temp/solr.cloud.LeaderInitiatedRecoveryOnCommitTest 381A2844D856258D-001/tempDir-003/collection1/'
   [junit4]   2> 130835 T351 oasc.SolrResourceLoader.replaceClassLoader Adding 'file:/usr/home/jenkins/jenkins-slave/workspace/Lucene-Solr-Tests-5.x-Java7/solr/build/solr-core/test/J2/temp/solr.cloud.LeaderInitiatedRecoveryOnCommitTest%20381A2844D856258D-001/tempDir-003/collection1/lib/.svn/' to classloader
   [junit4]   2> 130837 T351 oasc.SolrResourceLoader.replaceClassLoader Adding 'file:/usr/home/jenkins/jenkins-slave/workspace/Lucene-Solr-Tests-5.x-Java7/solr/build/solr-core/test/J2/temp/solr.cloud.LeaderInitiatedRecoveryOnCommitTest%20381A2844D856258D-001/tempDir-003/collection1/lib/README' to classloader
   [junit4]   2> 130838 T351 oasc.SolrResourceLoader.replaceClassLoader Adding 'file:/usr/home/jenkins/jenkins-slave/workspace/Lucene-Solr-Tests-5.x-Java7/solr/build/solr-core/test/J2/temp/solr.cloud.LeaderInitiatedRecoveryOnCommitTest%20381A2844D856258D-001/tempDir-003/collection1/lib/classes/' to classloader
   [junit4]   2> 130934 T351 oasc.ZkController.watchZKConfDir watch zkdir /configs/conf1
   [junit4]   2> 130941 T351 oasc.Config.<init> loaded config solrconfig.xml with version 0 
   [junit4]   2> 130984 T351 oasc.SolrConfig.refreshRequestParams current version of requestparams : -1
   [junit4]   2> 131066 T351 oasc.SolrConfig.<init> Using Lucene MatchVersion: 5.0.0
   [junit4]   2> 131155 T351 oasc.SolrConfig.<init> Loaded SolrConfig: solrconfig.xml
   [junit4]   2> 131157 T351 oass.IndexSchema.readSchema Reading Solr Schema from /configs/conf1/schema.xml
   [junit4]   2> 131181 T351 oass.IndexSchema.readSchema [collection1] Schema name=test
   [junit4]   2> 131948 T351 oass.OpenExchangeRatesOrgProvider.init Initialized with rates=open-exchange-rates.json, refreshInterval=1440.
   [junit4]   2> 131967 T351 oass.IndexSchema.readSchema default search field in schema is text
   [junit4]   2> 131970 T351 oass.IndexSchema.readSchema unique key field: id
   [junit4]   2> 132004 T351 oass.FileExchangeRateProvider.reload Reloading exchange rates from file currency.xml
   [junit4]   2> 132014 T351 oass.FileExchangeRateProvider.reload Reloading exchange rates from file currency.xml
   [junit4]   2> 132025 T351 oass.OpenExchangeRatesOrgProvider.reload Reloading exchange rates from open-exchange-rates.json
   [junit4]   2> 132028 T351 oass.OpenExchangeRatesOrgProvider$OpenExchangeRates.<init> WARN Unknown key IMPORTANT NOTE
   [junit4]   2> 132030 T351 oass.OpenExchangeRatesOrgProvider$OpenExchangeRates.<init> WARN Expected key, got STRING
   [junit4]   2> 132030 T351 oass.OpenExchangeRatesOrgProvider.reload Reloading exchange rates from open-exchange-rates.json
   [junit4]   2> 132033 T351 oass.OpenExchangeRatesOrgProvider$OpenExchangeRates.<init> WARN Unknown key IMPORTANT NOTE
   [junit4]   2> 132033 T351 oass.OpenExchangeRatesOrgProvider$OpenExchangeRates.<init> WARN Expected key, got STRING
   [junit4]   2> 132034 T351 oasc.CoreContainer.create Creating SolrCore 'collection1' using configuration from collection collection1
   [junit4]   2> 132034 T351 oasc.SolrCore.initDirectoryFactory org.apache.solr.core.MockDirectoryFactory
   [junit4]   2> 132035 T351 oasc.SolrCore.<init> [collection1] Opening new SolrCore at /usr/home/jenkins/jenkins-slave/workspace/Lucene-Solr-Tests-5.x-Java7/solr/build/solr-core/test/J2/temp/solr.cloud.LeaderInitiatedRecoveryOnCommitTest 381A2844D856258D-001/tempDir-003/collection1/, dataDir=/usr/home/jenkins/jenkins-slave/workspace/Lucene-Solr-Tests-5.x-Java7/solr/build/solr-core/test/J2/temp/solr.cloud.LeaderInitiatedRecoveryOnCommitTest 381A2844D856258D-001/tempDir-001/jetty1/
   [junit4]   2> 132035 T351 oasc.JmxMonitoredMap.<init> JMX monitoring is enabled. Adding Solr mbeans to JMX Server: com.sun.jmx.mbeanserver.JmxMBeanServer@4de43413
   [junit4]   2> 132037 T351 oasc.CachingDirectoryFactory.get return new directory for /usr/home/jenkins/jenkins-slave/workspace/Lucene-Solr-Tests-5.x-Java7/solr/build/solr-core/test/J2/temp/solr.cloud.LeaderInitiatedRecoveryOnCommitTest 381A2844D856258D-001/tempDir-001/jetty1
   [junit4]   2> 132037 T351 oasc.SolrCore.getNewIndexDir New index directory detected: old=null new=/usr/home/jenkins/jenkins-slave/workspace/Lucene-Solr-Tests-5.x-Java7/solr/build/solr-core/test/J2/temp/solr.cloud.LeaderInitiatedRecoveryOnCommitTest 381A2844D856258D-001/tempDir-001/jetty1/index/
   [junit4]   2> 132038 T351 oasc.SolrCore.initIndex WARN [collection1] Solr index directory '/usr/home/jenkins/jenkins-slave/workspace/Lucene-Solr-Tests-5.x-Java7/solr/build/solr-core/test/J2/temp/solr.cloud.LeaderInitiatedRecoveryOnCommitTest 381A2844D856258D-001/tempDir-001/jetty1/index' doesn't exist. Creating new index...
   [junit4]   2> 132039 T351 oasc.CachingDirectoryFactory.get return new directory for /usr/home/jenkins/jenkins-slave/workspace/Lucene-Solr-Tests-5.x-Java7/solr/build/solr-core/test/J2/temp/solr.cloud.LeaderInitiatedRecoveryOnCommitTest 381A2844D856258D-001/tempDir-001/jetty1/index
   [junit4]   2> 132039 T351 oasu.RandomMergePolicy.<init> RandomMergePolicy wrapping class org.apache.lucene.index.TieredMergePolicy: [TieredMergePolicy: maxMergeAtOnce=23, maxMergeAtOnceExplicit=30, maxMergedSegmentMB=53.2734375, floorSegmentMB=1.869140625, forceMergeDeletesPctAllowed=17.353021184473246, segmentsPerTier=24.0, maxCFSSegmentSizeMB=8.796093022207999E12, noCFSRatio=1.0
   [junit4]   2> 132041 T351 oasc.SolrDeletionPolicy.onCommit SolrDeletionPolicy.onCommit: commits: num=1
   [junit4]   2> 		commit{dir=MockDirectoryWrapper(RAMDirectory@1a08d159 lockFactory=org.apache.lucene.store.SingleInstanceLockFactory@38e83769),segFN=segments_1,generation=1}
   [junit4]   2> 132041 T351 oasc.SolrDeletionPolicy.updateCommits newest commit generation = 1
   [junit4]   2> 132052 T351 oasup.UpdateRequestProcessorChain.init creating updateRequestProcessorChain "nodistrib"
   [junit4]   2> 132053 T351 oasup.UpdateRequestProcessorChain.init creating updateRequestProcessorChain "dedupe"
   [junit4]   2> 132054 T351 oasup.UpdateRequestProcessorChain.init inserting DistributedUpdateProcessorFactory into updateRequestProcessorChain "dedupe"
   [junit4]   2> 132054 T351 oasup.UpdateRequestProcessorChain.init creating updateRequestProcessorChain "stored_sig"
   [junit4]   2> 132055 T351 oasup.UpdateRequestProcessorChain.init inserting DistributedUpdateProcessorFactory into updateRequestProcessorChain "stored_sig"
   [junit4]   2> 132055 T351 oasup.UpdateRequestProcessorChain.init creating updateRequestProcessorChain "distrib-dup-test-chain-explicit"
   [junit4]   2> 132056 T351 oasup.UpdateRequestProcessorChain.init creating updateRequestProcessorChain "distrib-dup-test-chain-implicit"
   [junit4]   2> 132057 T351 oasup.UpdateRequestProcessorChain.init inserting DistributedUpdateProcessorFactory into updateRequestProcessorChain "distrib-dup-test-chain-implicit"
   [junit4]   2> 132057 T351 oasc.SolrCore.loadUpdateProcessorChains no updateRequestProcessorChain defined as default, creating implicit default
   [junit4]   2> 132060 T351 oasc.RequestHandlers.initHandlersFromConfig created /update: org.apache.solr.handler.UpdateRequestHandler
   [junit4]   2> 132062 T351 oasc.RequestHandlers.initHandlersFromConfig created /update/json: org.apache.solr.handler.UpdateRequestHandler
   [junit4]   2> 132062 T351 oasc.RequestHandlers.initHandlersFromConfig created /update/csv: org.apache.solr.handler.UpdateRequestHandler
   [junit4]   2> 132063 T351 oasc.RequestHandlers.initHandlersFromConfig created /update/json/docs: org.apache.solr.handler.UpdateRequestHandler
   [junit4]   2> 132064 T351 oasc.RequestHandlers.initHandlersFromConfig created /config: org.apache.solr.handler.SolrConfigHandler
   [junit4]   2> 132065 T351 oasc.RequestHandlers.initHandlersFromConfig created /schema: org.apache.solr.handler.SchemaHandler
   [junit4]   2> 132067 T351 oasc.RequestHandlers.initHandlersFromConfig created /replication: org.apache.solr.handler.ReplicationHandler
   [junit4]   2> 132068 T351 oasc.RequestHandlers.initHandlersFromConfig created /get: org.apache.solr.handler.RealTimeGetHandler
   [junit4]   2> 132069 T351 oasc.RequestHandlers.initHandlersFromConfig created /admin/luke: org.apache.solr.handler.admin.LukeRequestHandler
   [junit4]   2> 132071 T351 oasc.RequestHandlers.initHandlersFromConfig created /admin/system: org.apache.solr.handler.admin.SystemInfoHandler
   [junit4]   2> 132073 T351 oasc.RequestHandlers.initHandlersFromConfig created /admin/mbeans: org.apache.solr.handler.admin.SolrInfoMBeanHandler
   [junit4]   2> 132074 T351 oasc.RequestHandlers.initHandlersFromConfig created /admin/plugins: org.apache.solr.handler.admin.PluginInfoHandler
   [junit4]   2> 132075 T351 oasc.RequestHandlers.initHandlersFromConfig created /admin/threads: org.apache.solr.handler.admin.ThreadDumpHandler
   [junit4]   2> 132077 T351 oasc.RequestHandlers.initHandlersFromConfig created /admin/properties: org.apache.solr.handler.admin.PropertiesRequestHandler
   [junit4]   2> 132078 T351 oasc.RequestHandlers.initHandlersFromConfig created /admin/logging: org.apache.solr.handler.admin.LoggingHandler
   [junit4]   2> 132080 T351 oasc.RequestHandlers.initHandlersFromConfig created /admin/ping: org.apache.solr.handler.PingRequestHandler
   [junit4]   2> 132082 T351 oasc.RequestHandlers.initHandlersFromConfig created standard: solr.StandardRequestHandler
   [junit4]   2> 132083 T351 oasc.RequestHandlers.initHandlersFromConfig created /admin/file: solr.admin.ShowFileRequestHandler
   [junit4]   2> 132173 T351 oashl.XMLLoader.init xsltCacheLifetimeSeconds=60
   [junit4]   2> 132178 T351 oashl.XMLLoader.init xsltCacheLifetimeSeconds=60
   [junit4]   2> 132183 T351 oashl.XMLLoader.init xsltCacheLifetimeSeconds=60
   [junit4]   2> 132190 T351 oashl.XMLLoader.init xsltCacheLifetimeSeconds=60
   [junit4]   2> 132195 T351 oasc.SolrCore.initStatsCache Using default statsCache cache: org.apache.solr.search.stats.LocalStatsCache
   [junit4]   2> 132201 T351 oasu.CommitTracker.<init> Hard AutoCommit: disabled
   [junit4]   2> 132201 T351 oasu.CommitTracker.<init> Soft AutoCommit: disabled
   [junit4]   2> 132206 T351 oasu.RandomMergePolicy.<init> RandomMergePolicy wrapping class org.apache.lucene.index.LogByteSizeMergePolicy: [LogByteSizeMergePolicy: minMergeSize=1677721, mergeFactor=41, maxMergeSize=2147483648, maxMergeSizeForForcedMerge=9223372036854775807, calibrateSizeByDeletes=false, maxMergeDocs=2147483647, maxCFSSegmentSizeMB=8.796093022207999E12, noCFSRatio=1.0]
   [junit4]   2> 132207 T351 oasc.SolrDeletionPolicy.onInit SolrDeletionPolicy.onInit: commits: num=1
   [junit4]   2> 		commit{dir=MockDirectoryWrapper(RAMDirectory@1a08d159 lockFactory=org.apache.lucene.store.SingleInstanceLockFactory@38e83769),segFN=segments_1,generation=1}
   [junit4]   2> 132207 T351 oasc.SolrDeletionPolicy.updateCommits newest commit generation = 1
   [junit4]   2> 132208 T351 oass.SolrIndexSearcher.<init> Opening Searcher@6ee00905[collection1] main
   [junit4]   2> 132209 T351 oascc.ZkStateReader.readConfigName Load collection config from:/collections/collection1
   [junit4]   2> 132214 T351 oascc.ZkStateReader.readConfigName path=/collections/collection1 configName=conf1 specified config exists in ZooKeeper
   [junit4]   2> 132215 T351 oasr.ManagedResourceStorage.newStorageIO Setting up ZooKeeper-based storage for the RestManager with znodeBase: /configs/conf1
   [junit4]   2> 132216 T351 oasr.ManagedResourceStorage$ZooKeeperStorageIO.configure Configured ZooKeeperStorageIO with znodeBase: /configs/conf1
   [junit4]   2> 132217 T351 oasr.RestManager.init Initializing RestManager with initArgs: {}
   [junit4]   2> 132217 T351 oasr.ManagedResourceStorage.load Reading _rest_managed.json using ZooKeeperStorageIO:path=/configs/conf1
   [junit4]   2> 132218 T351 oasr.ManagedResourceStorage$ZooKeeperStorageIO.openInputStream No data found for znode /configs/conf1/_rest_managed.json
   [junit4]   2> 132219 T351 oasr.ManagedResourceStorage.load Loaded null at path _rest_managed.json using ZooKeeperStorageIO:path=/configs/conf1
   [junit4]   2> 132220 T351 oasr.RestManager.init Initializing 0 registered ManagedResources
   [junit4]   2> 132220 T351 oash.ReplicationHandler.inform Commits will be reserved for  10000
   [junit4]   2> 132222 T352 oasc.SolrCore.registerSearcher [collection1] Registered new searcher Searcher@6ee00905[collection1] main{ExitableDirectoryReader(UninvertingDirectoryReader())}
   [junit4]   2> 132223 T351 oasc.CoreContainer.registerCore registering core: collection1
   [junit4]   2> 132225 T355 oasc.ZkController.register Register replica - core:collection1 address:http://127.0.0.1:25547/iyotk/t collection:collection1 shard:shard1
   [junit4]   2> 132226 T293 oass.SolrDispatchFilter.init user.dir=/usr/home/jenkins/jenkins-slave/workspace/Lucene-Solr-Tests-5.x-Java7/solr/build/solr-core/test/J2
   [junit4]   2> 132227 T293 oass.SolrDispatchFilter.init SolrDispatchFilter.init() done
   [junit4]   2> 132228 T355 oascc.SolrZkClient.makePath makePath: /collections/collection1/leader_elect/shard1/election
   [junit4]   2> 132241 T355 oasc.ShardLeaderElectionContext.runLeaderProcess Running the leader process for shard shard1
   [junit4]   2> 132246 T319 oasc.DistributedQueue$LatchWatcher.process NodeChildrenChanged fired on path /overseer/queue state SyncConnected
   [junit4]   2> 132247 T355 oasc.ShardLeaderElectionContext.waitForReplicasToComeUp Enough replicas found to continue.
   [junit4]   2> 132248 T355 oasc.ShardLeaderElectionContext.runLeaderProcess I may be the new leader - try and sync
   [junit4]   2> ASYNC  NEW_CORE C19 name=collection1 org.apache.solr.core.SolrCore@10ca14a8 url=http://127.0.0.1:25547/iyotk/t/collection1 node=127.0.0.1:25547_iyotk%2Ft C19_STATE=coll:collection1 core:collection1 props:{state=down, core=collection1, base_url=http://127.0.0.1:25547/iyotk/t, node_name=127.0.0.1:25547_iyotk%2Ft}
   [junit4]   2> 132248 T355 C19 P25547 oasc.SyncStrategy.sync Sync replicas to http://127.0.0.1:25547/iyotk/t/collection1/
   [junit4]   2> 132249 T355 C19 P25547 oasc.SyncStrategy.syncReplicas Sync Success - now sync replicas to me
   [junit4]   2> 132249 T320 oasc.Overseer$ClusterStateUpdater.run processMessage: queueSize: 1, message = {
   [junit4]   2> 	  "operation":"leader",
   [junit4]   2> 	  "shard":"shard1",
   [junit4]   2> 	  "collection":"collection1"} current state version: 5
   [junit4]   2> 132249 T355 C19 P25547 oasc.SyncStrategy.syncToMe http://127.0.0.1:25547/iyotk/t/collection1/ has no replicas
   [junit4]   2> 132250 T355 oasc.ShardLeaderElectionContext.runLeaderProcess I am the new leader: http://127.0.0.1:25547/iyotk/t/collection1/ shard1
   [junit4]   2> 132251 T355 oascc.SolrZkClient.makePath makePath: /collections/collection1/leaders/shard1
   [junit4]   2> 132254 T320 oasco.ZkStateWriter.writePendingUpdates going to update_collection /collections/collection1/state.json version: 1
   [junit4]   2> 132257 T350 oascc.ZkStateReader$7.process A cluster state change: Wa

[...truncated too long message...]

 T5013 oascc.ZkStateReader$3.process WARN ZooKeeper watch triggered, but Solr cannot talk to ZK
   [junit4]   2> 1060082 T4821 oejsh.ContextHandler.doStop stopped o.e.j.s.ServletContextHandler{/,null}
   [junit4]   2> 1060278 T4821 oas.SolrTestCaseJ4.tearDown ###Ending testDistribSearch
   [junit4]   2> 1060279 T4821 oasc.ZkTestServer.send4LetterWord connecting to 127.0.0.1:34665 34665
   [junit4]   2> 1060584 T4822 oasc.ZkTestServer.send4LetterWord connecting to 127.0.0.1:34665 34665
   [junit4]   2> 1060586 T4822 oasc.ZkTestServer$ZKServerMain.runFromConfig WARN Watch limit violations: 
   [junit4]   2> 	Maximum concurrent create/delete watches above limit:
   [junit4]   2> 	
   [junit4]   2> 		5	/solr/aliases.json
   [junit4]   2> 		5	/solr/clusterstate.json
   [junit4]   2> 		4	/solr/configs/conf1
   [junit4]   2> 		3	/solr/collections/collection1/state.json
   [junit4]   2> 		2	/solr/collections/c8n_1x2/state.json
   [junit4]   2> 		2	/solr/collections/c8n_crud_1x2/state.json
   [junit4]   2> 	
   [junit4]   2> 	Maximum concurrent children watches above limit:
   [junit4]   2> 	
   [junit4]   2> 		5	/solr/live_nodes
   [junit4]   2> 		4	/solr/overseer/queue
   [junit4]   2> 		4	/solr/overseer/collection-queue-work
   [junit4]   2> 	
   [junit4]   2> 1060586 T4821 oasc.SocketProxy.close WARN Closing 0 connections to: http://127.0.0.1:34681/
   [junit4]   2> 1060587 T4821 oasc.SocketProxy.close WARN Closing 2 connections to: http://127.0.0.1:34668/
   [junit4]   2> 1060587 T4821 oasc.SocketProxy.close WARN Closing 10 connections to: http://127.0.0.1:34677/
   [junit4]   2> 1060587 T4821 oasc.SocketProxy.close WARN Closing 7 connections to: http://127.0.0.1:34685/
   [junit4]   2> NOTE: reproduce with: ant test  -Dtestcase=HttpPartitionTest -Dtests.method=testDistribSearch -Dtests.seed=381A2844D856258D -Dtests.multiplier=2 -Dtests.slow=true -Dtests.locale=en_AU -Dtests.timezone=SystemV/PST8 -Dtests.asserts=true -Dtests.file.encoding=ISO-8859-1
   [junit4] ERROR   76.3s J1 | HttpPartitionTest.testDistribSearch <<<
   [junit4]    > Throwable #1: org.apache.solr.client.solrj.SolrServerException: org.apache.solr.client.solrj.SolrServerException: IOException occured when talking to server at: http://127.0.0.1:34685/c8n_1x2_shard1_replica2
   [junit4]    > 	at __randomizedtesting.SeedInfo.seed([381A2844D856258D:B9FCA65CAF0945B1]:0)
   [junit4]    > 	at org.apache.solr.client.solrj.impl.CloudSolrClient.directUpdate(CloudSolrClient.java:581)
   [junit4]    > 	at org.apache.solr.client.solrj.impl.CloudSolrClient.sendRequest(CloudSolrClient.java:890)
   [junit4]    > 	at org.apache.solr.client.solrj.impl.CloudSolrClient.requestWithRetryOnStaleState(CloudSolrClient.java:793)
   [junit4]    > 	at org.apache.solr.client.solrj.impl.CloudSolrClient.request(CloudSolrClient.java:736)
   [junit4]    > 	at org.apache.solr.cloud.HttpPartitionTest.sendDoc(HttpPartitionTest.java:480)
   [junit4]    > 	at org.apache.solr.cloud.HttpPartitionTest.testRf2(HttpPartitionTest.java:201)
   [junit4]    > 	at org.apache.solr.cloud.HttpPartitionTest.doTest(HttpPartitionTest.java:114)
   [junit4]    > 	at org.apache.solr.BaseDistributedSearchTestCase.testDistribSearch(BaseDistributedSearchTestCase.java:868)
   [junit4]    > 	at java.lang.Thread.run(Thread.java:745)
   [junit4]    > Caused by: org.apache.solr.client.solrj.SolrServerException: IOException occured when talking to server at: http://127.0.0.1:34685/c8n_1x2_shard1_replica2
   [junit4]    > 	at org.apache.solr.client.solrj.impl.HttpSolrClient.executeMethod(HttpSolrClient.java:572)
   [junit4]    > 	at org.apache.solr.client.solrj.impl.HttpSolrClient.request(HttpSolrClient.java:214)
   [junit4]    > 	at org.apache.solr.client.solrj.impl.HttpSolrClient.request(HttpSolrClient.java:210)
   [junit4]    > 	at org.apache.solr.client.solrj.impl.LBHttpSolrClient.doRequest(LBHttpSolrClient.java:353)
   [junit4]    > 	at org.apache.solr.client.solrj.impl.LBHttpSolrClient.request(LBHttpSolrClient.java:312)
   [junit4]    > 	at org.apache.solr.client.solrj.impl.CloudSolrClient.directUpdate(CloudSolrClient.java:578)
   [junit4]    > 	... 47 more
   [junit4]    > Caused by: org.apache.http.NoHttpResponseException: The target server failed to respond
   [junit4]    > 	at org.apache.http.impl.conn.DefaultHttpResponseParser.parseHead(DefaultHttpResponseParser.java:143)
   [junit4]    > 	at org.apache.http.impl.conn.DefaultHttpResponseParser.parseHead(DefaultHttpResponseParser.java:57)
   [junit4]    > 	at org.apache.http.impl.io.AbstractMessageParser.parse(AbstractMessageParser.java:260)
   [junit4]    > 	at org.apache.http.impl.AbstractHttpClientConnection.receiveResponseHeader(AbstractHttpClientConnection.java:283)
   [junit4]    > 	at org.apache.http.impl.conn.DefaultClientConnection.receiveResponseHeader(DefaultClientConnection.java:251)
   [junit4]    > 	at org.apache.http.impl.conn.ManagedClientConnectionImpl.receiveResponseHeader(ManagedClientConnectionImpl.java:197)
   [junit4]    > 	at org.apache.http.protocol.HttpRequestExecutor.doReceiveResponse(HttpRequestExecutor.java:271)
   [junit4]    > 	at org.apache.http.protocol.HttpRequestExecutor.execute(HttpRequestExecutor.java:123)
   [junit4]    > 	at org.apache.http.impl.client.DefaultRequestDirector.tryExecute(DefaultRequestDirector.java:682)
   [junit4]    > 	at org.apache.http.impl.client.DefaultRequestDirector.execute(DefaultRequestDirector.java:486)
   [junit4]    > 	at org.apache.http.impl.client.AbstractHttpClient.doExecute(AbstractHttpClient.java:863)
   [junit4]    > 	at org.apache.http.impl.client.CloseableHttpClient.execute(CloseableHttpClient.java:82)
   [junit4]    > 	at org.apache.http.impl.client.CloseableHttpClient.execute(CloseableHttpClient.java:106)
   [junit4]    > 	at org.apache.http.impl.client.CloseableHttpClient.execute(CloseableHttpClient.java:57)
   [junit4]    > 	at org.apache.solr.client.solrj.impl.HttpSolrClient.executeMethod(HttpSolrClient.java:464)
   [junit4]    > 	... 52 more
   [junit4]   2> 1060601 T4821 oas.SolrTestCaseJ4.deleteCore ###deleteCore
   [junit4]   2> NOTE: leaving temporary files on disk at: /usr/home/jenkins/jenkins-slave/workspace/Lucene-Solr-Tests-5.x-Java7/solr/build/solr-core/test/J1/temp/solr.cloud.HttpPartitionTest 381A2844D856258D-001
   [junit4]   2> NOTE: test params are: codec=Asserting(Lucene50): {id=PostingsFormat(name=LuceneVarGapFixedInterval), text=PostingsFormat(name=Memory doPackFST= false), _version_=FST50, multiDefault=PostingsFormat(name=LuceneFixedGap), a_t=PostingsFormat(name=LuceneFixedGap), timestamp=PostingsFormat(name=LuceneFixedGap), range_facet_l=PostingsFormat(name=LuceneFixedGap), intDefault=FST50}, docValues:{timestamp=DocValuesFormat(name=Direct)}, sim=RandomSimilarityProvider(queryNorm=false,coord=yes): {}, locale=en_AU, timezone=SystemV/PST8
   [junit4]   2> NOTE: FreeBSD 9.1-RELEASE-p3 amd64/Oracle Corporation 1.7.0_65 (64-bit)/cpus=16,threads=1,free=186648456,total=394264576
   [junit4]   2> NOTE: All tests run in this JVM: [TestSearcherReuse, RankQueryTest, InfoHandlerTest, DebugComponentTest, HdfsBasicDistributedZkTest, PluginInfoTest, TestLRUCache, TestDistributedGrouping, TestClusterStateMutator, ScriptEngineTest, TestCloudSchemaless, DirectUpdateHandlerOptimizeTest, DistanceUnitsTest, SoftAutoCommitTest, UpdateRequestProcessorFactoryTest, TestSort, HighlighterMaxOffsetTest, TimeZoneUtilsTest, TestManagedSynonymFilterFactory, TestRandomDVFaceting, TestReplicaProperties, TestFreeTextSuggestions, DeleteInactiveReplicaTest, CollectionsAPIAsyncDistributedZkTest, TestCloudManagedSchemaConcurrent, TestRandomFaceting, TestMaxScoreQueryParser, TestArbitraryIndexDir, TestOmitPositions, CoreAdminHandlerTest, UniqFieldsUpdateProcessorFactoryTest, DistributedQueryComponentOptimizationTest, OverseerCollectionProcessorTest, JSONWriterTest, TestSolrDeletionPolicy2, AnalysisAfterCoreReloadTest, XsltUpdateRequestHandlerTest, SolrRequestParserTest, MoreLikeThisHandlerTest, TestDistribDocBasedVersion, SuggesterFSTTest, TestDocSet, TestWriterPerf, ChaosMonkeyNothingIsSafeTest, RollingRestartTest, LeaderFailoverAfterPartitionTest, TestManagedSchema, TestTolerantSearch, FileBasedSpellCheckerTest, DocumentAnalysisRequestHandlerTest, DOMUtilTest, SuggesterTest, SolrIndexSplitterTest, HttpPartitionTest]
   [junit4] Completed on J1 in 76.30s, 1 test, 1 error <<< FAILURES!

[...truncated 682 lines...]
BUILD FAILED
/usr/home/jenkins/jenkins-slave/workspace/Lucene-Solr-Tests-5.x-Java7/build.xml:529: The following error occurred while executing this line:
/usr/home/jenkins/jenkins-slave/workspace/Lucene-Solr-Tests-5.x-Java7/build.xml:477: The following error occurred while executing this line:
/usr/home/jenkins/jenkins-slave/workspace/Lucene-Solr-Tests-5.x-Java7/build.xml:61: The following error occurred while executing this line:
/usr/home/jenkins/jenkins-slave/workspace/Lucene-Solr-Tests-5.x-Java7/extra-targets.xml:39: The following error occurred while executing this line:
/usr/home/jenkins/jenkins-slave/workspace/Lucene-Solr-Tests-5.x-Java7/solr/build.xml:190: The following error occurred while executing this line:
/usr/home/jenkins/jenkins-slave/workspace/Lucene-Solr-Tests-5.x-Java7/solr/common-build.xml:508: The following error occurred while executing this line:
/usr/home/jenkins/jenkins-slave/workspace/Lucene-Solr-Tests-5.x-Java7/lucene/common-build.xml:1363: The following error occurred while executing this line:
/usr/home/jenkins/jenkins-slave/workspace/Lucene-Solr-Tests-5.x-Java7/lucene/common-build.xml:970: There were test failures: 459 suites, 1870 tests, 4 errors, 61 ignored (23 assumptions)

Total time: 43 minutes 23 seconds
Build step 'Invoke Ant' marked build as failure
Archiving artifacts
Sending artifact delta relative to Lucene-Solr-Tests-5.x-Java7 #2431
Archived 5 artifacts
Archive block size is 32768
Received 0 blocks and 174747384 bytes
Compression is 0.0%
Took 32 sec
Recording test results
Email was triggered for: Failure
Sending email for trigger: Failure



Mime
View raw message