lucene-dev mailing list archives

Site index · List index
Message view « Date » · « Thread »
Top « Date » · « Thread »
From Policeman Jenkins Server <jenk...@thetaphi.de>
Subject [JENKINS] Lucene-Solr-5.x-Linux (64bit/jdk1.9.0-ea-b44) - Build # 11381 - Failure!
Date Thu, 08 Jan 2015 17:19:49 GMT
Build: http://jenkins.thetaphi.de/job/Lucene-Solr-5.x-Linux/11381/
Java: 64bit/jdk1.9.0-ea-b44 -XX:+UseCompressedOops -XX:+UseG1GC

55 tests failed.
FAILED:  junit.framework.TestSuite.org.apache.lucene.search.TestSearcherManager

Error Message:
8 threads leaked from SUITE scope at org.apache.lucene.search.TestSearcherManager:     1) Thread[id=715, name=TestSearcherManager-17-thread-6, state=TIMED_WAITING, group=TGRP-TestSearcherManager]         at sun.misc.Unsafe.park(Native Method)         at java.util.concurrent.locks.LockSupport.parkNanos(LockSupport.java:215)         at java.util.concurrent.SynchronousQueue$TransferStack.awaitFulfill(SynchronousQueue.java:460)         at java.util.concurrent.SynchronousQueue$TransferStack.transfer(SynchronousQueue.java:362)         at java.util.concurrent.SynchronousQueue.poll(SynchronousQueue.java:941)         at java.util.concurrent.ThreadPoolExecutor.getTask(ThreadPoolExecutor.java:1066)         at java.util.concurrent.ThreadPoolExecutor.runWorker(ThreadPoolExecutor.java:1127)         at java.util.concurrent.ThreadPoolExecutor$Worker.run(ThreadPoolExecutor.java:617)         at java.lang.Thread.run(Thread.java:745)    2) Thread[id=716, name=TestSearcherManager-17-thread-7, state=TIMED_WAITING, group=TGRP-TestSearcherManager]         at sun.misc.Unsafe.park(Native Method)         at java.util.concurrent.locks.LockSupport.parkNanos(LockSupport.java:215)         at java.util.concurrent.SynchronousQueue$TransferStack.awaitFulfill(SynchronousQueue.java:460)         at java.util.concurrent.SynchronousQueue$TransferStack.transfer(SynchronousQueue.java:362)         at java.util.concurrent.SynchronousQueue.poll(SynchronousQueue.java:941)         at java.util.concurrent.ThreadPoolExecutor.getTask(ThreadPoolExecutor.java:1066)         at java.util.concurrent.ThreadPoolExecutor.runWorker(ThreadPoolExecutor.java:1127)         at java.util.concurrent.ThreadPoolExecutor$Worker.run(ThreadPoolExecutor.java:617)         at java.lang.Thread.run(Thread.java:745)    3) Thread[id=710, name=TestSearcherManager-17-thread-1, state=TIMED_WAITING, group=TGRP-TestSearcherManager]         at sun.misc.Unsafe.park(Native Method)         at java.util.concurrent.locks.LockSupport.parkNanos(LockSupport.java:215)         at java.util.concurrent.SynchronousQueue$TransferStack.awaitFulfill(SynchronousQueue.java:460)         at java.util.concurrent.SynchronousQueue$TransferStack.transfer(SynchronousQueue.java:362)         at java.util.concurrent.SynchronousQueue.poll(SynchronousQueue.java:941)         at java.util.concurrent.ThreadPoolExecutor.getTask(ThreadPoolExecutor.java:1066)         at java.util.concurrent.ThreadPoolExecutor.runWorker(ThreadPoolExecutor.java:1127)         at java.util.concurrent.ThreadPoolExecutor$Worker.run(ThreadPoolExecutor.java:617)         at java.lang.Thread.run(Thread.java:745)    4) Thread[id=717, name=TestSearcherManager-17-thread-8, state=TIMED_WAITING, group=TGRP-TestSearcherManager]         at sun.misc.Unsafe.park(Native Method)         at java.util.concurrent.locks.LockSupport.parkNanos(LockSupport.java:215)         at java.util.concurrent.SynchronousQueue$TransferStack.awaitFulfill(SynchronousQueue.java:460)         at java.util.concurrent.SynchronousQueue$TransferStack.transfer(SynchronousQueue.java:362)         at java.util.concurrent.SynchronousQueue.poll(SynchronousQueue.java:941)         at java.util.concurrent.ThreadPoolExecutor.getTask(ThreadPoolExecutor.java:1066)         at java.util.concurrent.ThreadPoolExecutor.runWorker(ThreadPoolExecutor.java:1127)         at java.util.concurrent.ThreadPoolExecutor$Worker.run(ThreadPoolExecutor.java:617)         at java.lang.Thread.run(Thread.java:745)    5) Thread[id=712, name=TestSearcherManager-17-thread-4, state=TIMED_WAITING, group=TGRP-TestSearcherManager]         at sun.misc.Unsafe.park(Native Method)         at java.util.concurrent.locks.LockSupport.parkNanos(LockSupport.java:215)         at java.util.concurrent.SynchronousQueue$TransferStack.awaitFulfill(SynchronousQueue.java:460)         at java.util.concurrent.SynchronousQueue$TransferStack.transfer(SynchronousQueue.java:362)         at java.util.concurrent.SynchronousQueue.poll(SynchronousQueue.java:941)         at java.util.concurrent.ThreadPoolExecutor.getTask(ThreadPoolExecutor.java:1066)         at java.util.concurrent.ThreadPoolExecutor.runWorker(ThreadPoolExecutor.java:1127)         at java.util.concurrent.ThreadPoolExecutor$Worker.run(ThreadPoolExecutor.java:617)         at java.lang.Thread.run(Thread.java:745)    6) Thread[id=713, name=TestSearcherManager-17-thread-3, state=TIMED_WAITING, group=TGRP-TestSearcherManager]         at sun.misc.Unsafe.park(Native Method)         at java.util.concurrent.locks.LockSupport.parkNanos(LockSupport.java:215)         at java.util.concurrent.SynchronousQueue$TransferStack.awaitFulfill(SynchronousQueue.java:460)         at java.util.concurrent.SynchronousQueue$TransferStack.transfer(SynchronousQueue.java:362)         at java.util.concurrent.SynchronousQueue.poll(SynchronousQueue.java:941)         at java.util.concurrent.ThreadPoolExecutor.getTask(ThreadPoolExecutor.java:1066)         at java.util.concurrent.ThreadPoolExecutor.runWorker(ThreadPoolExecutor.java:1127)         at java.util.concurrent.ThreadPoolExecutor$Worker.run(ThreadPoolExecutor.java:617)         at java.lang.Thread.run(Thread.java:745)    7) Thread[id=714, name=TestSearcherManager-17-thread-5, state=TIMED_WAITING, group=TGRP-TestSearcherManager]         at sun.misc.Unsafe.park(Native Method)         at java.util.concurrent.locks.LockSupport.parkNanos(LockSupport.java:215)         at java.util.concurrent.SynchronousQueue$TransferStack.awaitFulfill(SynchronousQueue.java:460)         at java.util.concurrent.SynchronousQueue$TransferStack.transfer(SynchronousQueue.java:362)         at java.util.concurrent.SynchronousQueue.poll(SynchronousQueue.java:941)         at java.util.concurrent.ThreadPoolExecutor.getTask(ThreadPoolExecutor.java:1066)         at java.util.concurrent.ThreadPoolExecutor.runWorker(ThreadPoolExecutor.java:1127)         at java.util.concurrent.ThreadPoolExecutor$Worker.run(ThreadPoolExecutor.java:617)         at java.lang.Thread.run(Thread.java:745)    8) Thread[id=711, name=TestSearcherManager-17-thread-2, state=TIMED_WAITING, group=TGRP-TestSearcherManager]         at sun.misc.Unsafe.park(Native Method)         at java.util.concurrent.locks.LockSupport.parkNanos(LockSupport.java:215)         at java.util.concurrent.SynchronousQueue$TransferStack.awaitFulfill(SynchronousQueue.java:460)         at java.util.concurrent.SynchronousQueue$TransferStack.transfer(SynchronousQueue.java:362)         at java.util.concurrent.SynchronousQueue.poll(SynchronousQueue.java:941)         at java.util.concurrent.ThreadPoolExecutor.getTask(ThreadPoolExecutor.java:1066)         at java.util.concurrent.ThreadPoolExecutor.runWorker(ThreadPoolExecutor.java:1127)         at java.util.concurrent.ThreadPoolExecutor$Worker.run(ThreadPoolExecutor.java:617)         at java.lang.Thread.run(Thread.java:745)

Stack Trace:
com.carrotsearch.randomizedtesting.ThreadLeakError: 8 threads leaked from SUITE scope at org.apache.lucene.search.TestSearcherManager: 
   1) Thread[id=715, name=TestSearcherManager-17-thread-6, state=TIMED_WAITING, group=TGRP-TestSearcherManager]
        at sun.misc.Unsafe.park(Native Method)
        at java.util.concurrent.locks.LockSupport.parkNanos(LockSupport.java:215)
        at java.util.concurrent.SynchronousQueue$TransferStack.awaitFulfill(SynchronousQueue.java:460)
        at java.util.concurrent.SynchronousQueue$TransferStack.transfer(SynchronousQueue.java:362)
        at java.util.concurrent.SynchronousQueue.poll(SynchronousQueue.java:941)
        at java.util.concurrent.ThreadPoolExecutor.getTask(ThreadPoolExecutor.java:1066)
        at java.util.concurrent.ThreadPoolExecutor.runWorker(ThreadPoolExecutor.java:1127)
        at java.util.concurrent.ThreadPoolExecutor$Worker.run(ThreadPoolExecutor.java:617)
        at java.lang.Thread.run(Thread.java:745)
   2) Thread[id=716, name=TestSearcherManager-17-thread-7, state=TIMED_WAITING, group=TGRP-TestSearcherManager]
        at sun.misc.Unsafe.park(Native Method)
        at java.util.concurrent.locks.LockSupport.parkNanos(LockSupport.java:215)
        at java.util.concurrent.SynchronousQueue$TransferStack.awaitFulfill(SynchronousQueue.java:460)
        at java.util.concurrent.SynchronousQueue$TransferStack.transfer(SynchronousQueue.java:362)
        at java.util.concurrent.SynchronousQueue.poll(SynchronousQueue.java:941)
        at java.util.concurrent.ThreadPoolExecutor.getTask(ThreadPoolExecutor.java:1066)
        at java.util.concurrent.ThreadPoolExecutor.runWorker(ThreadPoolExecutor.java:1127)
        at java.util.concurrent.ThreadPoolExecutor$Worker.run(ThreadPoolExecutor.java:617)
        at java.lang.Thread.run(Thread.java:745)
   3) Thread[id=710, name=TestSearcherManager-17-thread-1, state=TIMED_WAITING, group=TGRP-TestSearcherManager]
        at sun.misc.Unsafe.park(Native Method)
        at java.util.concurrent.locks.LockSupport.parkNanos(LockSupport.java:215)
        at java.util.concurrent.SynchronousQueue$TransferStack.awaitFulfill(SynchronousQueue.java:460)
        at java.util.concurrent.SynchronousQueue$TransferStack.transfer(SynchronousQueue.java:362)
        at java.util.concurrent.SynchronousQueue.poll(SynchronousQueue.java:941)
        at java.util.concurrent.ThreadPoolExecutor.getTask(ThreadPoolExecutor.java:1066)
        at java.util.concurrent.ThreadPoolExecutor.runWorker(ThreadPoolExecutor.java:1127)
        at java.util.concurrent.ThreadPoolExecutor$Worker.run(ThreadPoolExecutor.java:617)
        at java.lang.Thread.run(Thread.java:745)
   4) Thread[id=717, name=TestSearcherManager-17-thread-8, state=TIMED_WAITING, group=TGRP-TestSearcherManager]
        at sun.misc.Unsafe.park(Native Method)
        at java.util.concurrent.locks.LockSupport.parkNanos(LockSupport.java:215)
        at java.util.concurrent.SynchronousQueue$TransferStack.awaitFulfill(SynchronousQueue.java:460)
        at java.util.concurrent.SynchronousQueue$TransferStack.transfer(SynchronousQueue.java:362)
        at java.util.concurrent.SynchronousQueue.poll(SynchronousQueue.java:941)
        at java.util.concurrent.ThreadPoolExecutor.getTask(ThreadPoolExecutor.java:1066)
        at java.util.concurrent.ThreadPoolExecutor.runWorker(ThreadPoolExecutor.java:1127)
        at java.util.concurrent.ThreadPoolExecutor$Worker.run(ThreadPoolExecutor.java:617)
        at java.lang.Thread.run(Thread.java:745)
   5) Thread[id=712, name=TestSearcherManager-17-thread-4, state=TIMED_WAITING, group=TGRP-TestSearcherManager]
        at sun.misc.Unsafe.park(Native Method)
        at java.util.concurrent.locks.LockSupport.parkNanos(LockSupport.java:215)
        at java.util.concurrent.SynchronousQueue$TransferStack.awaitFulfill(SynchronousQueue.java:460)
        at java.util.concurrent.SynchronousQueue$TransferStack.transfer(SynchronousQueue.java:362)
        at java.util.concurrent.SynchronousQueue.poll(SynchronousQueue.java:941)
        at java.util.concurrent.ThreadPoolExecutor.getTask(ThreadPoolExecutor.java:1066)
        at java.util.concurrent.ThreadPoolExecutor.runWorker(ThreadPoolExecutor.java:1127)
        at java.util.concurrent.ThreadPoolExecutor$Worker.run(ThreadPoolExecutor.java:617)
        at java.lang.Thread.run(Thread.java:745)
   6) Thread[id=713, name=TestSearcherManager-17-thread-3, state=TIMED_WAITING, group=TGRP-TestSearcherManager]
        at sun.misc.Unsafe.park(Native Method)
        at java.util.concurrent.locks.LockSupport.parkNanos(LockSupport.java:215)
        at java.util.concurrent.SynchronousQueue$TransferStack.awaitFulfill(SynchronousQueue.java:460)
        at java.util.concurrent.SynchronousQueue$TransferStack.transfer(SynchronousQueue.java:362)
        at java.util.concurrent.SynchronousQueue.poll(SynchronousQueue.java:941)
        at java.util.concurrent.ThreadPoolExecutor.getTask(ThreadPoolExecutor.java:1066)
        at java.util.concurrent.ThreadPoolExecutor.runWorker(ThreadPoolExecutor.java:1127)
        at java.util.concurrent.ThreadPoolExecutor$Worker.run(ThreadPoolExecutor.java:617)
        at java.lang.Thread.run(Thread.java:745)
   7) Thread[id=714, name=TestSearcherManager-17-thread-5, state=TIMED_WAITING, group=TGRP-TestSearcherManager]
        at sun.misc.Unsafe.park(Native Method)
        at java.util.concurrent.locks.LockSupport.parkNanos(LockSupport.java:215)
        at java.util.concurrent.SynchronousQueue$TransferStack.awaitFulfill(SynchronousQueue.java:460)
        at java.util.concurrent.SynchronousQueue$TransferStack.transfer(SynchronousQueue.java:362)
        at java.util.concurrent.SynchronousQueue.poll(SynchronousQueue.java:941)
        at java.util.concurrent.ThreadPoolExecutor.getTask(ThreadPoolExecutor.java:1066)
        at java.util.concurrent.ThreadPoolExecutor.runWorker(ThreadPoolExecutor.java:1127)
        at java.util.concurrent.ThreadPoolExecutor$Worker.run(ThreadPoolExecutor.java:617)
        at java.lang.Thread.run(Thread.java:745)
   8) Thread[id=711, name=TestSearcherManager-17-thread-2, state=TIMED_WAITING, group=TGRP-TestSearcherManager]
        at sun.misc.Unsafe.park(Native Method)
        at java.util.concurrent.locks.LockSupport.parkNanos(LockSupport.java:215)
        at java.util.concurrent.SynchronousQueue$TransferStack.awaitFulfill(SynchronousQueue.java:460)
        at java.util.concurrent.SynchronousQueue$TransferStack.transfer(SynchronousQueue.java:362)
        at java.util.concurrent.SynchronousQueue.poll(SynchronousQueue.java:941)
        at java.util.concurrent.ThreadPoolExecutor.getTask(ThreadPoolExecutor.java:1066)
        at java.util.concurrent.ThreadPoolExecutor.runWorker(ThreadPoolExecutor.java:1127)
        at java.util.concurrent.ThreadPoolExecutor$Worker.run(ThreadPoolExecutor.java:617)
        at java.lang.Thread.run(Thread.java:745)
	at __randomizedtesting.SeedInfo.seed([DCAA4FA2B5A6C7D0]:0)


FAILED:  junit.framework.TestSuite.org.apache.lucene.search.TestSearcherManager

Error Message:
There are still zombie threads that couldn't be terminated:    1) Thread[id=715, name=TestSearcherManager-17-thread-6, state=TIMED_WAITING, group=TGRP-TestSearcherManager]         at sun.misc.Unsafe.park(Native Method)         at java.util.concurrent.locks.LockSupport.parkNanos(LockSupport.java:215)         at java.util.concurrent.SynchronousQueue$TransferStack.awaitFulfill(SynchronousQueue.java:460)         at java.util.concurrent.SynchronousQueue$TransferStack.transfer(SynchronousQueue.java:362)         at java.util.concurrent.SynchronousQueue.poll(SynchronousQueue.java:941)         at java.util.concurrent.ThreadPoolExecutor.getTask(ThreadPoolExecutor.java:1066)         at java.util.concurrent.ThreadPoolExecutor.runWorker(ThreadPoolExecutor.java:1127)         at java.util.concurrent.ThreadPoolExecutor$Worker.run(ThreadPoolExecutor.java:617)         at java.lang.Thread.run(Thread.java:745)    2) Thread[id=716, name=TestSearcherManager-17-thread-7, state=TIMED_WAITING, group=TGRP-TestSearcherManager]         at sun.misc.Unsafe.park(Native Method)         at java.util.concurrent.locks.LockSupport.parkNanos(LockSupport.java:215)         at java.util.concurrent.SynchronousQueue$TransferStack.awaitFulfill(SynchronousQueue.java:460)         at java.util.concurrent.SynchronousQueue$TransferStack.transfer(SynchronousQueue.java:362)         at java.util.concurrent.SynchronousQueue.poll(SynchronousQueue.java:941)         at java.util.concurrent.ThreadPoolExecutor.getTask(ThreadPoolExecutor.java:1066)         at java.util.concurrent.ThreadPoolExecutor.runWorker(ThreadPoolExecutor.java:1127)         at java.util.concurrent.ThreadPoolExecutor$Worker.run(ThreadPoolExecutor.java:617)         at java.lang.Thread.run(Thread.java:745)    3) Thread[id=710, name=TestSearcherManager-17-thread-1, state=TIMED_WAITING, group=TGRP-TestSearcherManager]         at sun.misc.Unsafe.park(Native Method)         at java.util.concurrent.locks.LockSupport.parkNanos(LockSupport.java:215)         at java.util.concurrent.SynchronousQueue$TransferStack.awaitFulfill(SynchronousQueue.java:460)         at java.util.concurrent.SynchronousQueue$TransferStack.transfer(SynchronousQueue.java:362)         at java.util.concurrent.SynchronousQueue.poll(SynchronousQueue.java:941)         at java.util.concurrent.ThreadPoolExecutor.getTask(ThreadPoolExecutor.java:1066)         at java.util.concurrent.ThreadPoolExecutor.runWorker(ThreadPoolExecutor.java:1127)         at java.util.concurrent.ThreadPoolExecutor$Worker.run(ThreadPoolExecutor.java:617)         at java.lang.Thread.run(Thread.java:745)    4) Thread[id=717, name=TestSearcherManager-17-thread-8, state=TIMED_WAITING, group=TGRP-TestSearcherManager]         at sun.misc.Unsafe.park(Native Method)         at java.util.concurrent.locks.LockSupport.parkNanos(LockSupport.java:215)         at java.util.concurrent.SynchronousQueue$TransferStack.awaitFulfill(SynchronousQueue.java:460)         at java.util.concurrent.SynchronousQueue$TransferStack.transfer(SynchronousQueue.java:362)         at java.util.concurrent.SynchronousQueue.poll(SynchronousQueue.java:941)         at java.util.concurrent.ThreadPoolExecutor.getTask(ThreadPoolExecutor.java:1066)         at java.util.concurrent.ThreadPoolExecutor.runWorker(ThreadPoolExecutor.java:1127)         at java.util.concurrent.ThreadPoolExecutor$Worker.run(ThreadPoolExecutor.java:617)         at java.lang.Thread.run(Thread.java:745)    5) Thread[id=712, name=TestSearcherManager-17-thread-4, state=TIMED_WAITING, group=TGRP-TestSearcherManager]         at sun.misc.Unsafe.park(Native Method)         at java.util.concurrent.locks.LockSupport.parkNanos(LockSupport.java:215)         at java.util.concurrent.SynchronousQueue$TransferStack.awaitFulfill(SynchronousQueue.java:460)         at java.util.concurrent.SynchronousQueue$TransferStack.transfer(SynchronousQueue.java:362)         at java.util.concurrent.SynchronousQueue.poll(SynchronousQueue.java:941)         at java.util.concurrent.ThreadPoolExecutor.getTask(ThreadPoolExecutor.java:1066)         at java.util.concurrent.ThreadPoolExecutor.runWorker(ThreadPoolExecutor.java:1127)         at java.util.concurrent.ThreadPoolExecutor$Worker.run(ThreadPoolExecutor.java:617)         at java.lang.Thread.run(Thread.java:745)    6) Thread[id=713, name=TestSearcherManager-17-thread-3, state=TIMED_WAITING, group=TGRP-TestSearcherManager]         at sun.misc.Unsafe.park(Native Method)         at java.util.concurrent.locks.LockSupport.parkNanos(LockSupport.java:215)         at java.util.concurrent.SynchronousQueue$TransferStack.awaitFulfill(SynchronousQueue.java:460)         at java.util.concurrent.SynchronousQueue$TransferStack.transfer(SynchronousQueue.java:362)         at java.util.concurrent.SynchronousQueue.poll(SynchronousQueue.java:941)         at java.util.concurrent.ThreadPoolExecutor.getTask(ThreadPoolExecutor.java:1066)         at java.util.concurrent.ThreadPoolExecutor.runWorker(ThreadPoolExecutor.java:1127)         at java.util.concurrent.ThreadPoolExecutor$Worker.run(ThreadPoolExecutor.java:617)         at java.lang.Thread.run(Thread.java:745)    7) Thread[id=714, name=TestSearcherManager-17-thread-5, state=TIMED_WAITING, group=TGRP-TestSearcherManager]         at sun.misc.Unsafe.park(Native Method)         at java.util.concurrent.locks.LockSupport.parkNanos(LockSupport.java:215)         at java.util.concurrent.SynchronousQueue$TransferStack.awaitFulfill(SynchronousQueue.java:460)         at java.util.concurrent.SynchronousQueue$TransferStack.transfer(SynchronousQueue.java:362)         at java.util.concurrent.SynchronousQueue.poll(SynchronousQueue.java:941)         at java.util.concurrent.ThreadPoolExecutor.getTask(ThreadPoolExecutor.java:1066)         at java.util.concurrent.ThreadPoolExecutor.runWorker(ThreadPoolExecutor.java:1127)         at java.util.concurrent.ThreadPoolExecutor$Worker.run(ThreadPoolExecutor.java:617)         at java.lang.Thread.run(Thread.java:745)    8) Thread[id=711, name=TestSearcherManager-17-thread-2, state=TIMED_WAITING, group=TGRP-TestSearcherManager]         at sun.misc.Unsafe.park(Native Method)         at java.util.concurrent.locks.LockSupport.parkNanos(LockSupport.java:215)         at java.util.concurrent.SynchronousQueue$TransferStack.awaitFulfill(SynchronousQueue.java:460)         at java.util.concurrent.SynchronousQueue$TransferStack.transfer(SynchronousQueue.java:362)         at java.util.concurrent.SynchronousQueue.poll(SynchronousQueue.java:941)         at java.util.concurrent.ThreadPoolExecutor.getTask(ThreadPoolExecutor.java:1066)         at java.util.concurrent.ThreadPoolExecutor.runWorker(ThreadPoolExecutor.java:1127)         at java.util.concurrent.ThreadPoolExecutor$Worker.run(ThreadPoolExecutor.java:617)         at java.lang.Thread.run(Thread.java:745)

Stack Trace:
com.carrotsearch.randomizedtesting.ThreadLeakError: There are still zombie threads that couldn't be terminated:
   1) Thread[id=715, name=TestSearcherManager-17-thread-6, state=TIMED_WAITING, group=TGRP-TestSearcherManager]
        at sun.misc.Unsafe.park(Native Method)
        at java.util.concurrent.locks.LockSupport.parkNanos(LockSupport.java:215)
        at java.util.concurrent.SynchronousQueue$TransferStack.awaitFulfill(SynchronousQueue.java:460)
        at java.util.concurrent.SynchronousQueue$TransferStack.transfer(SynchronousQueue.java:362)
        at java.util.concurrent.SynchronousQueue.poll(SynchronousQueue.java:941)
        at java.util.concurrent.ThreadPoolExecutor.getTask(ThreadPoolExecutor.java:1066)
        at java.util.concurrent.ThreadPoolExecutor.runWorker(ThreadPoolExecutor.java:1127)
        at java.util.concurrent.ThreadPoolExecutor$Worker.run(ThreadPoolExecutor.java:617)
        at java.lang.Thread.run(Thread.java:745)
   2) Thread[id=716, name=TestSearcherManager-17-thread-7, state=TIMED_WAITING, group=TGRP-TestSearcherManager]
        at sun.misc.Unsafe.park(Native Method)
        at java.util.concurrent.locks.LockSupport.parkNanos(LockSupport.java:215)
        at java.util.concurrent.SynchronousQueue$TransferStack.awaitFulfill(SynchronousQueue.java:460)
        at java.util.concurrent.SynchronousQueue$TransferStack.transfer(SynchronousQueue.java:362)
        at java.util.concurrent.SynchronousQueue.poll(SynchronousQueue.java:941)
        at java.util.concurrent.ThreadPoolExecutor.getTask(ThreadPoolExecutor.java:1066)
        at java.util.concurrent.ThreadPoolExecutor.runWorker(ThreadPoolExecutor.java:1127)
        at java.util.concurrent.ThreadPoolExecutor$Worker.run(ThreadPoolExecutor.java:617)
        at java.lang.Thread.run(Thread.java:745)
   3) Thread[id=710, name=TestSearcherManager-17-thread-1, state=TIMED_WAITING, group=TGRP-TestSearcherManager]
        at sun.misc.Unsafe.park(Native Method)
        at java.util.concurrent.locks.LockSupport.parkNanos(LockSupport.java:215)
        at java.util.concurrent.SynchronousQueue$TransferStack.awaitFulfill(SynchronousQueue.java:460)
        at java.util.concurrent.SynchronousQueue$TransferStack.transfer(SynchronousQueue.java:362)
        at java.util.concurrent.SynchronousQueue.poll(SynchronousQueue.java:941)
        at java.util.concurrent.ThreadPoolExecutor.getTask(ThreadPoolExecutor.java:1066)
        at java.util.concurrent.ThreadPoolExecutor.runWorker(ThreadPoolExecutor.java:1127)
        at java.util.concurrent.ThreadPoolExecutor$Worker.run(ThreadPoolExecutor.java:617)
        at java.lang.Thread.run(Thread.java:745)
   4) Thread[id=717, name=TestSearcherManager-17-thread-8, state=TIMED_WAITING, group=TGRP-TestSearcherManager]
        at sun.misc.Unsafe.park(Native Method)
        at java.util.concurrent.locks.LockSupport.parkNanos(LockSupport.java:215)
        at java.util.concurrent.SynchronousQueue$TransferStack.awaitFulfill(SynchronousQueue.java:460)
        at java.util.concurrent.SynchronousQueue$TransferStack.transfer(SynchronousQueue.java:362)
        at java.util.concurrent.SynchronousQueue.poll(SynchronousQueue.java:941)
        at java.util.concurrent.ThreadPoolExecutor.getTask(ThreadPoolExecutor.java:1066)
        at java.util.concurrent.ThreadPoolExecutor.runWorker(ThreadPoolExecutor.java:1127)
        at java.util.concurrent.ThreadPoolExecutor$Worker.run(ThreadPoolExecutor.java:617)
        at java.lang.Thread.run(Thread.java:745)
   5) Thread[id=712, name=TestSearcherManager-17-thread-4, state=TIMED_WAITING, group=TGRP-TestSearcherManager]
        at sun.misc.Unsafe.park(Native Method)
        at java.util.concurrent.locks.LockSupport.parkNanos(LockSupport.java:215)
        at java.util.concurrent.SynchronousQueue$TransferStack.awaitFulfill(SynchronousQueue.java:460)
        at java.util.concurrent.SynchronousQueue$TransferStack.transfer(SynchronousQueue.java:362)
        at java.util.concurrent.SynchronousQueue.poll(SynchronousQueue.java:941)
        at java.util.concurrent.ThreadPoolExecutor.getTask(ThreadPoolExecutor.java:1066)
        at java.util.concurrent.ThreadPoolExecutor.runWorker(ThreadPoolExecutor.java:1127)
        at java.util.concurrent.ThreadPoolExecutor$Worker.run(ThreadPoolExecutor.java:617)
        at java.lang.Thread.run(Thread.java:745)
   6) Thread[id=713, name=TestSearcherManager-17-thread-3, state=TIMED_WAITING, group=TGRP-TestSearcherManager]
        at sun.misc.Unsafe.park(Native Method)
        at java.util.concurrent.locks.LockSupport.parkNanos(LockSupport.java:215)
        at java.util.concurrent.SynchronousQueue$TransferStack.awaitFulfill(SynchronousQueue.java:460)
        at java.util.concurrent.SynchronousQueue$TransferStack.transfer(SynchronousQueue.java:362)
        at java.util.concurrent.SynchronousQueue.poll(SynchronousQueue.java:941)
        at java.util.concurrent.ThreadPoolExecutor.getTask(ThreadPoolExecutor.java:1066)
        at java.util.concurrent.ThreadPoolExecutor.runWorker(ThreadPoolExecutor.java:1127)
        at java.util.concurrent.ThreadPoolExecutor$Worker.run(ThreadPoolExecutor.java:617)
        at java.lang.Thread.run(Thread.java:745)
   7) Thread[id=714, name=TestSearcherManager-17-thread-5, state=TIMED_WAITING, group=TGRP-TestSearcherManager]
        at sun.misc.Unsafe.park(Native Method)
        at java.util.concurrent.locks.LockSupport.parkNanos(LockSupport.java:215)
        at java.util.concurrent.SynchronousQueue$TransferStack.awaitFulfill(SynchronousQueue.java:460)
        at java.util.concurrent.SynchronousQueue$TransferStack.transfer(SynchronousQueue.java:362)
        at java.util.concurrent.SynchronousQueue.poll(SynchronousQueue.java:941)
        at java.util.concurrent.ThreadPoolExecutor.getTask(ThreadPoolExecutor.java:1066)
        at java.util.concurrent.ThreadPoolExecutor.runWorker(ThreadPoolExecutor.java:1127)
        at java.util.concurrent.ThreadPoolExecutor$Worker.run(ThreadPoolExecutor.java:617)
        at java.lang.Thread.run(Thread.java:745)
   8) Thread[id=711, name=TestSearcherManager-17-thread-2, state=TIMED_WAITING, group=TGRP-TestSearcherManager]
        at sun.misc.Unsafe.park(Native Method)
        at java.util.concurrent.locks.LockSupport.parkNanos(LockSupport.java:215)
        at java.util.concurrent.SynchronousQueue$TransferStack.awaitFulfill(SynchronousQueue.java:460)
        at java.util.concurrent.SynchronousQueue$TransferStack.transfer(SynchronousQueue.java:362)
        at java.util.concurrent.SynchronousQueue.poll(SynchronousQueue.java:941)
        at java.util.concurrent.ThreadPoolExecutor.getTask(ThreadPoolExecutor.java:1066)
        at java.util.concurrent.ThreadPoolExecutor.runWorker(ThreadPoolExecutor.java:1127)
        at java.util.concurrent.ThreadPoolExecutor$Worker.run(ThreadPoolExecutor.java:617)
        at java.lang.Thread.run(Thread.java:745)
	at __randomizedtesting.SeedInfo.seed([DCAA4FA2B5A6C7D0]:0)


FAILED:  org.apache.lucene.codecs.lucene50.TestBlockPostingsFormat2.testTTFBlockSize

Error Message:
On Linux and MacOSX fsyncing a directory should not throw IOException, we just don't want to rely on that in production (undocumented). Got: java.nio.file.FileSystemException: /mnt/ssd/jenkins/workspace/Lucene-Solr-5.x-Linux/lucene/build/core/test/J1/temp/lucene.codecs.lucene50.TestBlockPostingsFormat2 DCAA4FA2B5A6C7D0-001/testDFBlockSize-001: Is a directory

Stack Trace:
java.lang.AssertionError: On Linux and MacOSX fsyncing a directory should not throw IOException, we just don't want to rely on that in production (undocumented). Got: java.nio.file.FileSystemException: /mnt/ssd/jenkins/workspace/Lucene-Solr-5.x-Linux/lucene/build/core/test/J1/temp/lucene.codecs.lucene50.TestBlockPostingsFormat2 DCAA4FA2B5A6C7D0-001/testDFBlockSize-001: Is a directory
	at org.apache.lucene.util.IOUtils.fsync(IOUtils.java:418)
	at org.apache.lucene.store.FSDirectory.renameFile(FSDirectory.java:236)
	at org.apache.lucene.store.MockDirectoryWrapper.renameFile(MockDirectoryWrapper.java:268)
	at org.apache.lucene.index.SegmentInfos.finishCommit(SegmentInfos.java:727)
	at org.apache.lucene.index.IndexWriter.finishCommit(IndexWriter.java:2914)
	at org.apache.lucene.index.IndexWriter.commitInternal(IndexWriter.java:2895)
	at org.apache.lucene.index.IndexWriter.commit(IndexWriter.java:2855)
	at org.apache.lucene.index.RandomIndexWriter.maybeCommit(RandomIndexWriter.java:158)
	at org.apache.lucene.index.RandomIndexWriter.addDocument(RandomIndexWriter.java:149)
	at org.apache.lucene.index.RandomIndexWriter.addDocument(RandomIndexWriter.java:107)
	at org.apache.lucene.codecs.lucene50.TestBlockPostingsFormat2.testTTFBlockSize(TestBlockPostingsFormat2.java:114)
	at sun.reflect.NativeMethodAccessorImpl.invoke0(Native Method)
	at sun.reflect.NativeMethodAccessorImpl.invoke(NativeMethodAccessorImpl.java:62)
	at sun.reflect.DelegatingMethodAccessorImpl.invoke(DelegatingMethodAccessorImpl.java:43)
	at java.lang.reflect.Method.invoke(Method.java:498)
	at com.carrotsearch.randomizedtesting.RandomizedRunner.invoke(RandomizedRunner.java:1618)
	at com.carrotsearch.randomizedtesting.RandomizedRunner$6.evaluate(RandomizedRunner.java:827)
	at com.carrotsearch.randomizedtesting.RandomizedRunner$7.evaluate(RandomizedRunner.java:863)
	at com.carrotsearch.randomizedtesting.RandomizedRunner$8.evaluate(RandomizedRunner.java:877)
	at org.apache.lucene.util.TestRuleSetupTeardownChained$1.evaluate(TestRuleSetupTeardownChained.java:50)
	at org.apache.lucene.util.AbstractBeforeAfterRule$1.evaluate(AbstractBeforeAfterRule.java:46)
	at com.carrotsearch.randomizedtesting.rules.SystemPropertiesInvariantRule$1.evaluate(SystemPropertiesInvariantRule.java:55)
	at org.apache.lucene.util.TestRuleThreadAndTestName$1.evaluate(TestRuleThreadAndTestName.java:49)
	at org.apache.lucene.util.TestRuleIgnoreAfterMaxFailures$1.evaluate(TestRuleIgnoreAfterMaxFailures.java:65)
	at org.apache.lucene.util.TestRuleMarkFailure$1.evaluate(TestRuleMarkFailure.java:48)
	at com.carrotsearch.randomizedtesting.rules.StatementAdapter.evaluate(StatementAdapter.java:36)
	at com.carrotsearch.randomizedtesting.ThreadLeakControl$StatementRunner.run(ThreadLeakControl.java:365)
	at com.carrotsearch.randomizedtesting.ThreadLeakControl.forkTimeoutingTask(ThreadLeakControl.java:798)
	at com.carrotsearch.randomizedtesting.ThreadLeakControl$3.evaluate(ThreadLeakControl.java:458)
	at com.carrotsearch.randomizedtesting.RandomizedRunner.runSingleTest(RandomizedRunner.java:836)
	at com.carrotsearch.randomizedtesting.RandomizedRunner$3.evaluate(RandomizedRunner.java:738)
	at com.carrotsearch.randomizedtesting.RandomizedRunner$4.evaluate(RandomizedRunner.java:772)
	at com.carrotsearch.randomizedtesting.RandomizedRunner$5.evaluate(RandomizedRunner.java:783)
	at org.apache.lucene.util.AbstractBeforeAfterRule$1.evaluate(AbstractBeforeAfterRule.java:46)
	at org.apache.lucene.util.TestRuleStoreClassName$1.evaluate(TestRuleStoreClassName.java:42)
	at com.carrotsearch.randomizedtesting.rules.SystemPropertiesInvariantRule$1.evaluate(SystemPropertiesInvariantRule.java:55)
	at com.carrotsearch.randomizedtesting.rules.NoShadowingOrOverridesOnMethodsRule$1.evaluate(NoShadowingOrOverridesOnMethodsRule.java:39)
	at com.carrotsearch.randomizedtesting.rules.NoShadowingOrOverridesOnMethodsRule$1.evaluate(NoShadowingOrOverridesOnMethodsRule.java:39)
	at com.carrotsearch.randomizedtesting.rules.StatementAdapter.evaluate(StatementAdapter.java:36)
	at com.carrotsearch.randomizedtesting.rules.StatementAdapter.evaluate(StatementAdapter.java:36)
	at com.carrotsearch.randomizedtesting.rules.StatementAdapter.evaluate(StatementAdapter.java:36)
	at org.apache.lucene.util.TestRuleAssertionsRequired$1.evaluate(TestRuleAssertionsRequired.java:54)
	at org.apache.lucene.util.TestRuleMarkFailure$1.evaluate(TestRuleMarkFailure.java:48)
	at org.apache.lucene.util.TestRuleIgnoreAfterMaxFailures$1.evaluate(TestRuleIgnoreAfterMaxFailures.java:65)
	at org.apache.lucene.util.TestRuleIgnoreTestSuites$1.evaluate(TestRuleIgnoreTestSuites.java:55)
	at com.carrotsearch.randomizedtesting.rules.StatementAdapter.evaluate(StatementAdapter.java:36)
	at com.carrotsearch.randomizedtesting.ThreadLeakControl$StatementRunner.run(ThreadLeakControl.java:365)
	at java.lang.Thread.run(Thread.java:745)


FAILED:  org.apache.lucene.codecs.lucene50.TestBlockPostingsFormat2.testTTFBlockSizeMultiple

Error Message:
On Linux and MacOSX fsyncing a directory should not throw IOException, we just don't want to rely on that in production (undocumented). Got: java.nio.file.FileSystemException: /mnt/ssd/jenkins/workspace/Lucene-Solr-5.x-Linux/lucene/build/core/test/J1/temp/lucene.codecs.lucene50.TestBlockPostingsFormat2 DCAA4FA2B5A6C7D0-001/testDFBlockSize-002: Is a directory

Stack Trace:
java.lang.AssertionError: On Linux and MacOSX fsyncing a directory should not throw IOException, we just don't want to rely on that in production (undocumented). Got: java.nio.file.FileSystemException: /mnt/ssd/jenkins/workspace/Lucene-Solr-5.x-Linux/lucene/build/core/test/J1/temp/lucene.codecs.lucene50.TestBlockPostingsFormat2 DCAA4FA2B5A6C7D0-001/testDFBlockSize-002: Is a directory
	at __randomizedtesting.SeedInfo.seed([DCAA4FA2B5A6C7D0:5D8A39B845228F80]:0)
	at org.apache.lucene.util.IOUtils.fsync(IOUtils.java:418)
	at org.apache.lucene.store.FSDirectory.renameFile(FSDirectory.java:236)
	at org.apache.lucene.store.MockDirectoryWrapper.renameFile(MockDirectoryWrapper.java:268)
	at org.apache.lucene.index.SegmentInfos.finishCommit(SegmentInfos.java:727)
	at org.apache.lucene.index.IndexWriter.finishCommit(IndexWriter.java:2914)
	at org.apache.lucene.index.IndexWriter.commitInternal(IndexWriter.java:2895)
	at org.apache.lucene.index.IndexWriter.shutdown(IndexWriter.java:965)
	at org.apache.lucene.index.IndexWriter.close(IndexWriter.java:1008)
	at org.apache.lucene.index.RandomIndexWriter.close(RandomIndexWriter.java:369)
	at org.apache.lucene.codecs.lucene50.TestBlockPostingsFormat2.tearDown(TestBlockPostingsFormat2.java:55)
	at sun.reflect.GeneratedMethodAccessor3.invoke(Unknown Source)
	at sun.reflect.DelegatingMethodAccessorImpl.invoke(DelegatingMethodAccessorImpl.java:43)
	at java.lang.reflect.Method.invoke(Method.java:498)
	at com.carrotsearch.randomizedtesting.RandomizedRunner.invoke(RandomizedRunner.java:1618)
	at com.carrotsearch.randomizedtesting.RandomizedRunner$8.evaluate(RandomizedRunner.java:885)
	at org.apache.lucene.util.TestRuleSetupTeardownChained$1.evaluate(TestRuleSetupTeardownChained.java:50)
	at org.apache.lucene.util.AbstractBeforeAfterRule$1.evaluate(AbstractBeforeAfterRule.java:46)
	at com.carrotsearch.randomizedtesting.rules.SystemPropertiesInvariantRule$1.evaluate(SystemPropertiesInvariantRule.java:55)
	at org.apache.lucene.util.TestRuleThreadAndTestName$1.evaluate(TestRuleThreadAndTestName.java:49)
	at org.apache.lucene.util.TestRuleIgnoreAfterMaxFailures$1.evaluate(TestRuleIgnoreAfterMaxFailures.java:65)
	at org.apache.lucene.util.TestRuleMarkFailure$1.evaluate(TestRuleMarkFailure.java:48)
	at com.carrotsearch.randomizedtesting.rules.StatementAdapter.evaluate(StatementAdapter.java:36)
	at com.carrotsearch.randomizedtesting.ThreadLeakControl$StatementRunner.run(ThreadLeakControl.java:365)
	at com.carrotsearch.randomizedtesting.ThreadLeakControl.forkTimeoutingTask(ThreadLeakControl.java:798)
	at com.carrotsearch.randomizedtesting.ThreadLeakControl$3.evaluate(ThreadLeakControl.java:458)
	at com.carrotsearch.randomizedtesting.RandomizedRunner.runSingleTest(RandomizedRunner.java:836)
	at com.carrotsearch.randomizedtesting.RandomizedRunner$3.evaluate(RandomizedRunner.java:738)
	at com.carrotsearch.randomizedtesting.RandomizedRunner$4.evaluate(RandomizedRunner.java:772)
	at com.carrotsearch.randomizedtesting.RandomizedRunner$5.evaluate(RandomizedRunner.java:783)
	at org.apache.lucene.util.AbstractBeforeAfterRule$1.evaluate(AbstractBeforeAfterRule.java:46)
	at org.apache.lucene.util.TestRuleStoreClassName$1.evaluate(TestRuleStoreClassName.java:42)
	at com.carrotsearch.randomizedtesting.rules.SystemPropertiesInvariantRule$1.evaluate(SystemPropertiesInvariantRule.java:55)
	at com.carrotsearch.randomizedtesting.rules.NoShadowingOrOverridesOnMethodsRule$1.evaluate(NoShadowingOrOverridesOnMethodsRule.java:39)
	at com.carrotsearch.randomizedtesting.rules.NoShadowingOrOverridesOnMethodsRule$1.evaluate(NoShadowingOrOverridesOnMethodsRule.java:39)
	at com.carrotsearch.randomizedtesting.rules.StatementAdapter.evaluate(StatementAdapter.java:36)
	at com.carrotsearch.randomizedtesting.rules.StatementAdapter.evaluate(StatementAdapter.java:36)
	at com.carrotsearch.randomizedtesting.rules.StatementAdapter.evaluate(StatementAdapter.java:36)
	at org.apache.lucene.util.TestRuleAssertionsRequired$1.evaluate(TestRuleAssertionsRequired.java:54)
	at org.apache.lucene.util.TestRuleMarkFailure$1.evaluate(TestRuleMarkFailure.java:48)
	at org.apache.lucene.util.TestRuleIgnoreAfterMaxFailures$1.evaluate(TestRuleIgnoreAfterMaxFailures.java:65)
	at org.apache.lucene.util.TestRuleIgnoreTestSuites$1.evaluate(TestRuleIgnoreTestSuites.java:55)
	at com.carrotsearch.randomizedtesting.rules.StatementAdapter.evaluate(StatementAdapter.java:36)
	at com.carrotsearch.randomizedtesting.ThreadLeakControl$StatementRunner.run(ThreadLeakControl.java:365)
	at java.lang.Thread.run(Thread.java:745)


FAILED:  org.apache.lucene.codecs.lucene50.TestBlockPostingsFormat2.testDFBlockSizeMultiple

Error Message:
On Linux and MacOSX fsyncing a directory should not throw IOException, we just don't want to rely on that in production (undocumented). Got: java.nio.file.FileSystemException: /mnt/ssd/jenkins/workspace/Lucene-Solr-5.x-Linux/lucene/build/core/test/J1/temp/lucene.codecs.lucene50.TestBlockPostingsFormat2 DCAA4FA2B5A6C7D0-001/testDFBlockSize-003: Is a directory

Stack Trace:
java.lang.AssertionError: On Linux and MacOSX fsyncing a directory should not throw IOException, we just don't want to rely on that in production (undocumented). Got: java.nio.file.FileSystemException: /mnt/ssd/jenkins/workspace/Lucene-Solr-5.x-Linux/lucene/build/core/test/J1/temp/lucene.codecs.lucene50.TestBlockPostingsFormat2 DCAA4FA2B5A6C7D0-001/testDFBlockSize-003: Is a directory
	at org.apache.lucene.util.IOUtils.fsync(IOUtils.java:418)
	at org.apache.lucene.store.FSDirectory.renameFile(FSDirectory.java:236)
	at org.apache.lucene.store.MockDirectoryWrapper.renameFile(MockDirectoryWrapper.java:268)
	at org.apache.lucene.index.SegmentInfos.finishCommit(SegmentInfos.java:727)
	at org.apache.lucene.index.IndexWriter.finishCommit(IndexWriter.java:2914)
	at org.apache.lucene.index.IndexWriter.commitInternal(IndexWriter.java:2895)
	at org.apache.lucene.index.IndexWriter.commit(IndexWriter.java:2855)
	at org.apache.lucene.index.RandomIndexWriter.maybeCommit(RandomIndexWriter.java:158)
	at org.apache.lucene.index.RandomIndexWriter.addDocument(RandomIndexWriter.java:149)
	at org.apache.lucene.index.RandomIndexWriter.addDocument(RandomIndexWriter.java:107)
	at org.apache.lucene.codecs.lucene50.TestBlockPostingsFormat2.testDFBlockSizeMultiple(TestBlockPostingsFormat2.java:103)
	at sun.reflect.NativeMethodAccessorImpl.invoke0(Native Method)
	at sun.reflect.NativeMethodAccessorImpl.invoke(NativeMethodAccessorImpl.java:62)
	at sun.reflect.DelegatingMethodAccessorImpl.invoke(DelegatingMethodAccessorImpl.java:43)
	at java.lang.reflect.Method.invoke(Method.java:498)
	at com.carrotsearch.randomizedtesting.RandomizedRunner.invoke(RandomizedRunner.java:1618)
	at com.carrotsearch.randomizedtesting.RandomizedRunner$6.evaluate(RandomizedRunner.java:827)
	at com.carrotsearch.randomizedtesting.RandomizedRunner$7.evaluate(RandomizedRunner.java:863)
	at com.carrotsearch.randomizedtesting.RandomizedRunner$8.evaluate(RandomizedRunner.java:877)
	at org.apache.lucene.util.TestRuleSetupTeardownChained$1.evaluate(TestRuleSetupTeardownChained.java:50)
	at org.apache.lucene.util.AbstractBeforeAfterRule$1.evaluate(AbstractBeforeAfterRule.java:46)
	at com.carrotsearch.randomizedtesting.rules.SystemPropertiesInvariantRule$1.evaluate(SystemPropertiesInvariantRule.java:55)
	at org.apache.lucene.util.TestRuleThreadAndTestName$1.evaluate(TestRuleThreadAndTestName.java:49)
	at org.apache.lucene.util.TestRuleIgnoreAfterMaxFailures$1.evaluate(TestRuleIgnoreAfterMaxFailures.java:65)
	at org.apache.lucene.util.TestRuleMarkFailure$1.evaluate(TestRuleMarkFailure.java:48)
	at com.carrotsearch.randomizedtesting.rules.StatementAdapter.evaluate(StatementAdapter.java:36)
	at com.carrotsearch.randomizedtesting.ThreadLeakControl$StatementRunner.run(ThreadLeakControl.java:365)
	at com.carrotsearch.randomizedtesting.ThreadLeakControl.forkTimeoutingTask(ThreadLeakControl.java:798)
	at com.carrotsearch.randomizedtesting.ThreadLeakControl$3.evaluate(ThreadLeakControl.java:458)
	at com.carrotsearch.randomizedtesting.RandomizedRunner.runSingleTest(RandomizedRunner.java:836)
	at com.carrotsearch.randomizedtesting.RandomizedRunner$3.evaluate(RandomizedRunner.java:738)
	at com.carrotsearch.randomizedtesting.RandomizedRunner$4.evaluate(RandomizedRunner.java:772)
	at com.carrotsearch.randomizedtesting.RandomizedRunner$5.evaluate(RandomizedRunner.java:783)
	at org.apache.lucene.util.AbstractBeforeAfterRule$1.evaluate(AbstractBeforeAfterRule.java:46)
	at org.apache.lucene.util.TestRuleStoreClassName$1.evaluate(TestRuleStoreClassName.java:42)
	at com.carrotsearch.randomizedtesting.rules.SystemPropertiesInvariantRule$1.evaluate(SystemPropertiesInvariantRule.java:55)
	at com.carrotsearch.randomizedtesting.rules.NoShadowingOrOverridesOnMethodsRule$1.evaluate(NoShadowingOrOverridesOnMethodsRule.java:39)
	at com.carrotsearch.randomizedtesting.rules.NoShadowingOrOverridesOnMethodsRule$1.evaluate(NoShadowingOrOverridesOnMethodsRule.java:39)
	at com.carrotsearch.randomizedtesting.rules.StatementAdapter.evaluate(StatementAdapter.java:36)
	at com.carrotsearch.randomizedtesting.rules.StatementAdapter.evaluate(StatementAdapter.java:36)
	at com.carrotsearch.randomizedtesting.rules.StatementAdapter.evaluate(StatementAdapter.java:36)
	at org.apache.lucene.util.TestRuleAssertionsRequired$1.evaluate(TestRuleAssertionsRequired.java:54)
	at org.apache.lucene.util.TestRuleMarkFailure$1.evaluate(TestRuleMarkFailure.java:48)
	at org.apache.lucene.util.TestRuleIgnoreAfterMaxFailures$1.evaluate(TestRuleIgnoreAfterMaxFailures.java:65)
	at org.apache.lucene.util.TestRuleIgnoreTestSuites$1.evaluate(TestRuleIgnoreTestSuites.java:55)
	at com.carrotsearch.randomizedtesting.rules.StatementAdapter.evaluate(StatementAdapter.java:36)
	at com.carrotsearch.randomizedtesting.ThreadLeakControl$StatementRunner.run(ThreadLeakControl.java:365)
	at java.lang.Thread.run(Thread.java:745)


FAILED:  org.apache.lucene.codecs.lucene50.TestBlockPostingsFormat2.testDFBlockSize

Error Message:
On Linux and MacOSX fsyncing a directory should not throw IOException, we just don't want to rely on that in production (undocumented). Got: java.nio.file.FileSystemException: /mnt/ssd/jenkins/workspace/Lucene-Solr-5.x-Linux/lucene/build/core/test/J1/temp/lucene.codecs.lucene50.TestBlockPostingsFormat2 DCAA4FA2B5A6C7D0-001/testDFBlockSize-004: Is a directory

Stack Trace:
java.lang.AssertionError: On Linux and MacOSX fsyncing a directory should not throw IOException, we just don't want to rely on that in production (undocumented). Got: java.nio.file.FileSystemException: /mnt/ssd/jenkins/workspace/Lucene-Solr-5.x-Linux/lucene/build/core/test/J1/temp/lucene.codecs.lucene50.TestBlockPostingsFormat2 DCAA4FA2B5A6C7D0-001/testDFBlockSize-004: Is a directory
	at org.apache.lucene.util.IOUtils.fsync(IOUtils.java:418)
	at org.apache.lucene.store.FSDirectory.renameFile(FSDirectory.java:236)
	at org.apache.lucene.store.MockDirectoryWrapper.renameFile(MockDirectoryWrapper.java:268)
	at org.apache.lucene.index.SegmentInfos.finishCommit(SegmentInfos.java:727)
	at org.apache.lucene.index.IndexWriter.finishCommit(IndexWriter.java:2914)
	at org.apache.lucene.index.IndexWriter.commitInternal(IndexWriter.java:2895)
	at org.apache.lucene.index.IndexWriter.commit(IndexWriter.java:2855)
	at org.apache.lucene.index.RandomIndexWriter.maybeCommit(RandomIndexWriter.java:158)
	at org.apache.lucene.index.RandomIndexWriter.addDocument(RandomIndexWriter.java:149)
	at org.apache.lucene.index.RandomIndexWriter.addDocument(RandomIndexWriter.java:107)
	at org.apache.lucene.codecs.lucene50.TestBlockPostingsFormat2.testDFBlockSize(TestBlockPostingsFormat2.java:92)
	at sun.reflect.NativeMethodAccessorImpl.invoke0(Native Method)
	at sun.reflect.NativeMethodAccessorImpl.invoke(NativeMethodAccessorImpl.java:62)
	at sun.reflect.DelegatingMethodAccessorImpl.invoke(DelegatingMethodAccessorImpl.java:43)
	at java.lang.reflect.Method.invoke(Method.java:498)
	at com.carrotsearch.randomizedtesting.RandomizedRunner.invoke(RandomizedRunner.java:1618)
	at com.carrotsearch.randomizedtesting.RandomizedRunner$6.evaluate(RandomizedRunner.java:827)
	at com.carrotsearch.randomizedtesting.RandomizedRunner$7.evaluate(RandomizedRunner.java:863)
	at com.carrotsearch.randomizedtesting.RandomizedRunner$8.evaluate(RandomizedRunner.java:877)
	at org.apache.lucene.util.TestRuleSetupTeardownChained$1.evaluate(TestRuleSetupTeardownChained.java:50)
	at org.apache.lucene.util.AbstractBeforeAfterRule$1.evaluate(AbstractBeforeAfterRule.java:46)
	at com.carrotsearch.randomizedtesting.rules.SystemPropertiesInvariantRule$1.evaluate(SystemPropertiesInvariantRule.java:55)
	at org.apache.lucene.util.TestRuleThreadAndTestName$1.evaluate(TestRuleThreadAndTestName.java:49)
	at org.apache.lucene.util.TestRuleIgnoreAfterMaxFailures$1.evaluate(TestRuleIgnoreAfterMaxFailures.java:65)
	at org.apache.lucene.util.TestRuleMarkFailure$1.evaluate(TestRuleMarkFailure.java:48)
	at com.carrotsearch.randomizedtesting.rules.StatementAdapter.evaluate(StatementAdapter.java:36)
	at com.carrotsearch.randomizedtesting.ThreadLeakControl$StatementRunner.run(ThreadLeakControl.java:365)
	at com.carrotsearch.randomizedtesting.ThreadLeakControl.forkTimeoutingTask(ThreadLeakControl.java:798)
	at com.carrotsearch.randomizedtesting.ThreadLeakControl$3.evaluate(ThreadLeakControl.java:458)
	at com.carrotsearch.randomizedtesting.RandomizedRunner.runSingleTest(RandomizedRunner.java:836)
	at com.carrotsearch.randomizedtesting.RandomizedRunner$3.evaluate(RandomizedRunner.java:738)
	at com.carrotsearch.randomizedtesting.RandomizedRunner$4.evaluate(RandomizedRunner.java:772)
	at com.carrotsearch.randomizedtesting.RandomizedRunner$5.evaluate(RandomizedRunner.java:783)
	at org.apache.lucene.util.AbstractBeforeAfterRule$1.evaluate(AbstractBeforeAfterRule.java:46)
	at org.apache.lucene.util.TestRuleStoreClassName$1.evaluate(TestRuleStoreClassName.java:42)
	at com.carrotsearch.randomizedtesting.rules.SystemPropertiesInvariantRule$1.evaluate(SystemPropertiesInvariantRule.java:55)
	at com.carrotsearch.randomizedtesting.rules.NoShadowingOrOverridesOnMethodsRule$1.evaluate(NoShadowingOrOverridesOnMethodsRule.java:39)
	at com.carrotsearch.randomizedtesting.rules.NoShadowingOrOverridesOnMethodsRule$1.evaluate(NoShadowingOrOverridesOnMethodsRule.java:39)
	at com.carrotsearch.randomizedtesting.rules.StatementAdapter.evaluate(StatementAdapter.java:36)
	at com.carrotsearch.randomizedtesting.rules.StatementAdapter.evaluate(StatementAdapter.java:36)
	at com.carrotsearch.randomizedtesting.rules.StatementAdapter.evaluate(StatementAdapter.java:36)
	at org.apache.lucene.util.TestRuleAssertionsRequired$1.evaluate(TestRuleAssertionsRequired.java:54)
	at org.apache.lucene.util.TestRuleMarkFailure$1.evaluate(TestRuleMarkFailure.java:48)
	at org.apache.lucene.util.TestRuleIgnoreAfterMaxFailures$1.evaluate(TestRuleIgnoreAfterMaxFailures.java:65)
	at org.apache.lucene.util.TestRuleIgnoreTestSuites$1.evaluate(TestRuleIgnoreTestSuites.java:55)
	at com.carrotsearch.randomizedtesting.rules.StatementAdapter.evaluate(StatementAdapter.java:36)
	at com.carrotsearch.randomizedtesting.ThreadLeakControl$StatementRunner.run(ThreadLeakControl.java:365)
	at java.lang.Thread.run(Thread.java:745)


FAILED:  org.apache.lucene.codecs.lucene50.TestLucene50DocValuesFormat.testSortedSetVariableLengthSingleValuedVsStoredFields

Error Message:
On Linux and MacOSX fsyncing a directory should not throw IOException, we just don't want to rely on that in production (undocumented). Got: java.nio.file.FileSystemException: /mnt/ssd/jenkins/workspace/Lucene-Solr-5.x-Linux/lucene/build/core/test/J0/temp/lucene.codecs.lucene50.TestLucene50DocValuesFormat DCAA4FA2B5A6C7D0-001/dvduel-001: Is a directory

Stack Trace:
java.lang.AssertionError: On Linux and MacOSX fsyncing a directory should not throw IOException, we just don't want to rely on that in production (undocumented). Got: java.nio.file.FileSystemException: /mnt/ssd/jenkins/workspace/Lucene-Solr-5.x-Linux/lucene/build/core/test/J0/temp/lucene.codecs.lucene50.TestLucene50DocValuesFormat DCAA4FA2B5A6C7D0-001/dvduel-001: Is a directory
	at __randomizedtesting.SeedInfo.seed([DCAA4FA2B5A6C7D0:2CD904949FA5D723]:0)
	at org.apache.lucene.util.IOUtils.fsync(IOUtils.java:418)
	at org.apache.lucene.store.FSDirectory.renameFile(FSDirectory.java:236)
	at org.apache.lucene.store.MockDirectoryWrapper.renameFile(MockDirectoryWrapper.java:268)
	at org.apache.lucene.index.SegmentInfos.finishCommit(SegmentInfos.java:727)
	at org.apache.lucene.index.IndexWriter.finishCommit(IndexWriter.java:2914)
	at org.apache.lucene.index.IndexWriter.commitInternal(IndexWriter.java:2895)
	at org.apache.lucene.index.IndexWriter.commit(IndexWriter.java:2855)
	at org.apache.lucene.index.RandomIndexWriter.commit(RandomIndexWriter.java:257)
	at org.apache.lucene.index.BaseDocValuesFormatTestCase.doTestSortedSetVsStoredFields(BaseDocValuesFormatTestCase.java:1977)
	at org.apache.lucene.index.BaseDocValuesFormatTestCase.testSortedSetVariableLengthSingleValuedVsStoredFields(BaseDocValuesFormatTestCase.java:2129)
	at sun.reflect.NativeMethodAccessorImpl.invoke0(Native Method)
	at sun.reflect.NativeMethodAccessorImpl.invoke(NativeMethodAccessorImpl.java:62)
	at sun.reflect.DelegatingMethodAccessorImpl.invoke(DelegatingMethodAccessorImpl.java:43)
	at java.lang.reflect.Method.invoke(Method.java:498)
	at com.carrotsearch.randomizedtesting.RandomizedRunner.invoke(RandomizedRunner.java:1618)
	at com.carrotsearch.randomizedtesting.RandomizedRunner$6.evaluate(RandomizedRunner.java:827)
	at com.carrotsearch.randomizedtesting.RandomizedRunner$7.evaluate(RandomizedRunner.java:863)
	at com.carrotsearch.randomizedtesting.RandomizedRunner$8.evaluate(RandomizedRunner.java:877)
	at org.apache.lucene.util.TestRuleSetupTeardownChained$1.evaluate(TestRuleSetupTeardownChained.java:50)
	at org.apache.lucene.util.AbstractBeforeAfterRule$1.evaluate(AbstractBeforeAfterRule.java:46)
	at com.carrotsearch.randomizedtesting.rules.SystemPropertiesInvariantRule$1.evaluate(SystemPropertiesInvariantRule.java:55)
	at org.apache.lucene.util.TestRuleThreadAndTestName$1.evaluate(TestRuleThreadAndTestName.java:49)
	at org.apache.lucene.util.TestRuleIgnoreAfterMaxFailures$1.evaluate(TestRuleIgnoreAfterMaxFailures.java:65)
	at org.apache.lucene.util.TestRuleMarkFailure$1.evaluate(TestRuleMarkFailure.java:48)
	at com.carrotsearch.randomizedtesting.rules.StatementAdapter.evaluate(StatementAdapter.java:36)
	at com.carrotsearch.randomizedtesting.ThreadLeakControl$StatementRunner.run(ThreadLeakControl.java:365)
	at com.carrotsearch.randomizedtesting.ThreadLeakControl.forkTimeoutingTask(ThreadLeakControl.java:798)
	at com.carrotsearch.randomizedtesting.ThreadLeakControl$3.evaluate(ThreadLeakControl.java:458)
	at com.carrotsearch.randomizedtesting.RandomizedRunner.runSingleTest(RandomizedRunner.java:836)
	at com.carrotsearch.randomizedtesting.RandomizedRunner$3.evaluate(RandomizedRunner.java:738)
	at com.carrotsearch.randomizedtesting.RandomizedRunner$4.evaluate(RandomizedRunner.java:772)
	at com.carrotsearch.randomizedtesting.RandomizedRunner$5.evaluate(RandomizedRunner.java:783)
	at org.apache.lucene.util.AbstractBeforeAfterRule$1.evaluate(AbstractBeforeAfterRule.java:46)
	at org.apache.lucene.util.TestRuleStoreClassName$1.evaluate(TestRuleStoreClassName.java:42)
	at com.carrotsearch.randomizedtesting.rules.SystemPropertiesInvariantRule$1.evaluate(SystemPropertiesInvariantRule.java:55)
	at com.carrotsearch.randomizedtesting.rules.NoShadowingOrOverridesOnMethodsRule$1.evaluate(NoShadowingOrOverridesOnMethodsRule.java:39)
	at com.carrotsearch.randomizedtesting.rules.NoShadowingOrOverridesOnMethodsRule$1.evaluate(NoShadowingOrOverridesOnMethodsRule.java:39)
	at com.carrotsearch.randomizedtesting.rules.StatementAdapter.evaluate(StatementAdapter.java:36)
	at com.carrotsearch.randomizedtesting.rules.StatementAdapter.evaluate(StatementAdapter.java:36)
	at com.carrotsearch.randomizedtesting.rules.StatementAdapter.evaluate(StatementAdapter.java:36)
	at org.apache.lucene.util.TestRuleAssertionsRequired$1.evaluate(TestRuleAssertionsRequired.java:54)
	at org.apache.lucene.util.TestRuleMarkFailure$1.evaluate(TestRuleMarkFailure.java:48)
	at org.apache.lucene.util.TestRuleIgnoreAfterMaxFailures$1.evaluate(TestRuleIgnoreAfterMaxFailures.java:65)
	at org.apache.lucene.util.TestRuleIgnoreTestSuites$1.evaluate(TestRuleIgnoreTestSuites.java:55)
	at com.carrotsearch.randomizedtesting.rules.StatementAdapter.evaluate(StatementAdapter.java:36)
	at com.carrotsearch.randomizedtesting.ThreadLeakControl$StatementRunner.run(ThreadLeakControl.java:365)
	at java.lang.Thread.run(Thread.java:745)


FAILED:  org.apache.lucene.codecs.lucene50.TestLucene50DocValuesFormat.testSortedSetFixedLengthSingleValuedVsStoredFields

Error Message:
On Linux and MacOSX fsyncing a directory should not throw IOException, we just don't want to rely on that in production (undocumented). Got: java.nio.file.FileSystemException: /mnt/ssd/jenkins/workspace/Lucene-Solr-5.x-Linux/lucene/build/core/test/J0/temp/lucene.codecs.lucene50.TestLucene50DocValuesFormat DCAA4FA2B5A6C7D0-001/dvduel-002: Is a directory

Stack Trace:
java.lang.AssertionError: On Linux and MacOSX fsyncing a directory should not throw IOException, we just don't want to rely on that in production (undocumented). Got: java.nio.file.FileSystemException: /mnt/ssd/jenkins/workspace/Lucene-Solr-5.x-Linux/lucene/build/core/test/J0/temp/lucene.codecs.lucene50.TestLucene50DocValuesFormat DCAA4FA2B5A6C7D0-001/dvduel-002: Is a directory
	at __randomizedtesting.SeedInfo.seed([DCAA4FA2B5A6C7D0:58DBFA4456DF5CCD]:0)
	at org.apache.lucene.util.IOUtils.fsync(IOUtils.java:418)
	at org.apache.lucene.store.FSDirectory.renameFile(FSDirectory.java:236)
	at org.apache.lucene.store.MockDirectoryWrapper.renameFile(MockDirectoryWrapper.java:268)
	at org.apache.lucene.index.SegmentInfos.finishCommit(SegmentInfos.java:727)
	at org.apache.lucene.index.IndexWriter.finishCommit(IndexWriter.java:2914)
	at org.apache.lucene.index.IndexWriter.commitInternal(IndexWriter.java:2895)
	at org.apache.lucene.index.IndexWriter.commit(IndexWriter.java:2855)
	at org.apache.lucene.index.RandomIndexWriter.commit(RandomIndexWriter.java:257)
	at org.apache.lucene.index.BaseDocValuesFormatTestCase.doTestSortedSetVsStoredFields(BaseDocValuesFormatTestCase.java:1977)
	at org.apache.lucene.index.BaseDocValuesFormatTestCase.testSortedSetFixedLengthSingleValuedVsStoredFields(BaseDocValuesFormatTestCase.java:2121)
	at sun.reflect.NativeMethodAccessorImpl.invoke0(Native Method)
	at sun.reflect.NativeMethodAccessorImpl.invoke(NativeMethodAccessorImpl.java:62)
	at sun.reflect.DelegatingMethodAccessorImpl.invoke(DelegatingMethodAccessorImpl.java:43)
	at java.lang.reflect.Method.invoke(Method.java:498)
	at com.carrotsearch.randomizedtesting.RandomizedRunner.invoke(RandomizedRunner.java:1618)
	at com.carrotsearch.randomizedtesting.RandomizedRunner$6.evaluate(RandomizedRunner.java:827)
	at com.carrotsearch.randomizedtesting.RandomizedRunner$7.evaluate(RandomizedRunner.java:863)
	at com.carrotsearch.randomizedtesting.RandomizedRunner$8.evaluate(RandomizedRunner.java:877)
	at org.apache.lucene.util.TestRuleSetupTeardownChained$1.evaluate(TestRuleSetupTeardownChained.java:50)
	at org.apache.lucene.util.AbstractBeforeAfterRule$1.evaluate(AbstractBeforeAfterRule.java:46)
	at com.carrotsearch.randomizedtesting.rules.SystemPropertiesInvariantRule$1.evaluate(SystemPropertiesInvariantRule.java:55)
	at org.apache.lucene.util.TestRuleThreadAndTestName$1.evaluate(TestRuleThreadAndTestName.java:49)
	at org.apache.lucene.util.TestRuleIgnoreAfterMaxFailures$1.evaluate(TestRuleIgnoreAfterMaxFailures.java:65)
	at org.apache.lucene.util.TestRuleMarkFailure$1.evaluate(TestRuleMarkFailure.java:48)
	at com.carrotsearch.randomizedtesting.rules.StatementAdapter.evaluate(StatementAdapter.java:36)
	at com.carrotsearch.randomizedtesting.ThreadLeakControl$StatementRunner.run(ThreadLeakControl.java:365)
	at com.carrotsearch.randomizedtesting.ThreadLeakControl.forkTimeoutingTask(ThreadLeakControl.java:798)
	at com.carrotsearch.randomizedtesting.ThreadLeakControl$3.evaluate(ThreadLeakControl.java:458)
	at com.carrotsearch.randomizedtesting.RandomizedRunner.runSingleTest(RandomizedRunner.java:836)
	at com.carrotsearch.randomizedtesting.RandomizedRunner$3.evaluate(RandomizedRunner.java:738)
	at com.carrotsearch.randomizedtesting.RandomizedRunner$4.evaluate(RandomizedRunner.java:772)
	at com.carrotsearch.randomizedtesting.RandomizedRunner$5.evaluate(RandomizedRunner.java:783)
	at org.apache.lucene.util.AbstractBeforeAfterRule$1.evaluate(AbstractBeforeAfterRule.java:46)
	at org.apache.lucene.util.TestRuleStoreClassName$1.evaluate(TestRuleStoreClassName.java:42)
	at com.carrotsearch.randomizedtesting.rules.SystemPropertiesInvariantRule$1.evaluate(SystemPropertiesInvariantRule.java:55)
	at com.carrotsearch.randomizedtesting.rules.NoShadowingOrOverridesOnMethodsRule$1.evaluate(NoShadowingOrOverridesOnMethodsRule.java:39)
	at com.carrotsearch.randomizedtesting.rules.NoShadowingOrOverridesOnMethodsRule$1.evaluate(NoShadowingOrOverridesOnMethodsRule.java:39)
	at com.carrotsearch.randomizedtesting.rules.StatementAdapter.evaluate(StatementAdapter.java:36)
	at com.carrotsearch.randomizedtesting.rules.StatementAdapter.evaluate(StatementAdapter.java:36)
	at com.carrotsearch.randomizedtesting.rules.StatementAdapter.evaluate(StatementAdapter.java:36)
	at org.apache.lucene.util.TestRuleAssertionsRequired$1.evaluate(TestRuleAssertionsRequired.java:54)
	at org.apache.lucene.util.TestRuleMarkFailure$1.evaluate(TestRuleMarkFailure.java:48)
	at org.apache.lucene.util.TestRuleIgnoreAfterMaxFailures$1.evaluate(TestRuleIgnoreAfterMaxFailures.java:65)
	at org.apache.lucene.util.TestRuleIgnoreTestSuites$1.evaluate(TestRuleIgnoreTestSuites.java:55)
	at com.carrotsearch.randomizedtesting.rules.StatementAdapter.evaluate(StatementAdapter.java:36)
	at com.carrotsearch.randomizedtesting.ThreadLeakControl$StatementRunner.run(ThreadLeakControl.java:365)
	at java.lang.Thread.run(Thread.java:745)


FAILED:  org.apache.lucene.codecs.lucene50.TestLucene50DocValuesFormat.testSortedVariableLengthBigVsStoredFields

Error Message:
On Linux and MacOSX fsyncing a directory should not throw IOException, we just don't want to rely on that in production (undocumented). Got: java.nio.file.FileSystemException: /mnt/ssd/jenkins/workspace/Lucene-Solr-5.x-Linux/lucene/build/core/test/J0/temp/lucene.codecs.lucene50.TestLucene50DocValuesFormat DCAA4FA2B5A6C7D0-001/dvduel-003: Is a directory

Stack Trace:
java.lang.AssertionError: On Linux and MacOSX fsyncing a directory should not throw IOException, we just don't want to rely on that in production (undocumented). Got: java.nio.file.FileSystemException: /mnt/ssd/jenkins/workspace/Lucene-Solr-5.x-Linux/lucene/build/core/test/J0/temp/lucene.codecs.lucene50.TestLucene50DocValuesFormat DCAA4FA2B5A6C7D0-001/dvduel-003: Is a directory
	at __randomizedtesting.SeedInfo.seed([DCAA4FA2B5A6C7D0:2C5A08C786BD625F]:0)
	at org.apache.lucene.util.IOUtils.fsync(IOUtils.java:418)
	at org.apache.lucene.store.FSDirectory.renameFile(FSDirectory.java:236)
	at org.apache.lucene.store.MockDirectoryWrapper.renameFile(MockDirectoryWrapper.java:268)
	at org.apache.lucene.index.SegmentInfos.finishCommit(SegmentInfos.java:727)
	at org.apache.lucene.index.IndexWriter.finishCommit(IndexWriter.java:2914)
	at org.apache.lucene.index.IndexWriter.commitInternal(IndexWriter.java:2895)
	at org.apache.lucene.index.IndexWriter.commit(IndexWriter.java:2855)
	at org.apache.lucene.index.RandomIndexWriter.commit(RandomIndexWriter.java:257)
	at org.apache.lucene.index.BaseDocValuesFormatTestCase.doTestSortedVsStoredFields(BaseDocValuesFormatTestCase.java:1446)
	at org.apache.lucene.codecs.lucene50.TestLucene50DocValuesFormat.testSortedVariableLengthBigVsStoredFields(TestLucene50DocValuesFormat.java:82)
	at sun.reflect.NativeMethodAccessorImpl.invoke0(Native Method)
	at sun.reflect.NativeMethodAccessorImpl.invoke(NativeMethodAccessorImpl.java:62)
	at sun.reflect.DelegatingMethodAccessorImpl.invoke(DelegatingMethodAccessorImpl.java:43)
	at java.lang.reflect.Method.invoke(Method.java:498)
	at com.carrotsearch.randomizedtesting.RandomizedRunner.invoke(RandomizedRunner.java:1618)
	at com.carrotsearch.randomizedtesting.RandomizedRunner$6.evaluate(RandomizedRunner.java:827)
	at com.carrotsearch.randomizedtesting.RandomizedRunner$7.evaluate(RandomizedRunner.java:863)
	at com.carrotsearch.randomizedtesting.RandomizedRunner$8.evaluate(RandomizedRunner.java:877)
	at org.apache.lucene.util.TestRuleSetupTeardownChained$1.evaluate(TestRuleSetupTeardownChained.java:50)
	at org.apache.lucene.util.AbstractBeforeAfterRule$1.evaluate(AbstractBeforeAfterRule.java:46)
	at com.carrotsearch.randomizedtesting.rules.SystemPropertiesInvariantRule$1.evaluate(SystemPropertiesInvariantRule.java:55)
	at org.apache.lucene.util.TestRuleThreadAndTestName$1.evaluate(TestRuleThreadAndTestName.java:49)
	at org.apache.lucene.util.TestRuleIgnoreAfterMaxFailures$1.evaluate(TestRuleIgnoreAfterMaxFailures.java:65)
	at org.apache.lucene.util.TestRuleMarkFailure$1.evaluate(TestRuleMarkFailure.java:48)
	at com.carrotsearch.randomizedtesting.rules.StatementAdapter.evaluate(StatementAdapter.java:36)
	at com.carrotsearch.randomizedtesting.ThreadLeakControl$StatementRunner.run(ThreadLeakControl.java:365)
	at com.carrotsearch.randomizedtesting.ThreadLeakControl.forkTimeoutingTask(ThreadLeakControl.java:798)
	at com.carrotsearch.randomizedtesting.ThreadLeakControl$3.evaluate(ThreadLeakControl.java:458)
	at com.carrotsearch.randomizedtesting.RandomizedRunner.runSingleTest(RandomizedRunner.java:836)
	at com.carrotsearch.randomizedtesting.RandomizedRunner$3.evaluate(RandomizedRunner.java:738)
	at com.carrotsearch.randomizedtesting.RandomizedRunner$4.evaluate(RandomizedRunner.java:772)
	at com.carrotsearch.randomizedtesting.RandomizedRunner$5.evaluate(RandomizedRunner.java:783)
	at org.apache.lucene.util.AbstractBeforeAfterRule$1.evaluate(AbstractBeforeAfterRule.java:46)
	at org.apache.lucene.util.TestRuleStoreClassName$1.evaluate(TestRuleStoreClassName.java:42)
	at com.carrotsearch.randomizedtesting.rules.SystemPropertiesInvariantRule$1.evaluate(SystemPropertiesInvariantRule.java:55)
	at com.carrotsearch.randomizedtesting.rules.NoShadowingOrOverridesOnMethodsRule$1.evaluate(NoShadowingOrOverridesOnMethodsRule.java:39)
	at com.carrotsearch.randomizedtesting.rules.NoShadowingOrOverridesOnMethodsRule$1.evaluate(NoShadowingOrOverridesOnMethodsRule.java:39)
	at com.carrotsearch.randomizedtesting.rules.StatementAdapter.evaluate(StatementAdapter.java:36)
	at com.carrotsearch.randomizedtesting.rules.StatementAdapter.evaluate(StatementAdapter.java:36)
	at com.carrotsearch.randomizedtesting.rules.StatementAdapter.evaluate(StatementAdapter.java:36)
	at org.apache.lucene.util.TestRuleAssertionsRequired$1.evaluate(TestRuleAssertionsRequired.java:54)
	at org.apache.lucene.util.TestRuleMarkFailure$1.evaluate(TestRuleMarkFailure.java:48)
	at org.apache.lucene.util.TestRuleIgnoreAfterMaxFailures$1.evaluate(TestRuleIgnoreAfterMaxFailures.java:65)
	at org.apache.lucene.util.TestRuleIgnoreTestSuites$1.evaluate(TestRuleIgnoreTestSuites.java:55)
	at com.carrotsearch.randomizedtesting.rules.StatementAdapter.evaluate(StatementAdapter.java:36)
	at com.carrotsearch.randomizedtesting.ThreadLeakControl$StatementRunner.run(ThreadLeakControl.java:365)
	at java.lang.Thread.run(Thread.java:745)


FAILED:  org.apache.lucene.codecs.lucene50.TestLucene50DocValuesFormat.testTermsEnumFixedWidth

Error Message:
On Linux and MacOSX fsyncing a directory should not throw IOException, we just don't want to rely on that in production (undocumented). Got: java.nio.file.FileSystemException: /mnt/ssd/jenkins/workspace/Lucene-Solr-5.x-Linux/lucene/build/core/test/J0/temp/lucene.codecs.lucene50.TestLucene50DocValuesFormat DCAA4FA2B5A6C7D0-001/tempDir-001: Is a directory

Stack Trace:
java.lang.AssertionError: On Linux and MacOSX fsyncing a directory should not throw IOException, we just don't want to rely on that in production (undocumented). Got: java.nio.file.FileSystemException: /mnt/ssd/jenkins/workspace/Lucene-Solr-5.x-Linux/lucene/build/core/test/J0/temp/lucene.codecs.lucene50.TestLucene50DocValuesFormat DCAA4FA2B5A6C7D0-001/tempDir-001: Is a directory
	at __randomizedtesting.SeedInfo.seed([DCAA4FA2B5A6C7D0:21AAF479EFBF429C]:0)
	at org.apache.lucene.util.IOUtils.fsync(IOUtils.java:418)
	at org.apache.lucene.store.FSDirectory.renameFile(FSDirectory.java:236)
	at org.apache.lucene.store.FilterDirectory.renameFile(FilterDirectory.java:83)
	at org.apache.lucene.index.SegmentInfos.finishCommit(SegmentInfos.java:727)
	at org.apache.lucene.index.IndexWriter.finishCommit(IndexWriter.java:2914)
	at org.apache.lucene.index.IndexWriter.commitInternal(IndexWriter.java:2895)
	at org.apache.lucene.index.IndexWriter.commit(IndexWriter.java:2855)
	at org.apache.lucene.index.RandomIndexWriter.commit(RandomIndexWriter.java:257)
	at org.apache.lucene.codecs.lucene50.TestLucene50DocValuesFormat.doTestTermsEnumRandom(TestLucene50DocValuesFormat.java:170)
	at org.apache.lucene.codecs.lucene50.TestLucene50DocValuesFormat.testTermsEnumFixedWidth(TestLucene50DocValuesFormat.java:98)
	at sun.reflect.NativeMethodAccessorImpl.invoke0(Native Method)
	at sun.reflect.NativeMethodAccessorImpl.invoke(NativeMethodAccessorImpl.java:62)
	at sun.reflect.DelegatingMethodAccessorImpl.invoke(DelegatingMethodAccessorImpl.java:43)
	at java.lang.reflect.Method.invoke(Method.java:498)
	at com.carrotsearch.randomizedtesting.RandomizedRunner.invoke(RandomizedRunner.java:1618)
	at com.carrotsearch.randomizedtesting.RandomizedRunner$6.evaluate(RandomizedRunner.java:827)
	at com.carrotsearch.randomizedtesting.RandomizedRunner$7.evaluate(RandomizedRunner.java:863)
	at com.carrotsearch.randomizedtesting.RandomizedRunner$8.evaluate(RandomizedRunner.java:877)
	at org.apache.lucene.util.TestRuleSetupTeardownChained$1.evaluate(TestRuleSetupTeardownChained.java:50)
	at org.apache.lucene.util.AbstractBeforeAfterRule$1.evaluate(AbstractBeforeAfterRule.java:46)
	at com.carrotsearch.randomizedtesting.rules.SystemPropertiesInvariantRule$1.evaluate(SystemPropertiesInvariantRule.java:55)
	at org.apache.lucene.util.TestRuleThreadAndTestName$1.evaluate(TestRuleThreadAndTestName.java:49)
	at org.apache.lucene.util.TestRuleIgnoreAfterMaxFailures$1.evaluate(TestRuleIgnoreAfterMaxFailures.java:65)
	at org.apache.lucene.util.TestRuleMarkFailure$1.evaluate(TestRuleMarkFailure.java:48)
	at com.carrotsearch.randomizedtesting.rules.StatementAdapter.evaluate(StatementAdapter.java:36)
	at com.carrotsearch.randomizedtesting.ThreadLeakControl$StatementRunner.run(ThreadLeakControl.java:365)
	at com.carrotsearch.randomizedtesting.ThreadLeakControl.forkTimeoutingTask(ThreadLeakControl.java:798)
	at com.carrotsearch.randomizedtesting.ThreadLeakControl$3.evaluate(ThreadLeakControl.java:458)
	at com.carrotsearch.randomizedtesting.RandomizedRunner.runSingleTest(RandomizedRunner.java:836)
	at com.carrotsearch.randomizedtesting.RandomizedRunner$3.evaluate(RandomizedRunner.java:738)
	at com.carrotsearch.randomizedtesting.RandomizedRunner$4.evaluate(RandomizedRunner.java:772)
	at com.carrotsearch.randomizedtesting.RandomizedRunner$5.evaluate(RandomizedRunner.java:783)
	at org.apache.lucene.util.AbstractBeforeAfterRule$1.evaluate(AbstractBeforeAfterRule.java:46)
	at org.apache.lucene.util.TestRuleStoreClassName$1.evaluate(TestRuleStoreClassName.java:42)
	at com.carrotsearch.randomizedtesting.rules.SystemPropertiesInvariantRule$1.evaluate(SystemPropertiesInvariantRule.java:55)
	at com.carrotsearch.randomizedtesting.rules.NoShadowingOrOverridesOnMethodsRule$1.evaluate(NoShadowingOrOverridesOnMethodsRule.java:39)
	at com.carrotsearch.randomizedtesting.rules.NoShadowingOrOverridesOnMethodsRule$1.evaluate(NoShadowingOrOverridesOnMethodsRule.java:39)
	at com.carrotsearch.randomizedtesting.rules.StatementAdapter.evaluate(StatementAdapter.java:36)
	at com.carrotsearch.randomizedtesting.rules.StatementAdapter.evaluate(StatementAdapter.java:36)
	at com.carrotsearch.randomizedtesting.rules.StatementAdapter.evaluate(StatementAdapter.java:36)
	at org.apache.lucene.util.TestRuleAssertionsRequired$1.evaluate(TestRuleAssertionsRequired.java:54)
	at org.apache.lucene.util.TestRuleMarkFailure$1.evaluate(TestRuleMarkFailure.java:48)
	at org.apache.lucene.util.TestRuleIgnoreAfterMaxFailures$1.evaluate(TestRuleIgnoreAfterMaxFailures.java:65)
	at org.apache.lucene.util.TestRuleIgnoreTestSuites$1.evaluate(TestRuleIgnoreTestSuites.java:55)
	at com.carrotsearch.randomizedtesting.rules.StatementAdapter.evaluate(StatementAdapter.java:36)
	at com.carrotsearch.randomizedtesting.ThreadLeakControl$StatementRunner.run(ThreadLeakControl.java:365)
	at java.lang.Thread.run(Thread.java:745)


FAILED:  org.apache.lucene.codecs.lucene50.TestLucene50DocValuesFormat.testSortedSetFixedLengthVsStoredFields

Error Message:
On Linux and MacOSX fsyncing a directory should not throw IOException, we just don't want to rely on that in production (undocumented). Got: java.nio.file.FileSystemException: /mnt/ssd/jenkins/workspace/Lucene-Solr-5.x-Linux/lucene/build/core/test/J0/temp/lucene.codecs.lucene50.TestLucene50DocValuesFormat DCAA4FA2B5A6C7D0-001/dvduel-004: Is a directory

Stack Trace:
java.lang.AssertionError: On Linux and MacOSX fsyncing a directory should not throw IOException, we just don't want to rely on that in production (undocumented). Got: java.nio.file.FileSystemException: /mnt/ssd/jenkins/workspace/Lucene-Solr-5.x-Linux/lucene/build/core/test/J0/temp/lucene.codecs.lucene50.TestLucene50DocValuesFormat DCAA4FA2B5A6C7D0-001/dvduel-004: Is a directory
	at __randomizedtesting.SeedInfo.seed([DCAA4FA2B5A6C7D0:A9D9FE6EA25B9F86]:0)
	at org.apache.lucene.util.IOUtils.fsync(IOUtils.java:418)
	at org.apache.lucene.store.FSDirectory.renameFile(FSDirectory.java:236)
	at org.apache.lucene.store.MockDirectoryWrapper.renameFile(MockDirectoryWrapper.java:268)
	at org.apache.lucene.index.SegmentInfos.finishCommit(SegmentInfos.java:727)
	at org.apache.lucene.index.IndexWriter.finishCommit(IndexWriter.java:2914)
	at org.apache.lucene.index.IndexWriter.commitInternal(IndexWriter.java:2895)
	at org.apache.lucene.index.IndexWriter.commit(IndexWriter.java:2855)
	at org.apache.lucene.index.RandomIndexWriter.commit(RandomIndexWriter.java:257)
	at org.apache.lucene.index.BaseDocValuesFormatTestCase.doTestSortedSetVsStoredFields(BaseDocValuesFormatTestCase.java:1977)
	at org.apache.lucene.index.BaseDocValuesFormatTestCase.testSortedSetFixedLengthVsStoredFields(BaseDocValuesFormatTestCase.java:2041)
	at sun.reflect.NativeMethodAccessorImpl.invoke0(Native Method)
	at sun.reflect.NativeMethodAccessorImpl.invoke(NativeMethodAccessorImpl.java:62)
	at sun.reflect.DelegatingMethodAccessorImpl.invoke(DelegatingMethodAccessorImpl.java:43)
	at java.lang.reflect.Method.invoke(Method.java:498)
	at com.carrotsearch.randomizedtesting.RandomizedRunner.invoke(RandomizedRunner.java:1618)
	at com.carrotsearch.randomizedtesting.RandomizedRunner$6.evaluate(RandomizedRunner.java:827)
	at com.carrotsearch.randomizedtesting.RandomizedRunner$7.evaluate(RandomizedRunner.java:863)
	at com.carrotsearch.randomizedtesting.RandomizedRunner$8.evaluate(RandomizedRunner.java:877)
	at org.apache.lucene.util.TestRuleSetupTeardownChained$1.evaluate(TestRuleSetupTeardownChained.java:50)
	at org.apache.lucene.util.AbstractBeforeAfterRule$1.evaluate(AbstractBeforeAfterRule.java:46)
	at com.carrotsearch.randomizedtesting.rules.SystemPropertiesInvariantRule$1.evaluate(SystemPropertiesInvariantRule.java:55)
	at org.apache.lucene.util.TestRuleThreadAndTestName$1.evaluate(TestRuleThreadAndTestName.java:49)
	at org.apache.lucene.util.TestRuleIgnoreAfterMaxFailures$1.evaluate(TestRuleIgnoreAfterMaxFailures.java:65)
	at org.apache.lucene.util.TestRuleMarkFailure$1.evaluate(TestRuleMarkFailure.java:48)
	at com.carrotsearch.randomizedtesting.rules.StatementAdapter.evaluate(StatementAdapter.java:36)
	at com.carrotsearch.randomizedtesting.ThreadLeakControl$StatementRunner.run(ThreadLeakControl.java:365)
	at com.carrotsearch.randomizedtesting.ThreadLeakControl.forkTimeoutingTask(ThreadLeakControl.java:798)
	at com.carrotsearch.randomizedtesting.ThreadLeakControl$3.evaluate(ThreadLeakControl.java:458)
	at com.carrotsearch.randomizedtesting.RandomizedRunner.runSingleTest(RandomizedRunner.java:836)
	at com.carrotsearch.randomizedtesting.RandomizedRunner$3.evaluate(RandomizedRunner.java:738)
	at com.carrotsearch.randomizedtesting.RandomizedRunner$4.evaluate(RandomizedRunner.java:772)
	at com.carrotsearch.randomizedtesting.RandomizedRunner$5.evaluate(RandomizedRunner.java:783)
	at org.apache.lucene.util.AbstractBeforeAfterRule$1.evaluate(AbstractBeforeAfterRule.java:46)
	at org.apache.lucene.util.TestRuleStoreClassName$1.evaluate(TestRuleStoreClassName.java:42)
	at com.carrotsearch.randomizedtesting.rules.SystemPropertiesInvariantRule$1.evaluate(SystemPropertiesInvariantRule.java:55)
	at com.carrotsearch.randomizedtesting.rules.NoShadowingOrOverridesOnMethodsRule$1.evaluate(NoShadowingOrOverridesOnMethodsRule.java:39)
	at com.carrotsearch.randomizedtesting.rules.NoShadowingOrOverridesOnMethodsRule$1.evaluate(NoShadowingOrOverridesOnMethodsRule.java:39)
	at com.carrotsearch.randomizedtesting.rules.StatementAdapter.evaluate(StatementAdapter.java:36)
	at com.carrotsearch.randomizedtesting.rules.StatementAdapter.evaluate(StatementAdapter.java:36)
	at com.carrotsearch.randomizedtesting.rules.StatementAdapter.evaluate(StatementAdapter.java:36)
	at org.apache.lucene.util.TestRuleAssertionsRequired$1.evaluate(TestRuleAssertionsRequired.java:54)
	at org.apache.lucene.util.TestRuleMarkFailure$1.evaluate(TestRuleMarkFailure.java:48)
	at org.apache.lucene.util.TestRuleIgnoreAfterMaxFailures$1.evaluate(TestRuleIgnoreAfterMaxFailures.java:65)
	at org.apache.lucene.util.TestRuleIgnoreTestSuites$1.evaluate(TestRuleIgnoreTestSuites.java:55)
	at com.carrotsearch.randomizedtesting.rules.StatementAdapter.evaluate(StatementAdapter.java:36)
	at com.carrotsearch.randomizedtesting.ThreadLeakControl$StatementRunner.run(ThreadLeakControl.java:365)
	at java.lang.Thread.run(Thread.java:745)


FAILED:  org.apache.lucene.codecs.lucene50.TestLucene50DocValuesFormat.testTermsEnumVariableWidth

Error Message:
On Linux and MacOSX fsyncing a directory should not throw IOException, we just don't want to rely on that in production (undocumented). Got: java.nio.file.FileSystemException: /mnt/ssd/jenkins/workspace/Lucene-Solr-5.x-Linux/lucene/build/core/test/J0/temp/lucene.codecs.lucene50.TestLucene50DocValuesFormat DCAA4FA2B5A6C7D0-001/tempDir-002: Is a directory

Stack Trace:
java.lang.AssertionError: On Linux and MacOSX fsyncing a directory should not throw IOException, we just don't want to rely on that in production (undocumented). Got: java.nio.file.FileSystemException: /mnt/ssd/jenkins/workspace/Lucene-Solr-5.x-Linux/lucene/build/core/test/J0/temp/lucene.codecs.lucene50.TestLucene50DocValuesFormat DCAA4FA2B5A6C7D0-001/tempDir-002: Is a directory
	at __randomizedtesting.SeedInfo.seed([DCAA4FA2B5A6C7D0:19965B5D0819F99B]:0)
	at org.apache.lucene.util.IOUtils.fsync(IOUtils.java:418)
	at org.apache.lucene.store.FSDirectory.renameFile(FSDirectory.java:236)
	at org.apache.lucene.store.MockDirectoryWrapper.renameFile(MockDirectoryWrapper.java:268)
	at org.apache.lucene.index.SegmentInfos.finishCommit(SegmentInfos.java:727)
	at org.apache.lucene.index.IndexWriter.finishCommit(IndexWriter.java:2914)
	at org.apache.lucene.index.IndexWriter.commitInternal(IndexWriter.java:2895)
	at org.apache.lucene.index.IndexWriter.commit(IndexWriter.java:2855)
	at org.apache.lucene.index.RandomIndexWriter.commit(RandomIndexWriter.java:257)
	at org.apache.lucene.codecs.lucene50.TestLucene50DocValuesFormat.doTestTermsEnumRandom(TestLucene50DocValuesFormat.java:170)
	at org.apache.lucene.codecs.lucene50.TestLucene50DocValuesFormat.testTermsEnumVariableWidth(TestLucene50DocValuesFormat.java:106)
	at sun.reflect.NativeMethodAccessorImpl.invoke0(Native Method)
	at sun.reflect.NativeMethodAccessorImpl.invoke(NativeMethodAccessorImpl.java:62)
	at sun.reflect.DelegatingMethodAccessorImpl.invoke(DelegatingMethodAccessorImpl.java:43)
	at java.lang.reflect.Method.invoke(Method.java:498)
	at com.carrotsearch.randomizedtesting.RandomizedRunner.invoke(RandomizedRunner.java:1618)
	at com.carrotsearch.randomizedtesting.RandomizedRunner$6.evaluate(RandomizedRunner.java:827)
	at com.carrotsearch.randomizedtesting.RandomizedRunner$7.evaluate(RandomizedRunner.java:863)
	at com.carrotsearch.randomizedtesting.RandomizedRunner$8.evaluate(RandomizedRunner.java:877)
	at org.apache.lucene.util.TestRuleSetupTeardownChained$1.evaluate(TestRuleSetupTeardownChained.java:50)
	at org.apache.lucene.util.AbstractBeforeAfterRule$1.evaluate(AbstractBeforeAfterRule.java:46)
	at com.carrotsearch.randomizedtesting.rules.SystemPropertiesInvariantRule$1.evaluate(SystemPropertiesInvariantRule.java:55)
	at org.apache.lucene.util.TestRuleThreadAndTestName$1.evaluate(TestRuleThreadAndTestName.java:49)
	at org.apache.lucene.util.TestRuleIgnoreAfterMaxFailures$1.evaluate(TestRuleIgnoreAfterMaxFailures.java:65)
	at org.apache.lucene.util.TestRuleMarkFailure$1.evaluate(TestRuleMarkFailure.java:48)
	at com.carrotsearch.randomizedtesting.rules.StatementAdapter.evaluate(StatementAdapter.java:36)
	at com.carrotsearch.randomizedtesting.ThreadLeakControl$StatementRunner.run(ThreadLeakControl.java:365)
	at com.carrotsearch.randomizedtesting.ThreadLeakControl.forkTimeoutingTask(ThreadLeakControl.java:798)
	at com.carrotsearch.randomizedtesting.ThreadLeakControl$3.evaluate(ThreadLeakControl.java:458)
	at com.carrotsearch.randomizedtesting.RandomizedRunner.runSingleTest(RandomizedRunner.java:836)
	at com.carrotsearch.randomizedtesting.RandomizedRunner$3.evaluate(RandomizedRunner.java:738)
	at com.carrotsearch.randomizedtesting.RandomizedRunner$4.evaluate(RandomizedRunner.java:772)
	at com.carrotsearch.randomizedtesting.RandomizedRunner$5.evaluate(RandomizedRunner.java:783)
	at org.apache.lucene.util.AbstractBeforeAfterRule$1.evaluate(AbstractBeforeAfterRule.java:46)
	at org.apache.lucene.util.TestRuleStoreClassName$1.evaluate(TestRuleStoreClassName.java:42)
	at com.carrotsearch.randomizedtesting.rules.SystemPropertiesInvariantRule$1.evaluate(SystemPropertiesInvariantRule.java:55)
	at com.carrotsearch.randomizedtesting.rules.NoShadowingOrOverridesOnMethodsRule$1.evaluate(NoShadowingOrOverridesOnMethodsRule.java:39)
	at com.carrotsearch.randomizedtesting.rules.NoShadowingOrOverridesOnMethodsRule$1.evaluate(NoShadowingOrOverridesOnMethodsRule.java:39)
	at com.carrotsearch.randomizedtesting.rules.StatementAdapter.evaluate(StatementAdapter.java:36)
	at com.carrotsearch.randomizedtesting.rules.StatementAdapter.evaluate(StatementAdapter.java:36)
	at com.carrotsearch.randomizedtesting.rules.StatementAdapter.evaluate(StatementAdapter.java:36)
	at org.apache.lucene.util.TestRuleAssertionsRequired$1.evaluate(TestRuleAssertionsRequired.java:54)
	at org.apache.lucene.util.TestRuleMarkFailure$1.evaluate(TestRuleMarkFailure.java:48)
	at org.apache.lucene.util.TestRuleIgnoreAfterMaxFailures$1.evaluate(TestRuleIgnoreAfterMaxFailures.java:65)
	at org.apache.lucene.util.TestRuleIgnoreTestSuites$1.evaluate(TestRuleIgnoreTestSuites.java:55)
	at com.carrotsearch.randomizedtesting.rules.StatementAdapter.evaluate(StatementAdapter.java:36)
	at com.carrotsearch.randomizedtesting.ThreadLeakControl$StatementRunner.run(ThreadLeakControl.java:365)
	at java.lang.Thread.run(Thread.java:745)


FAILED:  org.apache.lucene.codecs.lucene50.TestLucene50DocValuesFormat.testOneFloat

Error Message:
On Linux and MacOSX fsyncing a directory should not throw IOException, we just don't want to rely on that in production (undocumented). Got: java.nio.file.FileSystemException: /mnt/ssd/jenkins/workspace/Lucene-Solr-5.x-Linux/lucene/build/core/test/J0/temp/lucene.codecs.lucene50.TestLucene50DocValuesFormat DCAA4FA2B5A6C7D0-001/index-NIOFSDirectory-001: Is a directory

Stack Trace:
java.lang.AssertionError: On Linux and MacOSX fsyncing a directory should not throw IOException, we just don't want to rely on that in production (undocumented). Got: java.nio.file.FileSystemException: /mnt/ssd/jenkins/workspace/Lucene-Solr-5.x-Linux/lucene/build/core/test/J0/temp/lucene.codecs.lucene50.TestLucene50DocValuesFormat DCAA4FA2B5A6C7D0-001/index-NIOFSDirectory-001: Is a directory
	at __randomizedtesting.SeedInfo.seed([DCAA4FA2B5A6C7D0:5F19C56DB2B28ABC]:0)
	at org.apache.lucene.util.IOUtils.fsync(IOUtils.java:418)
	at org.apache.lucene.store.FSDirectory.renameFile(FSDirectory.java:236)
	at org.apache.lucene.store.MockDirectoryWrapper.renameFile(MockDirectoryWrapper.java:268)
	at org.apache.lucene.index.SegmentInfos.finishCommit(SegmentInfos.java:727)
	at org.apache.lucene.index.IndexWriter.finishCommit(IndexWriter.java:2914)
	at org.apache.lucene.index.IndexWriter.commitInternal(IndexWriter.java:2895)
	at org.apache.lucene.index.IndexWriter.shutdown(IndexWriter.java:965)
	at org.apache.lucene.index.IndexWriter.close(IndexWriter.java:1008)
	at org.apache.lucene.index.RandomIndexWriter.close(RandomIndexWriter.java:369)
	at org.apache.lucene.index.BaseDocValuesFormatTestCase.testOneFloat(BaseDocValuesFormatTestCase.java:136)
	at sun.reflect.NativeMethodAccessorImpl.invoke0(Native Method)
	at sun.reflect.NativeMethodAccessorImpl.invoke(NativeMethodAccessorImpl.java:62)
	at sun.reflect.DelegatingMethodAccessorImpl.invoke(DelegatingMethodAccessorImpl.java:43)
	at java.lang.reflect.Method.invoke(Method.java:498)
	at com.carrotsearch.randomizedtesting.RandomizedRunner.invoke(RandomizedRunner.java:1618)
	at com.carrotsearch.randomizedtesting.RandomizedRunner$6.evaluate(RandomizedRunner.java:827)
	at com.carrotsearch.randomizedtesting.RandomizedRunner$7.evaluate(RandomizedRunner.java:863)
	at com.carrotsearch.randomizedtesting.RandomizedRunner$8.evaluate(RandomizedRunner.java:877)
	at org.apache.lucene.util.TestRuleSetupTeardownChained$1.evaluate(TestRuleSetupTeardownChained.java:50)
	at org.apache.lucene.util.AbstractBeforeAfterRule$1.evaluate(AbstractBeforeAfterRule.java:46)
	at com.carrotsearch.randomizedtesting.rules.SystemPropertiesInvariantRule$1.evaluate(SystemPropertiesInvariantRule.java:55)
	at org.apache.lucene.util.TestRuleThreadAndTestName$1.evaluate(TestRuleThreadAndTestName.java:49)
	at org.apache.lucene.util.TestRuleIgnoreAfterMaxFailures$1.evaluate(TestRuleIgnoreAfterMaxFailures.java:65)
	at org.apache.lucene.util.TestRuleMarkFailure$1.evaluate(TestRuleMarkFailure.java:48)
	at com.carrotsearch.randomizedtesting.rules.StatementAdapter.evaluate(StatementAdapter.java:36)
	at com.carrotsearch.randomizedtesting.ThreadLeakControl$StatementRunner.run(ThreadLeakControl.java:365)
	at com.carrotsearch.randomizedtesting.ThreadLeakControl.forkTimeoutingTask(ThreadLeakControl.java:798)
	at com.carrotsearch.randomizedtesting.ThreadLeakControl$3.evaluate(ThreadLeakControl.java:458)
	at com.carrotsearch.randomizedtesting.RandomizedRunner.runSingleTest(RandomizedRunner.java:836)
	at com.carrotsearch.randomizedtesting.RandomizedRunner$3.evaluate(RandomizedRunner.java:738)
	at com.carrotsearch.randomizedtesting.RandomizedRunner$4.evaluate(RandomizedRunner.java:772)
	at com.carrotsearch.randomizedtesting.RandomizedRunner$5.evaluate(RandomizedRunner.java:783)
	at org.apache.lucene.util.AbstractBeforeAfterRule$1.evaluate(AbstractBeforeAfterRule.java:46)
	at org.apache.lucene.util.TestRuleStoreClassName$1.evaluate(TestRuleStoreClassName.java:42)
	at com.carrotsearch.randomizedtesting.rules.SystemPropertiesInvariantRule$1.evaluate(SystemPropertiesInvariantRule.java:55)
	at com.carrotsearch.randomizedtesting.rules.NoShadowingOrOverridesOnMethodsRule$1.evaluate(NoShadowingOrOverridesOnMethodsRule.java:39)
	at com.carrotsearch.randomizedtesting.rules.NoShadowingOrOverridesOnMethodsRule$1.evaluate(NoShadowingOrOverridesOnMethodsRule.java:39)
	at com.carrotsearch.randomizedtesting.rules.StatementAdapter.evaluate(StatementAdapter.java:36)
	at com.carrotsearch.randomizedtesting.rules.StatementAdapter.evaluate(StatementAdapter.java:36)
	at com.carrotsearch.randomizedtesting.rules.StatementAdapter.evaluate(StatementAdapter.java:36)
	at org.apache.lucene.util.TestRuleAssertionsRequired$1.evaluate(TestRuleAssertionsRequired.java:54)
	at org.apache.lucene.util.TestRuleMarkFailure$1.evaluate(TestRuleMarkFailure.java:48)
	at org.apache.lucene.util.TestRuleIgnoreAfterMaxFailures$1.evaluate(TestRuleIgnoreAfterMaxFailures.java:65)
	at org.apache.lucene.util.TestRuleIgnoreTestSuites$1.evaluate(TestRuleIgnoreTestSuites.java:55)
	at com.carrotsearch.randomizedtesting.rules.StatementAdapter.evaluate(StatementAdapter.java:36)
	at com.carrotsearch.randomizedtesting.ThreadLeakControl$StatementRunner.run(ThreadLeakControl.java:365)
	at java.lang.Thread.run(Thread.java:745)


FAILED:  org.apache.lucene.codecs.lucene50.TestLucene50DocValuesFormat.testSortedSetVariableLengthVsStoredFields

Error Message:
On Linux and MacOSX fsyncing a directory should not throw IOException, we just don't want to rely on that in production (undocumented). Got: java.nio.file.FileSystemException: /mnt/ssd/jenkins/workspace/Lucene-Solr-5.x-Linux/lucene/build/core/test/J0/temp/lucene.codecs.lucene50.TestLucene50DocValuesFormat DCAA4FA2B5A6C7D0-001/dvduel-005: Is a directory

Stack Trace:
java.lang.AssertionError: On Linux and MacOSX fsyncing a directory should not throw IOException, we just don't want to rely on that in production (undocumented). Got: java.nio.file.FileSystemException: /mnt/ssd/jenkins/workspace/Lucene-Solr-5.x-Linux/lucene/build/core/test/J0/temp/lucene.codecs.lucene50.TestLucene50DocValuesFormat DCAA4FA2B5A6C7D0-001/dvduel-005: Is a directory
	at __randomizedtesting.SeedInfo.seed([DCAA4FA2B5A6C7D0:F8BB1E5ED15AD07D]:0)
	at org.apache.lucene.util.IOUtils.fsync(IOUtils.java:418)
	at org.apache.lucene.store.FSDirectory.renameFile(FSDirectory.java:236)
	at org.apache.lucene.store.MockDirectoryWrapper.renameFile(MockDirectoryWrapper.java:268)
	at org.apache.lucene.index.SegmentInfos.finishCommit(SegmentInfos.java:727)
	at org.apache.lucene.index.IndexWriter.finishCommit(IndexWriter.java:2914)
	at org.apache.lucene.index.IndexWriter.commitInternal(IndexWriter.java:2895)
	at org.apache.lucene.index.IndexWriter.commit(IndexWriter.java:2855)
	at org.apache.lucene.index.RandomIndexWriter.commit(RandomIndexWriter.java:257)
	at org.apache.lucene.index.BaseDocValuesFormatTestCase.doTestSortedSetVsStoredFields(BaseDocValuesFormatTestCase.java:1977)
	at org.apache.lucene.index.BaseDocValuesFormatTestCase.testSortedSetVariableLengthVsStoredFields(BaseDocValuesFormatTestCase.java:2112)
	at sun.reflect.NativeMethodAccessorImpl.invoke0(Native Method)
	at sun.reflect.NativeMethodAccessorImpl.invoke(NativeMethodAccessorImpl.java:62)
	at sun.reflect.DelegatingMethodAccessorImpl.invoke(DelegatingMethodAccessorImpl.java:43)
	at java.lang.reflect.Method.invoke(Method.java:498)
	at com.carrotsearch.randomizedtesting.RandomizedRunner.invoke(RandomizedRunner.java:1618)
	at com.carrotsearch.randomizedtesting.RandomizedRunner$6.evaluate(RandomizedRunner.java:827)
	at com.carrotsearch.randomizedtesting.RandomizedRunner$7.evaluate(RandomizedRunner.java:863)
	at com.carrotsearch.randomizedtesting.RandomizedRunner$8.evaluate(RandomizedRunner.java:877)
	at org.apache.lucene.util.TestRuleSetupTeardownChained$1.evaluate(TestRuleSetupTeardownChained.java:50)
	at org.apache.lucene.util.AbstractBeforeAfterRule$1.evaluate(AbstractBeforeAfterRule.java:46)
	at com.carrotsearch.randomizedtesting.rules.SystemPropertiesInvariantRule$1.evaluate(SystemPropertiesInvariantRule.java:55)
	at org.apache.lucene.util.TestRuleThreadAndTestName$1.evaluate(TestRuleThreadAndTestName.java:49)
	at org.apache.lucene.util.TestRuleIgnoreAfterMaxFailures$1.evaluate(TestRuleIgnoreAfterMaxFailures.java:65)
	at org.apache.lucene.util.TestRuleMarkFailure$1.evaluate(TestRuleMarkFailure.java:48)
	at com.carrotsearch.randomizedtesting.rules.StatementAdapter.evaluate(StatementAdapter.java:36)
	at com.carrotsearch.randomizedtesting.ThreadLeakControl$StatementRunner.run(ThreadLeakControl.java:3

[...truncated too long message...]

.concurrent.ThreadPoolExecutor.getTask(ThreadPoolExecutor.java:1066)
   [junit4]    >         at java.util.concurrent.ThreadPoolExecutor.runWorker(ThreadPoolExecutor.java:1127)
   [junit4]    >         at java.util.concurrent.ThreadPoolExecutor$Worker.run(ThreadPoolExecutor.java:617)
   [junit4]    >         at java.lang.Thread.run(Thread.java:745)
   [junit4]    >    6) Thread[id=713, name=TestSearcherManager-17-thread-3, state=TIMED_WAITING, group=TGRP-TestSearcherManager]
   [junit4]    >         at sun.misc.Unsafe.park(Native Method)
   [junit4]    >         at java.util.concurrent.locks.LockSupport.parkNanos(LockSupport.java:215)
   [junit4]    >         at java.util.concurrent.SynchronousQueue$TransferStack.awaitFulfill(SynchronousQueue.java:460)
   [junit4]    >         at java.util.concurrent.SynchronousQueue$TransferStack.transfer(SynchronousQueue.java:362)
   [junit4]    >         at java.util.concurrent.SynchronousQueue.poll(SynchronousQueue.java:941)
   [junit4]    >         at java.util.concurrent.ThreadPoolExecutor.getTask(ThreadPoolExecutor.java:1066)
   [junit4]    >         at java.util.concurrent.ThreadPoolExecutor.runWorker(ThreadPoolExecutor.java:1127)
   [junit4]    >         at java.util.concurrent.ThreadPoolExecutor$Worker.run(ThreadPoolExecutor.java:617)
   [junit4]    >         at java.lang.Thread.run(Thread.java:745)
   [junit4]    >    7) Thread[id=714, name=TestSearcherManager-17-thread-5, state=TIMED_WAITING, group=TGRP-TestSearcherManager]
   [junit4]    >         at sun.misc.Unsafe.park(Native Method)
   [junit4]    >         at java.util.concurrent.locks.LockSupport.parkNanos(LockSupport.java:215)
   [junit4]    >         at java.util.concurrent.SynchronousQueue$TransferStack.awaitFulfill(SynchronousQueue.java:460)
   [junit4]    >         at java.util.concurrent.SynchronousQueue$TransferStack.transfer(SynchronousQueue.java:362)
   [junit4]    >         at java.util.concurrent.SynchronousQueue.poll(SynchronousQueue.java:941)
   [junit4]    >         at java.util.concurrent.ThreadPoolExecutor.getTask(ThreadPoolExecutor.java:1066)
   [junit4]    >         at java.util.concurrent.ThreadPoolExecutor.runWorker(ThreadPoolExecutor.java:1127)
   [junit4]    >         at java.util.concurrent.ThreadPoolExecutor$Worker.run(ThreadPoolExecutor.java:617)
   [junit4]    >         at java.lang.Thread.run(Thread.java:745)
   [junit4]    >    8) Thread[id=711, name=TestSearcherManager-17-thread-2, state=TIMED_WAITING, group=TGRP-TestSearcherManager]
   [junit4]    >         at sun.misc.Unsafe.park(Native Method)
   [junit4]    >         at java.util.concurrent.locks.LockSupport.parkNanos(LockSupport.java:215)
   [junit4]    >         at java.util.concurrent.SynchronousQueue$TransferStack.awaitFulfill(SynchronousQueue.java:460)
   [junit4]    >         at java.util.concurrent.SynchronousQueue$TransferStack.transfer(SynchronousQueue.java:362)
   [junit4]    >         at java.util.concurrent.SynchronousQueue.poll(SynchronousQueue.java:941)
   [junit4]    >         at java.util.concurrent.ThreadPoolExecutor.getTask(ThreadPoolExecutor.java:1066)
   [junit4]    >         at java.util.concurrent.ThreadPoolExecutor.runWorker(ThreadPoolExecutor.java:1127)
   [junit4]    >         at java.util.concurrent.ThreadPoolExecutor$Worker.run(ThreadPoolExecutor.java:617)
   [junit4]    >         at java.lang.Thread.run(Thread.java:745)
   [junit4]    > 	at __randomizedtesting.SeedInfo.seed([DCAA4FA2B5A6C7D0]:0)
   [junit4] Completed on J0 in 26.30s, 9 tests, 3 errors <<< FAILURES!

[...truncated 123 lines...]
   [junit4] Suite: org.apache.lucene.index.TestIndexWriterReader
   [junit4]   2> NOTE: reproduce with: ant test  -Dtestcase=TestIndexWriterReader -Dtests.method=testIsCurrent -Dtests.seed=DCAA4FA2B5A6C7D0 -Dtests.multiplier=3 -Dtests.slow=true -Dtests.locale=es_US -Dtests.timezone=America/Grand_Turk -Dtests.asserts=true -Dtests.file.encoding=UTF-8
   [junit4] FAILURE 0.01s J1 | TestIndexWriterReader.testIsCurrent <<<
   [junit4]    > Throwable #1: java.lang.AssertionError: On Linux and MacOSX fsyncing a directory should not throw IOException, we just don't want to rely on that in production (undocumented). Got: java.nio.file.FileSystemException: /mnt/ssd/jenkins/workspace/Lucene-Solr-5.x-Linux/lucene/build/core/test/J1/temp/lucene.index.TestIndexWriterReader DCAA4FA2B5A6C7D0-001/index-MMapDirectory-001: Is a directory
   [junit4]    > 	at __randomizedtesting.SeedInfo.seed([DCAA4FA2B5A6C7D0:4E36153F92CA809F]:0)
   [junit4]    > 	at org.apache.lucene.util.IOUtils.fsync(IOUtils.java:418)
   [junit4]    > 	at org.apache.lucene.store.FSDirectory.renameFile(FSDirectory.java:236)
   [junit4]    > 	at org.apache.lucene.store.MockDirectoryWrapper.renameFile(MockDirectoryWrapper.java:268)
   [junit4]    > 	at org.apache.lucene.index.SegmentInfos.finishCommit(SegmentInfos.java:727)
   [junit4]    > 	at org.apache.lucene.index.IndexWriter.finishCommit(IndexWriter.java:2914)
   [junit4]    > 	at org.apache.lucene.index.IndexWriter.commitInternal(IndexWriter.java:2895)
   [junit4]    > 	at org.apache.lucene.index.IndexWriter.shutdown(IndexWriter.java:965)
   [junit4]    > 	at org.apache.lucene.index.IndexWriter.close(IndexWriter.java:1008)
   [junit4]    > 	at org.apache.lucene.index.TestIndexWriterReader.testIsCurrent(TestIndexWriterReader.java:197)
   [junit4]    > 	at java.lang.Thread.run(Thread.java:745)
   [junit4] IGNOR/A 0.00s J1 | TestIndexWriterReader.testDuringAddIndexes
   [junit4]    > Assumption #1: 'nightly' test group is disabled (@Nightly())
   [junit4]   2> NOTE: leaving temporary files on disk at: /mnt/ssd/jenkins/workspace/Lucene-Solr-5.x-Linux/lucene/build/core/test/J1/temp/lucene.index.TestIndexWriterReader DCAA4FA2B5A6C7D0-001
   [junit4]   2> NOTE: test params are: codec=Asserting(Lucene50): {field1=PostingsFormat(name=LuceneVarGapFixedInterval), field=Lucene50(blocksize=128), indexname=PostingsFormat(name=Asserting), foo=Lucene50(blocksize=128), id=PostingsFormat(name=Asserting), field3=PostingsFormat(name=Asserting), field2=FST50, field5=PostingsFormat(name=LuceneVarGapFixedInterval), field4=Lucene50(blocksize=128)}, docValues:{}, sim=DefaultSimilarity, locale=es_US, timezone=America/Grand_Turk
   [junit4]   2> NOTE: Linux 3.13.0-43-generic amd64/Oracle Corporation 1.9.0-ea (64-bit)/cpus=8,threads=1,free=355646744,total=536870912
   [junit4]   2> NOTE: All tests run in this JVM: [TestDocValues, TestQueryWrapperFilter, TestNIOFSDirectory, TestSimpleExplanationsOfNonMatches, TestTimSorter, TestMultiPhraseQuery, TestLevenshteinAutomata, TestThreadedForceMerge, TestCrash, TestDocTermOrdsRangeFilter, TestDirectPacked, TestUsageTrackingFilterCachingPolicy, TestPrefixInBooleanQuery, TestTerm, TestBagOfPositions, TestMinShouldMatch2, TestTotalHitCountCollector, TestIndexWriterCommit, TestComplexExplanationsOfNonMatches, TestSpans, TestEliasFanoSequence, TestDocValuesScoring, TestPrefixFilter, TestMinimize, TestSegmentReader, TestShardSearching, TestSimpleAttributeImpl, TestOfflineSorter, TestMixedCodecs, TestNoMergePolicy, TestLongPostings, TestDocTermOrdsRewriteMethod, TestNamedSPILoader, TestCharsRef, FuzzyTermOnShortTermsTest, TestCodecHoldsOpenFiles, TestIndexWriterWithThreads, TestParallelTermEnum, TestPayloadsOnVectors, TestSameTokenSamePosition, TestSparseFixedBitSet, TestBinaryDocValuesUpdates, TestFieldCacheRewriteMethod, TestFastCompressionMode, TestHighCompressionMode, TestMmapDirectory, TestSubScorerFreqs, TestTieredMergePolicy, TestBitUtil, TestMultiDocValues, TestSearchWithThreads, TestForTooMuchCloning, TestIndexWriterMergePolicy, Test2BPositions, TestMultiMMap, TestFieldCacheTermsFilter, TestNumericRangeQuery64, TestSpanSearchEquivalence, TestPayloadTermQuery, TestIndexFileDeleter, TestIntroSorter, TestNumericTokenStream, TestFilterCachingPolicy, TestAutomatonQuery, TestLockFactory, TestBinaryDocument, TestIndexInput, TestNGramPhraseQuery, TestAllFilesHaveChecksumFooter, TestCustomSearcherSort, TestTopScoreDocCollector, TestSparseFixedBitDocIdSet, TestMockFilesystems, TestFlushByRamOrCountsPolicy, TestFuzzyQuery, TestSimilarity, TestRollingBuffer, TestCachingTokenFilter, TestAssertingTermVectorsFormat, TestTopFieldCollector, TestFlex, TestLRUFilterCache, TestMutableValues, TestPagedBytes, TestDisjunctionMaxQuery, TestManyFields, TestToken, TestDeletionPolicy, TestIsCurrent, TestIndexWriterOutOfMemory, TestSentinelIntSet, TestGraphTokenizers, TestMultiTermQueryRewrites, TestAtomicUpdate, TestCharFilter, TestTermRangeQuery, TestPhraseQuery, TestBlockPostingsFormat2, TestBooleanScorer, TestPerFieldDocValuesFormat, TestIndexWriterReader]
   [junit4] Completed on J1 in 8.27s, 23 tests, 1 failure, 1 skipped <<< FAILURES!

[...truncated 549 lines...]
BUILD FAILED
/mnt/ssd/jenkins/workspace/Lucene-Solr-5.x-Linux/build.xml:529: The following error occurred while executing this line:
/mnt/ssd/jenkins/workspace/Lucene-Solr-5.x-Linux/build.xml:477: The following error occurred while executing this line:
/mnt/ssd/jenkins/workspace/Lucene-Solr-5.x-Linux/build.xml:61: The following error occurred while executing this line:
/mnt/ssd/jenkins/workspace/Lucene-Solr-5.x-Linux/extra-targets.xml:39: The following error occurred while executing this line:
/mnt/ssd/jenkins/workspace/Lucene-Solr-5.x-Linux/lucene/build.xml:49: The following error occurred while executing this line:
/mnt/ssd/jenkins/workspace/Lucene-Solr-5.x-Linux/lucene/common-build.xml:1363: The following error occurred while executing this line:
/mnt/ssd/jenkins/workspace/Lucene-Solr-5.x-Linux/lucene/common-build.xml:970: There were test failures: 409 suites, 3188 tests, 2 suite-level errors, 3 errors, 50 failures, 1660 ignored (29 assumptions)

Total time: 5 minutes 2 seconds
Build step 'Invoke Ant' marked build as failure
[description-setter] Description set: Java: 64bit/jdk1.9.0-ea-b44 -XX:+UseCompressedOops -XX:+UseG1GC
Archiving artifacts
Recording test results
Email was triggered for: Failure - Any
Sending email for trigger: Failure - Any



Mime
View raw message