lucene-dev mailing list archives

Site index · List index
Message view « Date » · « Thread »
Top « Date » · « Thread »
From Apache Jenkins Server <jenk...@builds.apache.org>
Subject [JENKINS] Lucene-Solr-Tests-5.x-Java7 - Build # 2469 - Still Failing
Date Mon, 12 Jan 2015 13:06:43 GMT
Build: https://builds.apache.org/job/Lucene-Solr-Tests-5.x-Java7/2469/

4 tests failed.
FAILED:  org.apache.solr.cloud.HttpPartitionTest.testDistribSearch

Error Message:
org.apache.solr.client.solrj.SolrServerException: IOException occured when talking to server at: http://127.0.0.1:23877/ks/c8n_1x2_shard1_replica2

Stack Trace:
org.apache.solr.client.solrj.SolrServerException: org.apache.solr.client.solrj.SolrServerException: IOException occured when talking to server at: http://127.0.0.1:23877/ks/c8n_1x2_shard1_replica2
	at __randomizedtesting.SeedInfo.seed([DFE551FCA5F08D31:5E03DFE4D2AFED0D]:0)
	at org.apache.solr.client.solrj.impl.CloudSolrClient.directUpdate(CloudSolrClient.java:581)
	at org.apache.solr.client.solrj.impl.CloudSolrClient.sendRequest(CloudSolrClient.java:890)
	at org.apache.solr.client.solrj.impl.CloudSolrClient.requestWithRetryOnStaleState(CloudSolrClient.java:793)
	at org.apache.solr.client.solrj.impl.CloudSolrClient.request(CloudSolrClient.java:736)
	at org.apache.solr.cloud.HttpPartitionTest.sendDoc(HttpPartitionTest.java:480)
	at org.apache.solr.cloud.HttpPartitionTest.testRf2(HttpPartitionTest.java:201)
	at org.apache.solr.cloud.HttpPartitionTest.doTest(HttpPartitionTest.java:114)
	at org.apache.solr.BaseDistributedSearchTestCase.testDistribSearch(BaseDistributedSearchTestCase.java:868)
	at sun.reflect.NativeMethodAccessorImpl.invoke0(Native Method)
	at sun.reflect.NativeMethodAccessorImpl.invoke(NativeMethodAccessorImpl.java:57)
	at sun.reflect.DelegatingMethodAccessorImpl.invoke(DelegatingMethodAccessorImpl.java:43)
	at java.lang.reflect.Method.invoke(Method.java:606)
	at com.carrotsearch.randomizedtesting.RandomizedRunner.invoke(RandomizedRunner.java:1618)
	at com.carrotsearch.randomizedtesting.RandomizedRunner$6.evaluate(RandomizedRunner.java:827)
	at com.carrotsearch.randomizedtesting.RandomizedRunner$7.evaluate(RandomizedRunner.java:863)
	at com.carrotsearch.randomizedtesting.RandomizedRunner$8.evaluate(RandomizedRunner.java:877)
	at com.carrotsearch.randomizedtesting.rules.SystemPropertiesRestoreRule$1.evaluate(SystemPropertiesRestoreRule.java:53)
	at org.apache.lucene.util.TestRuleSetupTeardownChained$1.evaluate(TestRuleSetupTeardownChained.java:50)
	at org.apache.lucene.util.AbstractBeforeAfterRule$1.evaluate(AbstractBeforeAfterRule.java:46)
	at com.carrotsearch.randomizedtesting.rules.SystemPropertiesInvariantRule$1.evaluate(SystemPropertiesInvariantRule.java:55)
	at org.apache.lucene.util.TestRuleThreadAndTestName$1.evaluate(TestRuleThreadAndTestName.java:49)
	at org.apache.lucene.util.TestRuleIgnoreAfterMaxFailures$1.evaluate(TestRuleIgnoreAfterMaxFailures.java:65)
	at org.apache.lucene.util.TestRuleMarkFailure$1.evaluate(TestRuleMarkFailure.java:48)
	at com.carrotsearch.randomizedtesting.rules.StatementAdapter.evaluate(StatementAdapter.java:36)
	at com.carrotsearch.randomizedtesting.ThreadLeakControl$StatementRunner.run(ThreadLeakControl.java:365)
	at com.carrotsearch.randomizedtesting.ThreadLeakControl.forkTimeoutingTask(ThreadLeakControl.java:798)
	at com.carrotsearch.randomizedtesting.ThreadLeakControl$3.evaluate(ThreadLeakControl.java:458)
	at com.carrotsearch.randomizedtesting.RandomizedRunner.runSingleTest(RandomizedRunner.java:836)
	at com.carrotsearch.randomizedtesting.RandomizedRunner$3.evaluate(RandomizedRunner.java:738)
	at com.carrotsearch.randomizedtesting.RandomizedRunner$4.evaluate(RandomizedRunner.java:772)
	at com.carrotsearch.randomizedtesting.RandomizedRunner$5.evaluate(RandomizedRunner.java:783)
	at com.carrotsearch.randomizedtesting.rules.StatementAdapter.evaluate(StatementAdapter.java:36)
	at com.carrotsearch.randomizedtesting.rules.SystemPropertiesRestoreRule$1.evaluate(SystemPropertiesRestoreRule.java:53)
	at org.apache.lucene.util.AbstractBeforeAfterRule$1.evaluate(AbstractBeforeAfterRule.java:46)
	at org.apache.lucene.util.TestRuleStoreClassName$1.evaluate(TestRuleStoreClassName.java:42)
	at com.carrotsearch.randomizedtesting.rules.SystemPropertiesInvariantRule$1.evaluate(SystemPropertiesInvariantRule.java:55)
	at com.carrotsearch.randomizedtesting.rules.NoShadowingOrOverridesOnMethodsRule$1.evaluate(NoShadowingOrOverridesOnMethodsRule.java:39)
	at com.carrotsearch.randomizedtesting.rules.NoShadowingOrOverridesOnMethodsRule$1.evaluate(NoShadowingOrOverridesOnMethodsRule.java:39)
	at com.carrotsearch.randomizedtesting.rules.StatementAdapter.evaluate(StatementAdapter.java:36)
	at com.carrotsearch.randomizedtesting.rules.StatementAdapter.evaluate(StatementAdapter.java:36)
	at com.carrotsearch.randomizedtesting.rules.StatementAdapter.evaluate(StatementAdapter.java:36)
	at org.apache.lucene.util.TestRuleAssertionsRequired$1.evaluate(TestRuleAssertionsRequired.java:54)
	at org.apache.lucene.util.TestRuleMarkFailure$1.evaluate(TestRuleMarkFailure.java:48)
	at org.apache.lucene.util.TestRuleIgnoreAfterMaxFailures$1.evaluate(TestRuleIgnoreAfterMaxFailures.java:65)
	at org.apache.lucene.util.TestRuleIgnoreTestSuites$1.evaluate(TestRuleIgnoreTestSuites.java:55)
	at com.carrotsearch.randomizedtesting.rules.StatementAdapter.evaluate(StatementAdapter.java:36)
	at com.carrotsearch.randomizedtesting.ThreadLeakControl$StatementRunner.run(ThreadLeakControl.java:365)
	at java.lang.Thread.run(Thread.java:745)
Caused by: org.apache.solr.client.solrj.SolrServerException: IOException occured when talking to server at: http://127.0.0.1:23877/ks/c8n_1x2_shard1_replica2
	at org.apache.solr.client.solrj.impl.HttpSolrClient.executeMethod(HttpSolrClient.java:572)
	at org.apache.solr.client.solrj.impl.HttpSolrClient.request(HttpSolrClient.java:214)
	at org.apache.solr.client.solrj.impl.HttpSolrClient.request(HttpSolrClient.java:210)
	at org.apache.solr.client.solrj.impl.LBHttpSolrClient.doRequest(LBHttpSolrClient.java:353)
	at org.apache.solr.client.solrj.impl.LBHttpSolrClient.request(LBHttpSolrClient.java:312)
	at org.apache.solr.client.solrj.impl.CloudSolrClient.directUpdate(CloudSolrClient.java:578)
	... 47 more
Caused by: org.apache.http.NoHttpResponseException: The target server failed to respond
	at org.apache.http.impl.conn.DefaultHttpResponseParser.parseHead(DefaultHttpResponseParser.java:143)
	at org.apache.http.impl.conn.DefaultHttpResponseParser.parseHead(DefaultHttpResponseParser.java:57)
	at org.apache.http.impl.io.AbstractMessageParser.parse(AbstractMessageParser.java:260)
	at org.apache.http.impl.AbstractHttpClientConnection.receiveResponseHeader(AbstractHttpClientConnection.java:283)
	at org.apache.http.impl.conn.DefaultClientConnection.receiveResponseHeader(DefaultClientConnection.java:251)
	at org.apache.http.impl.conn.ManagedClientConnectionImpl.receiveResponseHeader(ManagedClientConnectionImpl.java:197)
	at org.apache.http.protocol.HttpRequestExecutor.doReceiveResponse(HttpRequestExecutor.java:271)
	at org.apache.http.protocol.HttpRequestExecutor.execute(HttpRequestExecutor.java:123)
	at org.apache.http.impl.client.DefaultRequestDirector.tryExecute(DefaultRequestDirector.java:682)
	at org.apache.http.impl.client.DefaultRequestDirector.execute(DefaultRequestDirector.java:486)
	at org.apache.http.impl.client.AbstractHttpClient.doExecute(AbstractHttpClient.java:863)
	at org.apache.http.impl.client.CloseableHttpClient.execute(CloseableHttpClient.java:82)
	at org.apache.http.impl.client.CloseableHttpClient.execute(CloseableHttpClient.java:106)
	at org.apache.http.impl.client.CloseableHttpClient.execute(CloseableHttpClient.java:57)
	at org.apache.solr.client.solrj.impl.HttpSolrClient.executeMethod(HttpSolrClient.java:464)
	... 52 more


FAILED:  org.apache.solr.cloud.LeaderFailoverAfterPartitionTest.testDistribSearch

Error Message:
org.apache.solr.client.solrj.SolrServerException: IOException occured when talking to server at: http://127.0.0.1:26679/mn_fof/v/c8n_1x3_lf_shard1_replica1

Stack Trace:
org.apache.solr.client.solrj.SolrServerException: org.apache.solr.client.solrj.SolrServerException: IOException occured when talking to server at: http://127.0.0.1:26679/mn_fof/v/c8n_1x3_lf_shard1_replica1
	at __randomizedtesting.SeedInfo.seed([DFE551FCA5F08D31:5E03DFE4D2AFED0D]:0)
	at org.apache.solr.client.solrj.impl.CloudSolrClient.directUpdate(CloudSolrClient.java:581)
	at org.apache.solr.client.solrj.impl.CloudSolrClient.sendRequest(CloudSolrClient.java:890)
	at org.apache.solr.client.solrj.impl.CloudSolrClient.requestWithRetryOnStaleState(CloudSolrClient.java:793)
	at org.apache.solr.client.solrj.impl.CloudSolrClient.request(CloudSolrClient.java:736)
	at org.apache.solr.cloud.HttpPartitionTest.sendDoc(HttpPartitionTest.java:480)
	at org.apache.solr.cloud.LeaderFailoverAfterPartitionTest.testRf3WithLeaderFailover(LeaderFailoverAfterPartitionTest.java:77)
	at org.apache.solr.cloud.LeaderFailoverAfterPartitionTest.doTest(LeaderFailoverAfterPartitionTest.java:50)
	at org.apache.solr.BaseDistributedSearchTestCase.testDistribSearch(BaseDistributedSearchTestCase.java:868)
	at sun.reflect.NativeMethodAccessorImpl.invoke0(Native Method)
	at sun.reflect.NativeMethodAccessorImpl.invoke(NativeMethodAccessorImpl.java:57)
	at sun.reflect.DelegatingMethodAccessorImpl.invoke(DelegatingMethodAccessorImpl.java:43)
	at java.lang.reflect.Method.invoke(Method.java:606)
	at com.carrotsearch.randomizedtesting.RandomizedRunner.invoke(RandomizedRunner.java:1618)
	at com.carrotsearch.randomizedtesting.RandomizedRunner$6.evaluate(RandomizedRunner.java:827)
	at com.carrotsearch.randomizedtesting.RandomizedRunner$7.evaluate(RandomizedRunner.java:863)
	at com.carrotsearch.randomizedtesting.RandomizedRunner$8.evaluate(RandomizedRunner.java:877)
	at com.carrotsearch.randomizedtesting.rules.SystemPropertiesRestoreRule$1.evaluate(SystemPropertiesRestoreRule.java:53)
	at org.apache.lucene.util.TestRuleSetupTeardownChained$1.evaluate(TestRuleSetupTeardownChained.java:50)
	at org.apache.lucene.util.AbstractBeforeAfterRule$1.evaluate(AbstractBeforeAfterRule.java:46)
	at com.carrotsearch.randomizedtesting.rules.SystemPropertiesInvariantRule$1.evaluate(SystemPropertiesInvariantRule.java:55)
	at org.apache.lucene.util.TestRuleThreadAndTestName$1.evaluate(TestRuleThreadAndTestName.java:49)
	at org.apache.lucene.util.TestRuleIgnoreAfterMaxFailures$1.evaluate(TestRuleIgnoreAfterMaxFailures.java:65)
	at org.apache.lucene.util.TestRuleMarkFailure$1.evaluate(TestRuleMarkFailure.java:48)
	at com.carrotsearch.randomizedtesting.rules.StatementAdapter.evaluate(StatementAdapter.java:36)
	at com.carrotsearch.randomizedtesting.ThreadLeakControl$StatementRunner.run(ThreadLeakControl.java:365)
	at com.carrotsearch.randomizedtesting.ThreadLeakControl.forkTimeoutingTask(ThreadLeakControl.java:798)
	at com.carrotsearch.randomizedtesting.ThreadLeakControl$3.evaluate(ThreadLeakControl.java:458)
	at com.carrotsearch.randomizedtesting.RandomizedRunner.runSingleTest(RandomizedRunner.java:836)
	at com.carrotsearch.randomizedtesting.RandomizedRunner$3.evaluate(RandomizedRunner.java:738)
	at com.carrotsearch.randomizedtesting.RandomizedRunner$4.evaluate(RandomizedRunner.java:772)
	at com.carrotsearch.randomizedtesting.RandomizedRunner$5.evaluate(RandomizedRunner.java:783)
	at com.carrotsearch.randomizedtesting.rules.StatementAdapter.evaluate(StatementAdapter.java:36)
	at com.carrotsearch.randomizedtesting.rules.SystemPropertiesRestoreRule$1.evaluate(SystemPropertiesRestoreRule.java:53)
	at org.apache.lucene.util.AbstractBeforeAfterRule$1.evaluate(AbstractBeforeAfterRule.java:46)
	at org.apache.lucene.util.TestRuleStoreClassName$1.evaluate(TestRuleStoreClassName.java:42)
	at com.carrotsearch.randomizedtesting.rules.SystemPropertiesInvariantRule$1.evaluate(SystemPropertiesInvariantRule.java:55)
	at com.carrotsearch.randomizedtesting.rules.NoShadowingOrOverridesOnMethodsRule$1.evaluate(NoShadowingOrOverridesOnMethodsRule.java:39)
	at com.carrotsearch.randomizedtesting.rules.NoShadowingOrOverridesOnMethodsRule$1.evaluate(NoShadowingOrOverridesOnMethodsRule.java:39)
	at com.carrotsearch.randomizedtesting.rules.StatementAdapter.evaluate(StatementAdapter.java:36)
	at com.carrotsearch.randomizedtesting.rules.StatementAdapter.evaluate(StatementAdapter.java:36)
	at com.carrotsearch.randomizedtesting.rules.StatementAdapter.evaluate(StatementAdapter.java:36)
	at org.apache.lucene.util.TestRuleAssertionsRequired$1.evaluate(TestRuleAssertionsRequired.java:54)
	at org.apache.lucene.util.TestRuleMarkFailure$1.evaluate(TestRuleMarkFailure.java:48)
	at org.apache.lucene.util.TestRuleIgnoreAfterMaxFailures$1.evaluate(TestRuleIgnoreAfterMaxFailures.java:65)
	at org.apache.lucene.util.TestRuleIgnoreTestSuites$1.evaluate(TestRuleIgnoreTestSuites.java:55)
	at com.carrotsearch.randomizedtesting.rules.StatementAdapter.evaluate(StatementAdapter.java:36)
	at com.carrotsearch.randomizedtesting.ThreadLeakControl$StatementRunner.run(ThreadLeakControl.java:365)
	at java.lang.Thread.run(Thread.java:745)
Caused by: org.apache.solr.client.solrj.SolrServerException: IOException occured when talking to server at: http://127.0.0.1:26679/mn_fof/v/c8n_1x3_lf_shard1_replica1
	at org.apache.solr.client.solrj.impl.HttpSolrClient.executeMethod(HttpSolrClient.java:572)
	at org.apache.solr.client.solrj.impl.HttpSolrClient.request(HttpSolrClient.java:214)
	at org.apache.solr.client.solrj.impl.HttpSolrClient.request(HttpSolrClient.java:210)
	at org.apache.solr.client.solrj.impl.LBHttpSolrClient.doRequest(LBHttpSolrClient.java:353)
	at org.apache.solr.client.solrj.impl.LBHttpSolrClient.request(LBHttpSolrClient.java:312)
	at org.apache.solr.client.solrj.impl.CloudSolrClient.directUpdate(CloudSolrClient.java:578)
	... 47 more
Caused by: org.apache.http.NoHttpResponseException: The target server failed to respond
	at org.apache.http.impl.conn.DefaultHttpResponseParser.parseHead(DefaultHttpResponseParser.java:143)
	at org.apache.http.impl.conn.DefaultHttpResponseParser.parseHead(DefaultHttpResponseParser.java:57)
	at org.apache.http.impl.io.AbstractMessageParser.parse(AbstractMessageParser.java:260)
	at org.apache.http.impl.AbstractHttpClientConnection.receiveResponseHeader(AbstractHttpClientConnection.java:283)
	at org.apache.http.impl.conn.DefaultClientConnection.receiveResponseHeader(DefaultClientConnection.java:251)
	at org.apache.http.impl.conn.ManagedClientConnectionImpl.receiveResponseHeader(ManagedClientConnectionImpl.java:197)
	at org.apache.http.protocol.HttpRequestExecutor.doReceiveResponse(HttpRequestExecutor.java:271)
	at org.apache.http.protocol.HttpRequestExecutor.execute(HttpRequestExecutor.java:123)
	at org.apache.http.impl.client.DefaultRequestDirector.tryExecute(DefaultRequestDirector.java:682)
	at org.apache.http.impl.client.DefaultRequestDirector.execute(DefaultRequestDirector.java:486)
	at org.apache.http.impl.client.AbstractHttpClient.doExecute(AbstractHttpClient.java:863)
	at org.apache.http.impl.client.CloseableHttpClient.execute(CloseableHttpClient.java:82)
	at org.apache.http.impl.client.CloseableHttpClient.execute(CloseableHttpClient.java:106)
	at org.apache.http.impl.client.CloseableHttpClient.execute(CloseableHttpClient.java:57)
	at org.apache.solr.client.solrj.impl.HttpSolrClient.executeMethod(HttpSolrClient.java:464)
	... 52 more


FAILED:  org.apache.solr.cloud.LeaderInitiatedRecoveryOnCommitTest.testDistribSearch

Error Message:
IOException occured when talking to server at: http://127.0.0.1:53679/fb/c8n_1x3_commits_shard1_replica3

Stack Trace:
org.apache.solr.client.solrj.SolrServerException: IOException occured when talking to server at: http://127.0.0.1:53679/fb/c8n_1x3_commits_shard1_replica3
	at __randomizedtesting.SeedInfo.seed([DFE551FCA5F08D31:5E03DFE4D2AFED0D]:0)
	at org.apache.solr.client.solrj.impl.HttpSolrClient.executeMethod(HttpSolrClient.java:572)
	at org.apache.solr.client.solrj.impl.HttpSolrClient.request(HttpSolrClient.java:214)
	at org.apache.solr.client.solrj.impl.HttpSolrClient.request(HttpSolrClient.java:210)
	at org.apache.solr.client.solrj.request.AbstractUpdateRequest.process(AbstractUpdateRequest.java:124)
	at org.apache.solr.client.solrj.SolrClient.commit(SolrClient.java:169)
	at org.apache.solr.client.solrj.SolrClient.commit(SolrClient.java:147)
	at org.apache.solr.cloud.LeaderInitiatedRecoveryOnCommitTest.oneShardTest(LeaderInitiatedRecoveryOnCommitTest.java:141)
	at org.apache.solr.cloud.LeaderInitiatedRecoveryOnCommitTest.doTest(LeaderInitiatedRecoveryOnCommitTest.java:70)
	at org.apache.solr.BaseDistributedSearchTestCase.testDistribSearch(BaseDistributedSearchTestCase.java:868)
	at sun.reflect.NativeMethodAccessorImpl.invoke0(Native Method)
	at sun.reflect.NativeMethodAccessorImpl.invoke(NativeMethodAccessorImpl.java:57)
	at sun.reflect.DelegatingMethodAccessorImpl.invoke(DelegatingMethodAccessorImpl.java:43)
	at java.lang.reflect.Method.invoke(Method.java:606)
	at com.carrotsearch.randomizedtesting.RandomizedRunner.invoke(RandomizedRunner.java:1618)
	at com.carrotsearch.randomizedtesting.RandomizedRunner$6.evaluate(RandomizedRunner.java:827)
	at com.carrotsearch.randomizedtesting.RandomizedRunner$7.evaluate(RandomizedRunner.java:863)
	at com.carrotsearch.randomizedtesting.RandomizedRunner$8.evaluate(RandomizedRunner.java:877)
	at com.carrotsearch.randomizedtesting.rules.SystemPropertiesRestoreRule$1.evaluate(SystemPropertiesRestoreRule.java:53)
	at org.apache.lucene.util.TestRuleSetupTeardownChained$1.evaluate(TestRuleSetupTeardownChained.java:50)
	at org.apache.lucene.util.AbstractBeforeAfterRule$1.evaluate(AbstractBeforeAfterRule.java:46)
	at com.carrotsearch.randomizedtesting.rules.SystemPropertiesInvariantRule$1.evaluate(SystemPropertiesInvariantRule.java:55)
	at org.apache.lucene.util.TestRuleThreadAndTestName$1.evaluate(TestRuleThreadAndTestName.java:49)
	at org.apache.lucene.util.TestRuleIgnoreAfterMaxFailures$1.evaluate(TestRuleIgnoreAfterMaxFailures.java:65)
	at org.apache.lucene.util.TestRuleMarkFailure$1.evaluate(TestRuleMarkFailure.java:48)
	at com.carrotsearch.randomizedtesting.rules.StatementAdapter.evaluate(StatementAdapter.java:36)
	at com.carrotsearch.randomizedtesting.ThreadLeakControl$StatementRunner.run(ThreadLeakControl.java:365)
	at com.carrotsearch.randomizedtesting.ThreadLeakControl.forkTimeoutingTask(ThreadLeakControl.java:798)
	at com.carrotsearch.randomizedtesting.ThreadLeakControl$3.evaluate(ThreadLeakControl.java:458)
	at com.carrotsearch.randomizedtesting.RandomizedRunner.runSingleTest(RandomizedRunner.java:836)
	at com.carrotsearch.randomizedtesting.RandomizedRunner$3.evaluate(RandomizedRunner.java:738)
	at com.carrotsearch.randomizedtesting.RandomizedRunner$4.evaluate(RandomizedRunner.java:772)
	at com.carrotsearch.randomizedtesting.RandomizedRunner$5.evaluate(RandomizedRunner.java:783)
	at com.carrotsearch.randomizedtesting.rules.StatementAdapter.evaluate(StatementAdapter.java:36)
	at com.carrotsearch.randomizedtesting.rules.SystemPropertiesRestoreRule$1.evaluate(SystemPropertiesRestoreRule.java:53)
	at org.apache.lucene.util.AbstractBeforeAfterRule$1.evaluate(AbstractBeforeAfterRule.java:46)
	at org.apache.lucene.util.TestRuleStoreClassName$1.evaluate(TestRuleStoreClassName.java:42)
	at com.carrotsearch.randomizedtesting.rules.SystemPropertiesInvariantRule$1.evaluate(SystemPropertiesInvariantRule.java:55)
	at com.carrotsearch.randomizedtesting.rules.NoShadowingOrOverridesOnMethodsRule$1.evaluate(NoShadowingOrOverridesOnMethodsRule.java:39)
	at com.carrotsearch.randomizedtesting.rules.NoShadowingOrOverridesOnMethodsRule$1.evaluate(NoShadowingOrOverridesOnMethodsRule.java:39)
	at com.carrotsearch.randomizedtesting.rules.StatementAdapter.evaluate(StatementAdapter.java:36)
	at com.carrotsearch.randomizedtesting.rules.StatementAdapter.evaluate(StatementAdapter.java:36)
	at com.carrotsearch.randomizedtesting.rules.StatementAdapter.evaluate(StatementAdapter.java:36)
	at org.apache.lucene.util.TestRuleAssertionsRequired$1.evaluate(TestRuleAssertionsRequired.java:54)
	at org.apache.lucene.util.TestRuleMarkFailure$1.evaluate(TestRuleMarkFailure.java:48)
	at org.apache.lucene.util.TestRuleIgnoreAfterMaxFailures$1.evaluate(TestRuleIgnoreAfterMaxFailures.java:65)
	at org.apache.lucene.util.TestRuleIgnoreTestSuites$1.evaluate(TestRuleIgnoreTestSuites.java:55)
	at com.carrotsearch.randomizedtesting.rules.StatementAdapter.evaluate(StatementAdapter.java:36)
	at com.carrotsearch.randomizedtesting.ThreadLeakControl$StatementRunner.run(ThreadLeakControl.java:365)
	at java.lang.Thread.run(Thread.java:745)
Caused by: org.apache.http.NoHttpResponseException: The target server failed to respond
	at org.apache.http.impl.conn.DefaultHttpResponseParser.parseHead(DefaultHttpResponseParser.java:143)
	at org.apache.http.impl.conn.DefaultHttpResponseParser.parseHead(DefaultHttpResponseParser.java:57)
	at org.apache.http.impl.io.AbstractMessageParser.parse(AbstractMessageParser.java:260)
	at org.apache.http.impl.AbstractHttpClientConnection.receiveResponseHeader(AbstractHttpClientConnection.java:283)
	at org.apache.http.impl.conn.DefaultClientConnection.receiveResponseHeader(DefaultClientConnection.java:251)
	at org.apache.http.impl.conn.ManagedClientConnectionImpl.receiveResponseHeader(ManagedClientConnectionImpl.java:197)
	at org.apache.http.protocol.HttpRequestExecutor.doReceiveResponse(HttpRequestExecutor.java:271)
	at org.apache.http.protocol.HttpRequestExecutor.execute(HttpRequestExecutor.java:123)
	at org.apache.http.impl.client.DefaultRequestDirector.tryExecute(DefaultRequestDirector.java:682)
	at org.apache.http.impl.client.DefaultRequestDirector.execute(DefaultRequestDirector.java:486)
	at org.apache.http.impl.client.AbstractHttpClient.doExecute(AbstractHttpClient.java:863)
	at org.apache.http.impl.client.CloseableHttpClient.execute(CloseableHttpClient.java:82)
	at org.apache.http.impl.client.CloseableHttpClient.execute(CloseableHttpClient.java:106)
	at org.apache.http.impl.client.CloseableHttpClient.execute(CloseableHttpClient.java:57)
	at org.apache.solr.client.solrj.impl.HttpSolrClient.executeMethod(HttpSolrClient.java:464)
	... 48 more


FAILED:  org.apache.solr.cloud.ReplicationFactorTest.testDistribSearch

Error Message:
org.apache.solr.client.solrj.SolrServerException: IOException occured when talking to server at: http://127.0.0.1:37008/d/qp/repfacttest_c8n_1x3_shard1_replica2

Stack Trace:
org.apache.solr.client.solrj.SolrServerException: org.apache.solr.client.solrj.SolrServerException: IOException occured when talking to server at: http://127.0.0.1:37008/d/qp/repfacttest_c8n_1x3_shard1_replica2
	at __randomizedtesting.SeedInfo.seed([DFE551FCA5F08D31:5E03DFE4D2AFED0D]:0)
	at org.apache.solr.client.solrj.impl.CloudSolrClient.directUpdate(CloudSolrClient.java:581)
	at org.apache.solr.client.solrj.impl.CloudSolrClient.sendRequest(CloudSolrClient.java:890)
	at org.apache.solr.client.solrj.impl.CloudSolrClient.requestWithRetryOnStaleState(CloudSolrClient.java:793)
	at org.apache.solr.client.solrj.impl.CloudSolrClient.request(CloudSolrClient.java:736)
	at org.apache.solr.cloud.ReplicationFactorTest.sendDoc(ReplicationFactorTest.java:312)
	at org.apache.solr.cloud.ReplicationFactorTest.testRf3(ReplicationFactorTest.java:226)
	at org.apache.solr.cloud.ReplicationFactorTest.doTest(ReplicationFactorTest.java:123)
	at org.apache.solr.BaseDistributedSearchTestCase.testDistribSearch(BaseDistributedSearchTestCase.java:868)
	at sun.reflect.NativeMethodAccessorImpl.invoke0(Native Method)
	at sun.reflect.NativeMethodAccessorImpl.invoke(NativeMethodAccessorImpl.java:57)
	at sun.reflect.DelegatingMethodAccessorImpl.invoke(DelegatingMethodAccessorImpl.java:43)
	at java.lang.reflect.Method.invoke(Method.java:606)
	at com.carrotsearch.randomizedtesting.RandomizedRunner.invoke(RandomizedRunner.java:1618)
	at com.carrotsearch.randomizedtesting.RandomizedRunner$6.evaluate(RandomizedRunner.java:827)
	at com.carrotsearch.randomizedtesting.RandomizedRunner$7.evaluate(RandomizedRunner.java:863)
	at com.carrotsearch.randomizedtesting.RandomizedRunner$8.evaluate(RandomizedRunner.java:877)
	at com.carrotsearch.randomizedtesting.rules.SystemPropertiesRestoreRule$1.evaluate(SystemPropertiesRestoreRule.java:53)
	at org.apache.lucene.util.TestRuleSetupTeardownChained$1.evaluate(TestRuleSetupTeardownChained.java:50)
	at org.apache.lucene.util.AbstractBeforeAfterRule$1.evaluate(AbstractBeforeAfterRule.java:46)
	at com.carrotsearch.randomizedtesting.rules.SystemPropertiesInvariantRule$1.evaluate(SystemPropertiesInvariantRule.java:55)
	at org.apache.lucene.util.TestRuleThreadAndTestName$1.evaluate(TestRuleThreadAndTestName.java:49)
	at org.apache.lucene.util.TestRuleIgnoreAfterMaxFailures$1.evaluate(TestRuleIgnoreAfterMaxFailures.java:65)
	at org.apache.lucene.util.TestRuleMarkFailure$1.evaluate(TestRuleMarkFailure.java:48)
	at com.carrotsearch.randomizedtesting.rules.StatementAdapter.evaluate(StatementAdapter.java:36)
	at com.carrotsearch.randomizedtesting.ThreadLeakControl$StatementRunner.run(ThreadLeakControl.java:365)
	at com.carrotsearch.randomizedtesting.ThreadLeakControl.forkTimeoutingTask(ThreadLeakControl.java:798)
	at com.carrotsearch.randomizedtesting.ThreadLeakControl$3.evaluate(ThreadLeakControl.java:458)
	at com.carrotsearch.randomizedtesting.RandomizedRunner.runSingleTest(RandomizedRunner.java:836)
	at com.carrotsearch.randomizedtesting.RandomizedRunner$3.evaluate(RandomizedRunner.java:738)
	at com.carrotsearch.randomizedtesting.RandomizedRunner$4.evaluate(RandomizedRunner.java:772)
	at com.carrotsearch.randomizedtesting.RandomizedRunner$5.evaluate(RandomizedRunner.java:783)
	at com.carrotsearch.randomizedtesting.rules.StatementAdapter.evaluate(StatementAdapter.java:36)
	at com.carrotsearch.randomizedtesting.rules.SystemPropertiesRestoreRule$1.evaluate(SystemPropertiesRestoreRule.java:53)
	at org.apache.lucene.util.AbstractBeforeAfterRule$1.evaluate(AbstractBeforeAfterRule.java:46)
	at org.apache.lucene.util.TestRuleStoreClassName$1.evaluate(TestRuleStoreClassName.java:42)
	at com.carrotsearch.randomizedtesting.rules.SystemPropertiesInvariantRule$1.evaluate(SystemPropertiesInvariantRule.java:55)
	at com.carrotsearch.randomizedtesting.rules.NoShadowingOrOverridesOnMethodsRule$1.evaluate(NoShadowingOrOverridesOnMethodsRule.java:39)
	at com.carrotsearch.randomizedtesting.rules.NoShadowingOrOverridesOnMethodsRule$1.evaluate(NoShadowingOrOverridesOnMethodsRule.java:39)
	at com.carrotsearch.randomizedtesting.rules.StatementAdapter.evaluate(StatementAdapter.java:36)
	at com.carrotsearch.randomizedtesting.rules.StatementAdapter.evaluate(StatementAdapter.java:36)
	at com.carrotsearch.randomizedtesting.rules.StatementAdapter.evaluate(StatementAdapter.java:36)
	at org.apache.lucene.util.TestRuleAssertionsRequired$1.evaluate(TestRuleAssertionsRequired.java:54)
	at org.apache.lucene.util.TestRuleMarkFailure$1.evaluate(TestRuleMarkFailure.java:48)
	at org.apache.lucene.util.TestRuleIgnoreAfterMaxFailures$1.evaluate(TestRuleIgnoreAfterMaxFailures.java:65)
	at org.apache.lucene.util.TestRuleIgnoreTestSuites$1.evaluate(TestRuleIgnoreTestSuites.java:55)
	at com.carrotsearch.randomizedtesting.rules.StatementAdapter.evaluate(StatementAdapter.java:36)
	at com.carrotsearch.randomizedtesting.ThreadLeakControl$StatementRunner.run(ThreadLeakControl.java:365)
	at java.lang.Thread.run(Thread.java:745)
Caused by: org.apache.solr.client.solrj.SolrServerException: IOException occured when talking to server at: http://127.0.0.1:37008/d/qp/repfacttest_c8n_1x3_shard1_replica2
	at org.apache.solr.client.solrj.impl.HttpSolrClient.executeMethod(HttpSolrClient.java:572)
	at org.apache.solr.client.solrj.impl.HttpSolrClient.request(HttpSolrClient.java:214)
	at org.apache.solr.client.solrj.impl.HttpSolrClient.request(HttpSolrClient.java:210)
	at org.apache.solr.client.solrj.impl.LBHttpSolrClient.doRequest(LBHttpSolrClient.java:353)
	at org.apache.solr.client.solrj.impl.LBHttpSolrClient.request(LBHttpSolrClient.java:312)
	at org.apache.solr.client.solrj.impl.CloudSolrClient.directUpdate(CloudSolrClient.java:578)
	... 47 more
Caused by: org.apache.http.NoHttpResponseException: The target server failed to respond
	at org.apache.http.impl.conn.DefaultHttpResponseParser.parseHead(DefaultHttpResponseParser.java:143)
	at org.apache.http.impl.conn.DefaultHttpResponseParser.parseHead(DefaultHttpResponseParser.java:57)
	at org.apache.http.impl.io.AbstractMessageParser.parse(AbstractMessageParser.java:260)
	at org.apache.http.impl.AbstractHttpClientConnection.receiveResponseHeader(AbstractHttpClientConnection.java:283)
	at org.apache.http.impl.conn.DefaultClientConnection.receiveResponseHeader(DefaultClientConnection.java:251)
	at org.apache.http.impl.conn.ManagedClientConnectionImpl.receiveResponseHeader(ManagedClientConnectionImpl.java:197)
	at org.apache.http.protocol.HttpRequestExecutor.doReceiveResponse(HttpRequestExecutor.java:271)
	at org.apache.http.protocol.HttpRequestExecutor.execute(HttpRequestExecutor.java:123)
	at org.apache.http.impl.client.DefaultRequestDirector.tryExecute(DefaultRequestDirector.java:682)
	at org.apache.http.impl.client.DefaultRequestDirector.execute(DefaultRequestDirector.java:486)
	at org.apache.http.impl.client.AbstractHttpClient.doExecute(AbstractHttpClient.java:863)
	at org.apache.http.impl.client.CloseableHttpClient.execute(CloseableHttpClient.java:82)
	at org.apache.http.impl.client.CloseableHttpClient.execute(CloseableHttpClient.java:106)
	at org.apache.http.impl.client.CloseableHttpClient.execute(CloseableHttpClient.java:57)
	at org.apache.solr.client.solrj.impl.HttpSolrClient.executeMethod(HttpSolrClient.java:464)
	... 52 more




Build Log:
[...truncated 8959 lines...]
   [junit4] Suite: org.apache.solr.cloud.LeaderInitiatedRecoveryOnCommitTest
   [junit4]   2> Creating dataDir: /usr/home/jenkins/jenkins-slave/workspace/Lucene-Solr-Tests-5.x-Java7/solr/build/solr-core/test/J3/temp/solr.cloud.LeaderInitiatedRecoveryOnCommitTest DFE551FCA5F08D31-001/init-core-data-001
   [junit4]   2> 107547 T303 oas.BaseDistributedSearchTestCase.initHostContext Setting hostContext system property: /fb/
   [junit4]   2> 107555 T303 oas.SolrTestCaseJ4.setUp ###Starting testDistribSearch
   [junit4]   2> 107556 T303 oasc.ZkTestServer.run STARTING ZK TEST SERVER
   [junit4]   1> client port:0.0.0.0/0.0.0.0:0
   [junit4]   2> 107557 T304 oasc.ZkTestServer$ZKServerMain.runFromConfig Starting server
   [junit4]   2> 107657 T303 oasc.ZkTestServer.run start zk server on port:53638
   [junit4]   2> 107662 T303 oascc.SolrZkClient.createZkCredentialsToAddAutomatically Using default ZkCredentialsProvider
   [junit4]   2> 107663 T303 oascc.ConnectionManager.waitForConnected Waiting for client to connect to ZooKeeper
   [junit4]   2> 107669 T311 oascc.ConnectionManager.process Watcher org.apache.solr.common.cloud.ConnectionManager@62849a4f name:ZooKeeperConnection Watcher:127.0.0.1:53638 got event WatchedEvent state:SyncConnected type:None path:null path:null type:None
   [junit4]   2> 107669 T303 oascc.ConnectionManager.waitForConnected Client is connected to ZooKeeper
   [junit4]   2> 107670 T303 oascc.SolrZkClient.createZkACLProvider Using default ZkACLProvider
   [junit4]   2> 107670 T303 oascc.SolrZkClient.makePath makePath: /solr
   [junit4]   2> 107674 T303 oascc.SolrZkClient.createZkCredentialsToAddAutomatically Using default ZkCredentialsProvider
   [junit4]   2> 107675 T303 oascc.ConnectionManager.waitForConnected Waiting for client to connect to ZooKeeper
   [junit4]   2> 107678 T314 oascc.ConnectionManager.process Watcher org.apache.solr.common.cloud.ConnectionManager@2c08b6f9 name:ZooKeeperConnection Watcher:127.0.0.1:53638/solr got event WatchedEvent state:SyncConnected type:None path:null path:null type:None
   [junit4]   2> 107678 T303 oascc.ConnectionManager.waitForConnected Client is connected to ZooKeeper
   [junit4]   2> 107679 T303 oascc.SolrZkClient.createZkACLProvider Using default ZkACLProvider
   [junit4]   2> 107680 T303 oascc.SolrZkClient.makePath makePath: /collections/collection1
   [junit4]   2> 107684 T303 oascc.SolrZkClient.makePath makePath: /collections/collection1/shards
   [junit4]   2> 107687 T303 oascc.SolrZkClient.makePath makePath: /collections/control_collection
   [junit4]   2> 107690 T303 oascc.SolrZkClient.makePath makePath: /collections/control_collection/shards
   [junit4]   2> 107694 T303 oasc.AbstractZkTestCase.putConfig put /usr/home/jenkins/jenkins-slave/workspace/Lucene-Solr-Tests-5.x-Java7/solr/core/src/test-files/solr/collection1/conf/solrconfig-tlog.xml to /configs/conf1/solrconfig.xml
   [junit4]   2> 107696 T303 oascc.SolrZkClient.makePath makePath: /configs/conf1/solrconfig.xml
   [junit4]   2> 107704 T303 oasc.AbstractZkTestCase.putConfig put /usr/home/jenkins/jenkins-slave/workspace/Lucene-Solr-Tests-5.x-Java7/solr/core/src/test-files/solr/collection1/conf/schema.xml to /configs/conf1/schema.xml
   [junit4]   2> 107706 T303 oascc.SolrZkClient.makePath makePath: /configs/conf1/schema.xml
   [junit4]   2> 107711 T303 oasc.AbstractZkTestCase.putConfig put /usr/home/jenkins/jenkins-slave/workspace/Lucene-Solr-Tests-5.x-Java7/solr/core/src/test-files/solr/collection1/conf/solrconfig.snippet.randomindexconfig.xml to /configs/conf1/solrconfig.snippet.randomindexconfig.xml
   [junit4]   2> 107712 T303 oascc.SolrZkClient.makePath makePath: /configs/conf1/solrconfig.snippet.randomindexconfig.xml
   [junit4]   2> 107717 T303 oasc.AbstractZkTestCase.putConfig put /usr/home/jenkins/jenkins-slave/workspace/Lucene-Solr-Tests-5.x-Java7/solr/core/src/test-files/solr/collection1/conf/stopwords.txt to /configs/conf1/stopwords.txt
   [junit4]   2> 107718 T303 oascc.SolrZkClient.makePath makePath: /configs/conf1/stopwords.txt
   [junit4]   2> 107723 T303 oasc.AbstractZkTestCase.putConfig put /usr/home/jenkins/jenkins-slave/workspace/Lucene-Solr-Tests-5.x-Java7/solr/core/src/test-files/solr/collection1/conf/protwords.txt to /configs/conf1/protwords.txt
   [junit4]   2> 107724 T303 oascc.SolrZkClient.makePath makePath: /configs/conf1/protwords.txt
   [junit4]   2> 107729 T303 oasc.AbstractZkTestCase.putConfig put /usr/home/jenkins/jenkins-slave/workspace/Lucene-Solr-Tests-5.x-Java7/solr/core/src/test-files/solr/collection1/conf/currency.xml to /configs/conf1/currency.xml
   [junit4]   2> 107730 T303 oascc.SolrZkClient.makePath makePath: /configs/conf1/currency.xml
   [junit4]   2> 107736 T303 oasc.AbstractZkTestCase.putConfig put /usr/home/jenkins/jenkins-slave/workspace/Lucene-Solr-Tests-5.x-Java7/solr/core/src/test-files/solr/collection1/conf/enumsConfig.xml to /configs/conf1/enumsConfig.xml
   [junit4]   2> 107737 T303 oascc.SolrZkClient.makePath makePath: /configs/conf1/enumsConfig.xml
   [junit4]   2> 107743 T303 oasc.AbstractZkTestCase.putConfig put /usr/home/jenkins/jenkins-slave/workspace/Lucene-Solr-Tests-5.x-Java7/solr/core/src/test-files/solr/collection1/conf/open-exchange-rates.json to /configs/conf1/open-exchange-rates.json
   [junit4]   2> 107744 T303 oascc.SolrZkClient.makePath makePath: /configs/conf1/open-exchange-rates.json
   [junit4]   2> 107748 T303 oasc.AbstractZkTestCase.putConfig put /usr/home/jenkins/jenkins-slave/workspace/Lucene-Solr-Tests-5.x-Java7/solr/core/src/test-files/solr/collection1/conf/mapping-ISOLatin1Accent.txt to /configs/conf1/mapping-ISOLatin1Accent.txt
   [junit4]   2> 107749 T303 oascc.SolrZkClient.makePath makePath: /configs/conf1/mapping-ISOLatin1Accent.txt
   [junit4]   2> 107753 T303 oasc.AbstractZkTestCase.putConfig put /usr/home/jenkins/jenkins-slave/workspace/Lucene-Solr-Tests-5.x-Java7/solr/core/src/test-files/solr/collection1/conf/old_synonyms.txt to /configs/conf1/old_synonyms.txt
   [junit4]   2> 107754 T303 oascc.SolrZkClient.makePath makePath: /configs/conf1/old_synonyms.txt
   [junit4]   2> 107757 T303 oasc.AbstractZkTestCase.putConfig put /usr/home/jenkins/jenkins-slave/workspace/Lucene-Solr-Tests-5.x-Java7/solr/core/src/test-files/solr/collection1/conf/synonyms.txt to /configs/conf1/synonyms.txt
   [junit4]   2> 107758 T303 oascc.SolrZkClient.makePath makePath: /configs/conf1/synonyms.txt
   [junit4]   2> 109776 T303 oejs.Server.doStart jetty-8.1.10.v20130312
   [junit4]   2> 110237 T303 oejs.AbstractConnector.doStart Started SocketConnector@127.0.0.1:53659
   [junit4]   2> 110441 T303 oass.SolrDispatchFilter.init SolrDispatchFilter.init()sun.misc.Launcher$AppClassLoader@60da5686
   [junit4]   2> 110442 T303 oasc.SolrResourceLoader.locateSolrHome JNDI not configured for solr (NoInitialContextEx)
   [junit4]   2> 110442 T303 oasc.SolrResourceLoader.locateSolrHome using system property solr.solr.home: /usr/home/jenkins/jenkins-slave/workspace/Lucene-Solr-Tests-5.x-Java7/solr/build/solr-core/test/J3/temp/solr.cloud.LeaderInitiatedRecoveryOnCommitTest DFE551FCA5F08D31-001/tempDir-002
   [junit4]   2> 110443 T303 oasc.SolrResourceLoader.<init> new SolrResourceLoader for directory: '/usr/home/jenkins/jenkins-slave/workspace/Lucene-Solr-Tests-5.x-Java7/solr/build/solr-core/test/J3/temp/solr.cloud.LeaderInitiatedRecoveryOnCommitTest DFE551FCA5F08D31-001/tempDir-002/'
   [junit4]   2> 110495 T303 oasc.ConfigSolr.fromFile Loading container configuration from /usr/home/jenkins/jenkins-slave/workspace/Lucene-Solr-Tests-5.x-Java7/solr/build/solr-core/test/J3/temp/solr.cloud.LeaderInitiatedRecoveryOnCommitTest DFE551FCA5F08D31-001/tempDir-002/solr.xml
   [junit4]   2> 110581 T303 oasc.CoreContainer.<init> New CoreContainer 531082910
   [junit4]   2> 110582 T303 oasc.CoreContainer.load Loading cores into CoreContainer [instanceDir=/usr/home/jenkins/jenkins-slave/workspace/Lucene-Solr-Tests-5.x-Java7/solr/build/solr-core/test/J3/temp/solr.cloud.LeaderInitiatedRecoveryOnCommitTest DFE551FCA5F08D31-001/tempDir-002/]
   [junit4]   2> 110584 T303 oashc.HttpShardHandlerFactory.getParameter Setting socketTimeout to: 90000
   [junit4]   2> 110584 T303 oashc.HttpShardHandlerFactory.getParameter Setting urlScheme to: 
   [junit4]   2> 110584 T303 oashc.HttpShardHandlerFactory.getParameter Setting connTimeout to: 15000
   [junit4]   2> 110585 T303 oashc.HttpShardHandlerFactory.getParameter Setting maxConnectionsPerHost to: 20
   [junit4]   2> 110585 T303 oashc.HttpShardHandlerFactory.getParameter Setting maxConnections to: 10000
   [junit4]   2> 110586 T303 oashc.HttpShardHandlerFactory.getParameter Setting corePoolSize to: 0
   [junit4]   2> 110586 T303 oashc.HttpShardHandlerFactory.getParameter Setting maximumPoolSize to: 2147483647
   [junit4]   2> 110587 T303 oashc.HttpShardHandlerFactory.getParameter Setting maxThreadIdleTime to: 5
   [junit4]   2> 110587 T303 oashc.HttpShardHandlerFactory.getParameter Setting sizeOfQueue to: -1
   [junit4]   2> 110587 T303 oashc.HttpShardHandlerFactory.getParameter Setting fairnessPolicy to: false
   [junit4]   2> 110588 T303 oasu.UpdateShardHandler.<init> Creating UpdateShardHandler HTTP client with params: socketTimeout=340000&connTimeout=45000&retry=false
   [junit4]   2> 110589 T303 oasl.LogWatcher.createWatcher SLF4J impl is org.slf4j.impl.Log4jLoggerFactory
   [junit4]   2> 110589 T303 oasl.LogWatcher.newRegisteredLogWatcher Registering Log Listener [Log4j (org.slf4j.impl.Log4jLoggerFactory)]
   [junit4]   2> 110590 T303 oasc.CoreContainer.load Host Name: 127.0.0.1
   [junit4]   2> 110590 T303 oasc.ZkContainer.initZooKeeper Zookeeper client=127.0.0.1:53638/solr
   [junit4]   2> 110590 T303 oasc.ZkController.checkChrootPath zkHost includes chroot
   [junit4]   2> 110591 T303 oascc.SolrZkClient.createZkCredentialsToAddAutomatically Using default ZkCredentialsProvider
   [junit4]   2> 110592 T303 oascc.ConnectionManager.waitForConnected Waiting for client to connect to ZooKeeper
   [junit4]   2> 110595 T327 oascc.ConnectionManager.process Watcher org.apache.solr.common.cloud.ConnectionManager@348926eb name:ZooKeeperConnection Watcher:127.0.0.1:53638 got event WatchedEvent state:SyncConnected type:None path:null path:null type:None
   [junit4]   2> 110596 T303 oascc.ConnectionManager.waitForConnected Client is connected to ZooKeeper
   [junit4]   2> 110597 T303 oascc.SolrZkClient.createZkACLProvider Using default ZkACLProvider
   [junit4]   2> 110608 T303 oascc.ConnectionManager.waitForConnected Waiting for client to connect to ZooKeeper
   [junit4]   2> 110610 T330 oascc.ConnectionManager.process Watcher org.apache.solr.common.cloud.ConnectionManager@2bb880ee name:ZooKeeperConnection Watcher:127.0.0.1:53638/solr got event WatchedEvent state:SyncConnected type:None path:null path:null type:None
   [junit4]   2> 110610 T303 oascc.ConnectionManager.waitForConnected Client is connected to ZooKeeper
   [junit4]   2> 110613 T303 oascc.SolrZkClient.makePath makePath: /overseer/queue
   [junit4]   2> 110616 T303 oascc.SolrZkClient.makePath makePath: /overseer/collection-queue-work
   [junit4]   2> 110620 T303 oascc.SolrZkClient.makePath makePath: /overseer/collection-map-running
   [junit4]   2> 110623 T303 oascc.SolrZkClient.makePath makePath: /overseer/collection-map-completed
   [junit4]   2> 110627 T303 oascc.SolrZkClient.makePath makePath: /overseer/collection-map-failure
   [junit4]   2> 110630 T303 oascc.SolrZkClient.makePath makePath: /live_nodes
   [junit4]   2> 110633 T303 oasc.ZkController.createEphemeralLiveNode Register node as live in ZooKeeper:/live_nodes/127.0.0.1:53658_fb
   [junit4]   2> 110634 T303 oascc.SolrZkClient.makePath makePath: /live_nodes/127.0.0.1:53658_fb
   [junit4]   2> 110637 T303 oascc.SolrZkClient.makePath makePath: /overseer_elect
   [junit4]   2> 110639 T303 oascc.SolrZkClient.makePath makePath: /overseer_elect/election
   [junit4]   2> 110642 T303 oasc.Overseer.close Overseer (id=null) closing
   [junit4]   2> 110644 T303 oasc.OverseerElectionContext.runLeaderProcess I am going to be the leader 127.0.0.1:53658_fb
   [junit4]   2> 110645 T303 oascc.SolrZkClient.makePath makePath: /overseer_elect/leader
   [junit4]   2> 110647 T303 oasc.Overseer.start Overseer (id=93130937850003459-127.0.0.1:53658_fb-n_0000000000) starting
   [junit4]   2> 110650 T303 oascc.SolrZkClient.makePath makePath: /overseer/queue-work
   [junit4]   2> 110661 T303 oasc.OverseerAutoReplicaFailoverThread.<init> Starting OverseerAutoReplicaFailoverThread autoReplicaFailoverWorkLoopDelay=10000 autoReplicaFailoverWaitAfterExpiration=30000 autoReplicaFailoverBadNodeExpiration=60000
   [junit4]   2> 110662 T332 oasc.OverseerCollectionProcessor.run Process current queue of collection creations
   [junit4]   2> 110662 T303 oascc.SolrZkClient.makePath makePath: /clusterstate.json
   [junit4]   2> 110665 T303 oascc.SolrZkClient.makePath makePath: /aliases.json
   [junit4]   2> 110667 T303 oascc.ZkStateReader.createClusterStateWatchersAndUpdate Updating cluster state from ZooKeeper... 
   [junit4]   2> 110672 T331 oasc.Overseer$ClusterStateUpdater.run Starting to work on the main queue
   [junit4]   2> 110677 T334 oasc.ZkController.publish publishing core=collection1 state=down collection=control_collection
   [junit4]   2> 110677 T334 oasc.ZkController.publish numShards not found on descriptor - reading it from system property
   [junit4]   2> 110679 T330 oasc.DistributedQueue$LatchWatcher.process NodeChildrenChanged fired on path /overseer/queue state SyncConnected
   [junit4]   2> 110679 T334 oasc.ZkController.waitForCoreNodeName look for our core node name
   [junit4]   2> 110683 T331 oasc.Overseer$ClusterStateUpdater.run processMessage: queueSize: 0, message = {
   [junit4]   2> 	  "shard":null,
   [junit4]   2> 	  "node_name":"127.0.0.1:53658_fb",
   [junit4]   2> 	  "core":"collection1",
   [junit4]   2> 	  "base_url":"http://127.0.0.1:53658/fb",
   [junit4]   2> 	  "collection":"control_collection",
   [junit4]   2> 	  "numShards":"1",
   [junit4]   2> 	  "roles":null,
   [junit4]   2> 	  "state":"down",
   [junit4]   2> 	  "operation":"state"} current state version: 0
   [junit4]   2> 110684 T331 oasco.ReplicaMutator.updateState Update state numShards=1 message={
   [junit4]   2> 	  "shard":null,
   [junit4]   2> 	  "node_name":"127.0.0.1:53658_fb",
   [junit4]   2> 	  "core":"collection1",
   [junit4]   2> 	  "base_url":"http://127.0.0.1:53658/fb",
   [junit4]   2> 	  "collection":"control_collection",
   [junit4]   2> 	  "numShards":"1",
   [junit4]   2> 	  "roles":null,
   [junit4]   2> 	  "state":"down",
   [junit4]   2> 	  "operation":"state"}
   [junit4]   2> 110684 T331 oasco.ClusterStateMutator.createCollection building a new cName: control_collection
   [junit4]   2> 110697 T331 oasco.ReplicaMutator.updateState Assigning new node to shard shard=shard1
   [junit4]   2> 110700 T330 oascc.ZkStateReader$2.process A cluster state change: WatchedEvent state:SyncConnected type:NodeDataChanged path:/clusterstate.json, has occurred - updating... (live nodes size: 1)
   [junit4]   2> 111679 T334 oasc.ZkController.waitForShardId waiting to find shard id in clusterstate for collection1
   [junit4]   2> 111680 T334 oasc.ZkController.createCollectionZkNode Check for collection zkNode:control_collection
   [junit4]   2> 111681 T334 oasc.ZkController.createCollectionZkNode Collection zkNode exists
   [junit4]   2> 111681 T334 oascc.ZkStateReader.readConfigName Load collection config from:/collections/control_collection
   [junit4]   2> 111683 T334 oascc.ZkStateReader.readConfigName path=/collections/control_collection configName=conf1 specified config exists in ZooKeeper
   [junit4]   2> 111683 T334 oasc.SolrResourceLoader.<init> new SolrResourceLoader for directory: '/usr/home/jenkins/jenkins-slave/workspace/Lucene-Solr-Tests-5.x-Java7/solr/build/solr-core/test/J3/temp/solr.cloud.LeaderInitiatedRecoveryOnCommitTest DFE551FCA5F08D31-001/tempDir-002/collection1/'
   [junit4]   2> 111685 T334 oasc.SolrResourceLoader.replaceClassLoader Adding 'file:/usr/home/jenkins/jenkins-slave/workspace/Lucene-Solr-Tests-5.x-Java7/solr/build/solr-core/test/J3/temp/solr.cloud.LeaderInitiatedRecoveryOnCommitTest%20DFE551FCA5F08D31-001/tempDir-002/collection1/lib/README' to classloader
   [junit4]   2> 111686 T334 oasc.SolrResourceLoader.replaceClassLoader Adding 'file:/usr/home/jenkins/jenkins-slave/workspace/Lucene-Solr-Tests-5.x-Java7/solr/build/solr-core/test/J3/temp/solr.cloud.LeaderInitiatedRecoveryOnCommitTest%20DFE551FCA5F08D31-001/tempDir-002/collection1/lib/classes/' to classloader
   [junit4]   2> 111687 T334 oasc.SolrResourceLoader.replaceClassLoader Adding 'file:/usr/home/jenkins/jenkins-slave/workspace/Lucene-Solr-Tests-5.x-Java7/solr/build/solr-core/test/J3/temp/solr.cloud.LeaderInitiatedRecoveryOnCommitTest%20DFE551FCA5F08D31-001/tempDir-002/collection1/lib/.svn/' to classloader
   [junit4]   2> 111726 T334 oasc.ZkController.watchZKConfDir watch zkdir /configs/conf1
   [junit4]   2> 111730 T334 oasc.Config.<init> loaded config solrconfig.xml with version 0 
   [junit4]   2> 111747 T334 oasc.SolrConfig.refreshRequestParams current version of requestparams : -1
   [junit4]   2> 111790 T334 oasc.SolrConfig.<init> Using Lucene MatchVersion: 5.0.0
   [junit4]   2> 111846 T334 oasc.SolrConfig.<init> Loaded SolrConfig: solrconfig.xml
   [junit4]   2> 111848 T334 oass.IndexSchema.readSchema Reading Solr Schema from /configs/conf1/schema.xml
   [junit4]   2> 111867 T334 oass.IndexSchema.readSchema [collection1] Schema name=test
   [junit4]   2> 112291 T334 oass.OpenExchangeRatesOrgProvider.init Initialized with rates=open-exchange-rates.json, refreshInterval=1440.
   [junit4]   2> 112307 T334 oass.IndexSchema.readSchema default search field in schema is text
   [junit4]   2> 112310 T334 oass.IndexSchema.readSchema unique key field: id
   [junit4]   2> 112331 T334 oass.FileExchangeRateProvider.reload Reloading exchange rates from file currency.xml
   [junit4]   2> 112337 T334 oass.FileExchangeRateProvider.reload Reloading exchange rates from file currency.xml
   [junit4]   2> 112342 T334 oass.OpenExchangeRatesOrgProvider.reload Reloading exchange rates from open-exchange-rates.json
   [junit4]   2> 112343 T334 oass.OpenExchangeRatesOrgProvider$OpenExchangeRates.<init> WARN Unknown key IMPORTANT NOTE
   [junit4]   2> 112343 T334 oass.OpenExchangeRatesOrgProvider$OpenExchangeRates.<init> WARN Expected key, got STRING
   [junit4]   2> 112344 T334 oass.OpenExchangeRatesOrgProvider.reload Reloading exchange rates from open-exchange-rates.json
   [junit4]   2> 112345 T334 oass.OpenExchangeRatesOrgProvider$OpenExchangeRates.<init> WARN Unknown key IMPORTANT NOTE
   [junit4]   2> 112345 T334 oass.OpenExchangeRatesOrgProvider$OpenExchangeRates.<init> WARN Expected key, got STRING
   [junit4]   2> 112346 T334 oasc.CoreContainer.create Creating SolrCore 'collection1' using configuration from collection control_collection
   [junit4]   2> 112346 T334 oasc.SolrCore.initDirectoryFactory org.apache.solr.core.MockDirectoryFactory
   [junit4]   2> 112346 T334 oasc.SolrCore.<init> [collection1] Opening new SolrCore at /usr/home/jenkins/jenkins-slave/workspace/Lucene-Solr-Tests-5.x-Java7/solr/build/solr-core/test/J3/temp/solr.cloud.LeaderInitiatedRecoveryOnCommitTest DFE551FCA5F08D31-001/tempDir-002/collection1/, dataDir=/usr/home/jenkins/jenkins-slave/workspace/Lucene-Solr-Tests-5.x-Java7/solr/build/solr-core/test/J3/temp/solr.cloud.LeaderInitiatedRecoveryOnCommitTest DFE551FCA5F08D31-001/tempDir-001/control/data/
   [junit4]   2> 112347 T334 oasc.JmxMonitoredMap.<init> JMX monitoring is enabled. Adding Solr mbeans to JMX Server: com.sun.jmx.mbeanserver.JmxMBeanServer@679bebf2
   [junit4]   2> 112348 T334 oasc.CachingDirectoryFactory.get return new directory for /usr/home/jenkins/jenkins-slave/workspace/Lucene-Solr-Tests-5.x-Java7/solr/build/solr-core/test/J3/temp/solr.cloud.LeaderInitiatedRecoveryOnCommitTest DFE551FCA5F08D31-001/tempDir-001/control/data
   [junit4]   2> 112349 T334 oasc.SolrCore.getNewIndexDir New index directory detected: old=null new=/usr/home/jenkins/jenkins-slave/workspace/Lucene-Solr-Tests-5.x-Java7/solr/build/solr-core/test/J3/temp/solr.cloud.LeaderInitiatedRecoveryOnCommitTest DFE551FCA5F08D31-001/tempDir-001/control/data/index/
   [junit4]   2> 112349 T334 oasc.SolrCore.initIndex WARN [collection1] Solr index directory '/usr/home/jenkins/jenkins-slave/workspace/Lucene-Solr-Tests-5.x-Java7/solr/build/solr-core/test/J3/temp/solr.cloud.LeaderInitiatedRecoveryOnCommitTest DFE551FCA5F08D31-001/tempDir-001/control/data/index' doesn't exist. Creating new index...
   [junit4]   2> 112350 T334 oasc.CachingDirectoryFactory.get return new directory for /usr/home/jenkins/jenkins-slave/workspace/Lucene-Solr-Tests-5.x-Java7/solr/build/solr-core/test/J3/temp/solr.cloud.LeaderInitiatedRecoveryOnCommitTest DFE551FCA5F08D31-001/tempDir-001/control/data/index
   [junit4]   2> 112350 T334 oasu.RandomMergePolicy.<init> RandomMergePolicy wrapping class org.apache.lucene.index.TieredMergePolicy: [TieredMergePolicy: maxMergeAtOnce=16, maxMergeAtOnceExplicit=46, maxMergedSegmentMB=81.966796875, floorSegmentMB=1.25390625, forceMergeDeletesPctAllowed=3.030721350073573, segmentsPerTier=11.0, maxCFSSegmentSizeMB=8.796093022207999E12, noCFSRatio=0.6171410654543157
   [junit4]   2> 112351 T334 oasc.SolrDeletionPolicy.onCommit SolrDeletionPolicy.onCommit: commits: num=1
   [junit4]   2> 		commit{dir=MockDirectoryWrapper(RAMDirectory@412cb806 lockFactory=org.apache.lucene.store.SingleInstanceLockFactory@5ee5b357),segFN=segments_1,generation=1}
   [junit4]   2> 112352 T334 oasc.SolrDeletionPolicy.updateCommits newest commit generation = 1
   [junit4]   2> 112357 T334 oasup.UpdateRequestProcessorChain.init creating updateRequestProcessorChain "nodistrib"
   [junit4]   2> 112357 T334 oasup.UpdateRequestProcessorChain.init creating updateRequestProcessorChain "dedupe"
   [junit4]   2> 112358 T334 oasup.UpdateRequestProcessorChain.init inserting DistributedUpdateProcessorFactory into updateRequestProcessorChain "dedupe"
   [junit4]   2> 112358 T334 oasup.UpdateRequestProcessorChain.init creating updateRequestProcessorChain "stored_sig"
   [junit4]   2> 112359 T334 oasup.UpdateRequestProcessorChain.init inserting DistributedUpdateProcessorFactory into updateRequestProcessorChain "stored_sig"
   [junit4]   2> 112359 T334 oasup.UpdateRequestProcessorChain.init creating updateRequestProcessorChain "distrib-dup-test-chain-explicit"
   [junit4]   2> 112360 T334 oasup.UpdateRequestProcessorChain.init creating updateRequestProcessorChain "distrib-dup-test-chain-implicit"
   [junit4]   2> 112360 T334 oasup.UpdateRequestProcessorChain.init inserting DistributedUpdateProcessorFactory into updateRequestProcessorChain "distrib-dup-test-chain-implicit"
   [junit4]   2> 112360 T334 oasc.SolrCore.loadUpdateProcessorChains no updateRequestProcessorChain defined as default, creating implicit default
   [junit4]   2> 112361 T334 oasc.RequestHandlers.initHandlersFromConfig created /update: org.apache.solr.handler.UpdateRequestHandler
   [junit4]   2> 112362 T334 oasc.RequestHandlers.initHandlersFromConfig created /update/json: org.apache.solr.handler.UpdateRequestHandler
   [junit4]   2> 112362 T334 oasc.RequestHandlers.initHandlersFromConfig created /update/csv: org.apache.solr.handler.UpdateRequestHandler
   [junit4]   2> 112363 T334 oasc.RequestHandlers.initHandlersFromConfig created /update/json/docs: org.apache.solr.handler.UpdateRequestHandler
   [junit4]   2> 112364 T334 oasc.RequestHandlers.initHandlersFromConfig created /config: org.apache.solr.handler.SolrConfigHandler
   [junit4]   2> 112364 T334 oasc.RequestHandlers.initHandlersFromConfig created /schema: org.apache.solr.handler.SchemaHandler
   [junit4]   2> 112365 T334 oasc.RequestHandlers.initHandlersFromConfig created /replication: org.apache.solr.handler.ReplicationHandler
   [junit4]   2> 112365 T334 oasc.RequestHandlers.initHandlersFromConfig created /get: org.apache.solr.handler.RealTimeGetHandler
   [junit4]   2> 112366 T334 oasc.RequestHandlers.initHandlersFromConfig created /admin/luke: org.apache.solr.handler.admin.LukeRequestHandler
   [junit4]   2> 112368 T334 oasc.RequestHandlers.initHandlersFromConfig created /admin/system: org.apache.solr.handler.admin.SystemInfoHandler
   [junit4]   2> 112368 T334 oasc.RequestHandlers.initHandlersFromConfig created /admin/mbeans: org.apache.solr.handler.admin.SolrInfoMBeanHandler
   [junit4]   2> 112369 T334 oasc.RequestHandlers.initHandlersFromConfig created /admin/plugins: org.apache.solr.handler.admin.PluginInfoHandler
   [junit4]   2> 112370 T334 oasc.RequestHandlers.initHandlersFromConfig created /admin/threads: org.apache.solr.handler.admin.ThreadDumpHandler
   [junit4]   2> 112370 T334 oasc.RequestHandlers.initHandlersFromConfig created /admin/properties: org.apache.solr.handler.admin.PropertiesRequestHandler
   [junit4]   2> 112371 T334 oasc.RequestHandlers.initHandlersFromConfig created /admin/logging: org.apache.solr.handler.admin.LoggingHandler
   [junit4]   2> 112372 T334 oasc.RequestHandlers.initHandlersFromConfig created /admin/ping: org.apache.solr.handler.PingRequestHandler
   [junit4]   2> 112372 T334 oasc.RequestHandlers.initHandlersFromConfig created standard: solr.StandardRequestHandler
   [junit4]   2> 112373 T334 oasc.RequestHandlers.initHandlersFromConfig created /admin/file: solr.admin.ShowFileRequestHandler
   [junit4]   2> 112393 T334 oashl.XMLLoader.init xsltCacheLifetimeSeconds=60
   [junit4]   2> 112395 T334 oashl.XMLLoader.init xsltCacheLifetimeSeconds=60
   [junit4]   2> 112397 T334 oashl.XMLLoader.init xsltCacheLifetimeSeconds=60
   [junit4]   2> 112400 T334 oashl.XMLLoader.init xsltCacheLifetimeSeconds=60
   [junit4]   2> 112402 T334 oasc.SolrCore.initStatsCache Using default statsCache cache: org.apache.solr.search.stats.LocalStatsCache
   [junit4]   2> 112406 T334 oasu.CommitTracker.<init> Hard AutoCommit: disabled
   [junit4]   2> 112406 T334 oasu.CommitTracker.<init> Soft AutoCommit: disabled
   [junit4]   2> 112407 T334 oasu.RandomMergePolicy.<init> RandomMergePolicy wrapping class org.apache.lucene.index.TieredMergePolicy: [TieredMergePolicy: maxMergeAtOnce=24, maxMergeAtOnceExplicit=32, maxMergedSegmentMB=4.560546875, floorSegmentMB=0.8701171875, forceMergeDeletesPctAllowed=1.878900277874589, segmentsPerTier=25.0, maxCFSSegmentSizeMB=8.796093022207999E12, noCFSRatio=0.0
   [junit4]   2> 112408 T334 oasc.SolrDeletionPolicy.onInit SolrDeletionPolicy.onInit: commits: num=1
   [junit4]   2> 		commit{dir=MockDirectoryWrapper(RAMDirectory@412cb806 lockFactory=org.apache.lucene.store.SingleInstanceLockFactory@5ee5b357),segFN=segments_1,generation=1}
   [junit4]   2> 112408 T334 oasc.SolrDeletionPolicy.updateCommits newest commit generation = 1
   [junit4]   2> 112408 T334 oass.SolrIndexSearcher.<init> Opening Searcher@5446315a[collection1] main
   [junit4]   2> 112409 T334 oascc.ZkStateReader.readConfigName Load collection config from:/collections/control_collection
   [junit4]   2> 112410 T334 oascc.ZkStateReader.readConfigName path=/collections/control_collection configName=conf1 specified config exists in ZooKeeper
   [junit4]   2> 112410 T334 oasr.ManagedResourceStorage.newStorageIO Setting up ZooKeeper-based storage for the RestManager with znodeBase: /configs/conf1
   [junit4]   2> 112411 T334 oasr.ManagedResourceStorage$ZooKeeperStorageIO.configure Configured ZooKeeperStorageIO with znodeBase: /configs/conf1
   [junit4]   2> 112411 T334 oasr.RestManager.init Initializing RestManager with initArgs: {}
   [junit4]   2> 112412 T334 oasr.ManagedResourceStorage.load Reading _rest_managed.json using ZooKeeperStorageIO:path=/configs/conf1
   [junit4]   2> 112413 T334 oasr.ManagedResourceStorage$ZooKeeperStorageIO.openInputStream No data found for znode /configs/conf1/_rest_managed.json
   [junit4]   2> 112413 T334 oasr.ManagedResourceStorage.load Loaded null at path _rest_managed.json using ZooKeeperStorageIO:path=/configs/conf1
   [junit4]   2> 112413 T334 oasr.RestManager.init Initializing 0 registered ManagedResources
   [junit4]   2> 112414 T334 oash.ReplicationHandler.inform Commits will be reserved for  10000
   [junit4]   2> 112414 T335 oasc.SolrCore.registerSearcher [collection1] Registered new searcher Searcher@5446315a[collection1] main{ExitableDirectoryReader(UninvertingDirectoryReader())}
   [junit4]   2> 112415 T334 oasc.CoreContainer.registerCore registering core: collection1
   [junit4]   2> 112416 T338 oasc.ZkController.register Register replica - core:collection1 address:http://127.0.0.1:53658/fb collection:control_collection shard:shard1
   [junit4]   2> 112417 T303 oass.SolrDispatchFilter.init user.dir=/usr/home/jenkins/jenkins-slave/workspace/Lucene-Solr-Tests-5.x-Java7/solr/build/solr-core/test/J3
   [junit4]   2> 112417 T303 oass.SolrDispatchFilter.init SolrDispatchFilter.init() done
   [junit4]   2> 112417 T338 oascc.SolrZkClient.makePath makePath: /collections/control_collection/leader_elect/shard1/election
   [junit4]   2> 112425 T338 oasc.ShardLeaderElectionContext.runLeaderProcess Running the leader process for shard shard1
   [junit4]   2> 112427 T330 oasc.DistributedQueue$LatchWatcher.process NodeChildrenChanged fired on path /overseer/queue state SyncConnected
   [junit4]   2> 112428 T338 oasc.ShardLeaderElectionContext.waitForReplicasToComeUp Enough replicas found to continue.
   [junit4]   2> 112428 T338 oasc.ShardLeaderElectionContext.runLeaderProcess I may be the new leader - try and sync
   [junit4]   2> ASYNC  NEW_CORE C58 name=collection1 org.apache.solr.core.SolrCore@71c24849 url=http://127.0.0.1:53658/fb/collection1 node=127.0.0.1:53658_fb C58_STATE=coll:control_collection core:collection1 props:{node_name=127.0.0.1:53658_fb, core=collection1, base_url=http://127.0.0.1:53658/fb, state=down}
   [junit4]   2> 112429 T338 C58 P53658 oasc.SyncStrategy.sync Sync replicas to http://127.0.0.1:53658/fb/collection1/
   [junit4]   2> 112429 T331 oasc.Overseer$ClusterStateUpdater.run processMessage: queueSize: 1, message = {
   [junit4]   2> 	  "operation":"leader",
   [junit4]   2> 	  "shard":"shard1",
   [junit4]   2> 	  "collection":"control_collection"} current state version: 1
   [junit4]   2> 112429 T338 C58 P53658 oasc.SyncStrategy.syncReplicas Sync Success - now sync replicas to me
   [junit4]   2> 112430 T338 C58 P53658 oasc.SyncStrategy.syncToMe http://127.0.0.1:53658/fb/collection1/ has no replicas
   [junit4]   2> 112430 T338 oasc.ShardLeaderElectionContext.runLeaderProcess I am the new leader: http://127.0.0.1:53658/fb/collection1/ shard1
   [junit4]   2> 112431 T330 oascc.ZkStateReader$2.process A cluster state change: WatchedEvent state:SyncConnected type:NodeDataChanged path:/clusterstate.json, has occurred - updating... (live nodes size: 1)
   [junit4]   2> 112447 T338 oascc.SolrZkClient.makePath makePath: /collections/control_collection/leaders/shard1
   [junit4]   2> 112454 T340 oasc.DistributedQueue$LatchWatcher.process NodeChildrenChanged fired on path /overseer/queue state SyncConnected
   [junit4]   2> 112456 T331 oasc.Overseer$ClusterStateUpdater.run processMessage: queueSize: 1, message = {
   [junit4]   2> 	  "operation":"leader",
   [junit4]   2> 	  "shard":"shard1",
   [junit4]   2> 	  "collection":"control_collection",
   [junit4]   2> 	  "base_url":"http://127.0.0.1:53658/fb",
   [junit4]   2> 	  "core":"collection1",
   [junit4]   2> 	  "state":"active"} current state version: 2
   [junit4]   2> 112541 T303 oascc.SolrZkClient.createZkCredentialsToAddAutomatically Using default ZkCredentialsProvider
   [junit4]   2> 112542 T303 oascc.ConnectionManager.waitForConnected Waiting for client to connect to ZooKeeper
   [junit4]   2> 112545 T343 oascc.ConnectionManager.process Watcher org.apache.solr.common.cloud.ConnectionManager@15fd3cb4 name:ZooKeeperConnection Watcher:127.0.0.1:53638/solr got event WatchedEvent state:SyncConnected type:None path:null path:null type:None
   [junit4]   2> 112545 T303 oascc.ConnectionManager.waitForConnected Client is connected to ZooKeeper
   [junit4]   2> 112546 T303 oascc.SolrZkClient.createZkACLProvider Using default ZkACLProvider
   [junit4]   2> 112548 T303 oascc.ZkStateReader.createClusterStateWatchersAndUpdate Updating cluster state from ZooKeeper... 
   [junit4]   2> 112555 T303 oasc.ChaosMonkey.monkeyLog monkey: init - expire sessions:false cause connection loss:false
   [junit4]   2> 112562 T343 oascc.ZkStateReader$2.process A cluster state change: WatchedEvent state:SyncConnected type:NodeDataChanged path:/clusterstate.json, has occurred - updating... (live nodes size: 1)
   [junit4]   2> 112608 T338 oasc.ZkController.register We are http://127.0.0.1:53658/fb/collection1/ and leader is http://127.0.0.1:53658/fb/collection1/
   [junit4]   2> 112609 T338 oasc.ZkController.register No LogReplay needed for core=collection1 baseURL=http://127.0.0.1:53658/fb
   [junit4]   2> 112609 T338 oasc.ZkController.checkRecovery I am the leader, no recovery necessary
   [junit4]   2> 112609 T338 oasc.ZkController.publish publishing core=collection1 state=active collection=control_collection
   [junit4]   2> 112610 T338 oasc.ZkController.publish numShards not found on descriptor - reading it from system property
   [junit4]   2> 112612 T330 oasc.DistributedQueue$LatchWatcher.process NodeChildrenChanged fired on path /overseer/queue state SyncConnected
   [junit4]   2> 112615 T331 oasc.Overseer$ClusterStateUpdater.run processMessage: queueSize: 1, message = {
   [junit4]   2> 	  "shard":"shard1",
   [junit4]   2> 	  "node_name":"127.0.0.1:53658_fb",
   [junit4]   2> 	  "core":"collection1",
   [junit4]   2> 	  "base_url":"http://127.0.0.1:53658/fb",
   [junit4]   2> 	  "core_node_name":"core_node1",
   [junit4]   2> 	  "collection":"control_collection",
   [junit4]   2> 	  "numShards":"1",
   [junit4]   2> 	  "roles":null,
   [junit4]   2> 	  "state":"active",
   [junit4]   2> 	  "operation":"state"} current state version: 3
   [junit4]   2> 112616 T331 oasco.ReplicaMutator.updateState Update state numShards=1 message={
   [junit4]   2> 	  "shard":"shard1",
   [junit4]   2> 	  "node_name":"127.0.0.1:53658_fb",
   [junit4]   2> 	  "core":"collection1",
   [junit4]   2> 	  "base_url":"http://127.0.0.1:53658/fb",
   [junit4]   2> 	  "core_node_name":"core_node1",
   [junit4]   2> 	  "collection":"control_collection",
   [junit4]   2> 	  "numShards":"1",
   [junit4]   2> 	  "roles":null,
   [junit4]   2> 	  "state":"active",
   [junit4]   2> 	  "operation":"state"}
   [junit4]   2> 112721 T330 oascc.ZkStateReader$2.process A cluster state change: WatchedEvent state:SyncConnected type:NodeDataChanged path:/clusterstate.json, has occurred - updating... (live nodes size: 1)
   [junit4]   2> 112721 T343 oascc.ZkStateReader$2.process A cluster state change: WatchedEvent state:SyncConnected type:NodeDataChanged path:/clusterstate.json, has occurred - updating... (live nodes size: 1)
   [junit4]   2> 113949 T303 oasc.AbstractFullDistribZkTestBase.createJettys create jetty 1
   [junit4]   2> 113951 T303 oejs.Server.doStart jetty-8.1.10.v20130312
   [junit4]   2> 113953 T303 oejs.AbstractConnector.doStart Started SocketConnector@127.0.0.1:53671
   [junit4]   2> 113954 T303 oass.SolrDispatchFilter.init SolrDispatchFilter.init()sun.misc.Launcher$AppClassLoader@60da5686
   [junit4]   2> 113954 T303 oasc.SolrResourceLoader.locateSolrHome JNDI not configured for solr (NoInitialContextEx)
   [junit4]   2> 113954 T303 oasc.SolrResourceLoader.locateSolrHome using system property solr.solr.home: /usr/home/jenkins/jenkins-slave/workspace/Lucene-Solr-Tests-5.x-Java7/solr/build/solr-core/test/J3/temp/solr.cloud.LeaderInitiatedRecoveryOnCommitTest DFE551FCA5F08D31-001/tempDir-003
   [junit4]   2> 113955 T303 oasc.SolrResourceLoader.<init> new SolrResourceLoader for directory: '/usr/home/jenkins/jenkins-slave/workspace/Lucene-Solr-Tests-5.x-Java7/solr/build/solr-core/test/J3/temp/solr.cloud.LeaderInitiatedRecoveryOnCommitTest DFE551FCA5F08D31-001/tempDir-003/'
   [junit4]   2> 113991 T303 oasc.ConfigSolr.fromFile Loading container configuration from /usr/home/jenkins/jenkins-slave/workspace/Lucene-Solr-Tests-5.x-Java7/solr/build/solr-core/test/J3/temp/solr.cloud.LeaderInitiatedRecoveryOnCommitTest DFE551FCA5F08D31-001/tempDir-003/solr.xml
   [junit4]   2> 114061 T303 oasc.CoreContainer.<init> New CoreContainer 1260237553
   [junit4]   2> 114062 T303 oasc.CoreContainer.load Loading cores into CoreContainer [instanceDir=/usr/home/jenkins/jenkins-slave/workspace/Lucene-Solr-Tests-5.x-Java7/solr/build/solr-core/test/J3/temp/solr.cloud.LeaderInitiatedRecoveryOnCommitTest DFE551FCA5F08D31-001/tempDir-003/]
   [junit4]   2> 114063 T303 oashc.HttpShardHandlerFactory.getParameter Setting socketTimeout to: 90000
   [junit4]   2> 114063 T303 oashc.HttpShardHandlerFactory.getParameter Setting urlScheme to: 
   [junit4]   2> 114063 T303 oashc.HttpShardHandlerFactory.getParameter Setting connTimeout to: 15000
   [junit4]   2> 114063 T303 oashc.HttpShardHandlerFactory.getParameter Setting maxConnectionsPerHost to: 20
   [junit4]   2> 114064 T303 oashc.HttpShardHandlerFactory.getParameter Setting maxConnections to: 10000
   [junit4]   2> 114064 T303 oashc.HttpShardHandlerFactory.getParameter Setting corePoolSize to: 0
   [junit4]   2> 114064 T303 oashc.HttpShardHandlerFactory.getParameter Setting maximumPoolSize to: 2147483647
   [junit4]   2> 114064 T303 oashc.HttpShardHandlerFactory.getParameter Setting maxThreadIdleTime to: 5
   [junit4]   2> 114065 T303 oashc.HttpShardHandlerFactory.getParameter Setting sizeOfQueue to: -1
   [junit4]   2> 114065 T303 oashc.HttpShardHandlerFactory.getParameter Setting fairnessPolicy to: false
   [junit4]   2> 114066 T303 oasu.UpdateShardHandler.<init> Creating UpdateShardHandler HTTP client with params: socketTimeout=340000&connTimeout=45000&retry=false
   [junit4]   2> 114066 T303 oasl.LogWatcher.createWatcher SLF4J impl is org.slf4j.impl.Log4jLoggerFactory
   [junit4]   2> 114066 T303 oasl.LogWatcher.newRegisteredLogWatcher Registering Log Listener [Log4j (org.slf4j.impl.Log4jLoggerFactory)]
   [junit4]   2> 114066 T303 oasc.CoreContainer.load Host Name: 127.0.0.1
   [junit4]   2> 114067 T303 oasc.ZkContainer.initZooKeeper Zookeeper client=127.0.0.1:53638/solr
   [junit4]   2> 114067 T303 oasc.ZkController.checkChrootPath zkHost includes chroot
   [junit4]   2> 114067 T303 oascc.SolrZkClient.createZkCredentialsToAddAutomatically Using default ZkCredentialsProvider
   [junit4]   2> 114068 T303 oascc.ConnectionManager.waitForConnected Waiting for client to connect to ZooKeeper
   [junit4]   2> 114070 T355 oascc.ConnectionManager.process Watcher org.apache.solr.common.cloud.ConnectionManager@5a65f83f name:ZooKeeperConnection Watcher:127.0.0.1:53638 got event WatchedEvent state:SyncConnected type:None path:null path:null type:None
   [junit4]   2> 114070 T303 oascc.ConnectionManager.waitForConnected Client is connected to ZooKeeper
   [junit4]   2> 114071 T303 oascc.SolrZkClient.createZkACLProvider Using default ZkACLProvider
   [junit4]   2> 114073 T303 oascc.ConnectionManager.waitForConnected Waiting for client to connect to ZooKeeper
   [junit4]   2> 114078 T358 oascc.ConnectionManager.process Watcher org.apache.solr.common.cloud.ConnectionManager@4cc3053 name:ZooKeeperConnection Watcher:127.0.0.1:53638/solr got event WatchedEvent state:SyncConnected type:None path:null path:null type:None
   [junit4]   2> 114079 T303 oascc.ConnectionManager.waitForConnected Client is connected to ZooKeeper
   [junit4]   2> 114084 T303 oascc.ZkStateReader.createClusterStateWatchersAndUpdate Updating cluster state from ZooKeeper... 
   [junit4]   2> 115088 T303 oasc.ZkController.createEphemeralLiveNode Register node as live in ZooKeeper:/live_nodes/127.0.0.1:53670_fb
   [junit4]   2> 115089 T303 oascc.SolrZkClient.makePath makePath: /live_nodes/127.0.0.1:53670_fb
   [junit4]   2> 115093 T303 oasc.Overseer.close Overseer (id=null) closing
   [junit4]   2> 115108 T359 oasc.ZkController.publish publishing core=collection1 state=down collection=collection1
   [junit4]   2> 115108 T359 oasc.ZkController.publish numShards not found on descriptor - reading it from system property
   [junit4]   2> 115109 T359 oasc.ZkController.waitForCoreNodeName look for our core node name
   [junit4]   2> 115109 T330 oasc.DistributedQueue$LatchWatcher.process NodeChildrenChanged fired on path /overseer/queue state SyncConnected
   [junit4]   2> 115111 T331 oasc.Overseer$ClusterStateUpdater.run processMessage: queueSize: 1, message = {
   [junit4]   2> 	  "shard":null,
   [junit4]   2> 	  "node_name":"127.0.0.1:53670_fb",
   [junit4]   2> 	  "core":"collection1",
   [junit4]   2> 	  "base_url":"http://127.0.0.1:53670/fb",
   [junit4]   2> 	  "collection":"collection1",
   [junit4]   2> 	  "numShards":"1",
   [junit4]   2> 	  "roles":null,
   [junit4]   2> 	  "state":"down",
   [junit4]   2> 	  "operation":"state"} current state version: 4
   [junit4]   2> 115111 T331 oasco.ReplicaMutator.updateState Update state numShards=1 message={
   [junit4]   2> 	  "shard":null,
   [junit4]   2> 	  "node_name":"127.0.0.1:53670_fb",
   [junit4]   2> 	  "core":"collection1",
   [junit4]   2> 	  "base_url":"http://127.0.0.1:53670/fb",
   [junit4]   2> 	  "collection":"collection1",
   [junit4]   2> 	  "numShards":"1",
   [junit4]   2> 	  "roles":null,
   [junit4]   2> 	  "state":"down",
   [junit4]   2> 	  "operation":"state"}
   [junit4]   2> 115112 T331 oasco.ClusterStateMutator.createCollection building a new cName: collection1
   [junit4]   2> 115112 T331 oasco.ReplicaMutator.updateState Assigning new node to shard shard=shard1
   [junit4]   2> 115114 T343 oascc.ZkStateReader$2.process A cluster state change: WatchedEvent state:SyncConnected type:NodeDataChanged path:/clusterstate.json, has occurred - updating... (live nodes size: 2)
   [junit4]   2> 115114 T330 oascc.ZkStateReader$2.process A cluster state change: WatchedEvent state:SyncConnected type:NodeDataChanged path:/clusterstate.json, has occurred - updating... (live nodes size: 2)
   [junit4]   2> 115114 T358 oascc.ZkStateReader$2.process A cluster state change: WatchedEvent state:SyncConnected type:NodeDataChanged path:/clusterstate.json, has occurred - updating... (live nodes size: 2)
   [junit4]   2> 116110 T359 oasc.ZkController.waitForShardId waiting to find shard id in clusterstate for collection1
   [junit4]   2> 116111 T359 oasc.ZkController.createCollectionZkNode Check for collection zkNode:collection1
   [junit4]   2> 116112 T359 oasc.ZkController.createCollectionZkNode Collection zkNode exists
   [junit4]   2> 116112 T359 oascc.ZkStateReader.readConfigName Load collection config from:/collections/collection1
   [junit4]   2> 116113 T359 oascc.ZkStateReader.readConfigName path=/collections/collection1 configName=conf1 specified config exists in ZooKeeper
   [junit4]   2> 116113 T359 oasc.SolrResourceLoader.<init> new SolrResourceLoader for directory: '/usr/home/jenkins/jenkins-slave/workspace/Lucene-Solr-Tests-5.x-Java7/solr/build/solr-core/test/J3/temp/solr.cloud.LeaderInitiatedRecoveryOnCommitTest DFE551FCA5F08D31-001/tempDir-003/collection1/'
   [junit4]   2> 116114 T359 oasc.SolrResourceLoader.replaceClassLoader Adding 'file:/usr/home/jenkins/jenkins-slave/workspace/Lucene-Solr-Tests-5.x-Java7/solr/build/solr-core/test/J3/temp/solr.cloud.LeaderInitiatedRecoveryOnCommitTest%20DFE551FCA5F08D31-001/tempDir-003/collection1/lib/.svn/' to classloader
   [junit4]   2> 116115 T359 oasc.SolrResourceLoader.replaceClassLoader Adding 'file:/usr/home/jenkins/jenkins-slave/workspace/Lucene-Solr-Tests-5.x-Java7/solr/build/solr-core/test/J3/temp/solr.cloud.LeaderInitiatedRecoveryOnCommitTest%20DFE551FCA5F08D31-001/tempDir-003/collection1/lib/classes/' to classloader
   [junit4]   2> 116115 T359 oasc.SolrResourceLoader.replaceClassLoader Adding 'file:/usr/home/jenkins/jenkins-slave/workspace/Lucene-Solr-Tests-5.x-Java7/solr/build/solr-core/test/J3/temp/solr.cloud.LeaderInitiatedRecoveryOnCommitTest%20DFE551FCA5F08D31-001/tempDir-003/collection1/lib/README' to classloader
   [junit4]   2> 116140 T359 oasc.ZkController.watchZKConfDir watch zkdir /configs/conf1
   [junit4]   2> 116143 T359 oasc.Config.<init> loaded config solrconfig.xml with version 0 
   [junit4]   2> 116153 T359 oasc.SolrConfig.refreshRequestParams current version of requestparams : -1
   [junit4]   2> 116170 T359 oasc.SolrConfig.<init> Using Lucene MatchVersion: 5.0.0
   [junit4]   2> 116207 T359 oasc.SolrConfig.<init> Loaded SolrConfig: solrconfig.xml
   [junit4]   2> 116209 T359 oass.IndexSchema.readSchema Reading Solr Schema from /configs/conf1/schema.xml
   [junit4]   2> 116218 T359 oass.IndexSchema.readSchema [collection1] Schema name=test
   [junit4]   2> 116824 T359 oass.OpenExchangeRatesOrgProvider.init Initialized with rates=open-exchange-rates.json, refreshInterval=1440.
   [junit4]   2> 116843 T359 oass.IndexSchema.readSchema default search field in schema is text
   [junit4]   2> 116847 T359 oass.IndexSchema.readSchema unique key field: id
   [junit4]   2> 116867 T359 oass.FileExchangeRateProvider.reload Reloading exchange rates from file currency.xml
   [junit4]   2> 116873 T359 oass.FileExchangeRateProvider.reload Reloading exchange rates from file currency.xml
   [junit4]   2> 116879 T359 oass.OpenExchangeRatesOrgProvider.reload Reloading exchange rates from open-exchange-rates.json
   [junit4]   2> 116880 T359 oass.OpenExchangeRatesOrgProvider$OpenExchangeRates.<init> WARN Unknown key IMPORTANT NOTE
   [junit4]   2> 116881 T359 oass.OpenExchangeRatesOrgProvider$OpenExchangeRates.<init> WARN Expected key, got STRING
   [junit4]   2> 116881 T359 oass.OpenExchangeRatesOrgProvider.reload Reloading exchange rates from open-exchange-rates.json
   [junit4]   2> 116882 T359 oass.OpenExchangeRatesOrgProvider$OpenExchangeRates.<init> WARN Unknown key IMPORTANT NOTE
   [junit4]   2> 116882 T359 oass.OpenExchangeRatesOrgProvider$OpenExchangeRates.<init> WARN Expected key, got STRING
   [junit4]   2> 116883 T359 oasc.CoreContainer.create Creating SolrCore 'collection1' using configuration from collection collection1
   [junit4]   2> 116883 T359 oasc.SolrCore.initDirectoryFactory org.apache.solr.core.MockDirectoryFactory
   [junit4]   2> 116884 T359 oasc.SolrCore.<init> [collection1] Opening new SolrCore at /usr/home/jenkins/jenkins-slave/workspace/Lucene-Solr-Tests-5.x-Java7/solr/build/solr-core/test/J3/temp/solr.cloud.LeaderInitiatedRecoveryOnCommitTest DFE551FCA5F08D31-001/tempDir-003/collection1/, dataDir=/usr/home/jenkins/jenkins-slave/workspace/Lucene-Solr-Tests-5.x-Java7/solr/build/solr-core/test/J3/temp/solr.cloud.LeaderInitiatedRecoveryOnCommitTest DFE551FCA5F08D31-001/tempDir-001/jetty1/
   [junit4]   2> 116884 T359 oasc.JmxMonitoredMap.<init> JMX monitoring is enabled. Adding Solr mbeans to JMX Server: com.sun.jmx.mbeanserver.JmxMBeanServer@679bebf2
   [junit4]   2> 116885 T359 oasc.CachingDirectoryFactory.get return new directory for /usr/home/jenkins/jenkins-slave/workspace/Lucene-Solr-Tests-5.x-Java7/solr/build/solr-core/test/J3/temp/solr.cloud.LeaderInitiatedRecoveryOnCommitTest DFE551FCA5F08D31-001/tempDir-001/jetty1
   [junit4]   2> 116885 T359 oasc.SolrCore.getNewIndexDir New index directory detected: old=null new=/usr/home/jenkins/jenkins-slave/workspace/Lucene-Solr-Tests-5.x-Java7/solr/build/solr-core/test/J3/temp/solr.cloud.LeaderInitiatedRecoveryOnCommitTest DFE551FCA5F08D31-001/tempDir-001/jetty1/index/
   [junit4]   2> 116886 T359 oasc.SolrCore.initIndex WARN [collection1] Solr index directory '/usr/home/jenkins/jenkins-slave/workspace/Lucene-Solr-Tests-5.x-Java7/solr/build/solr-core/test/J3/temp/solr.cloud.LeaderInitiatedRecoveryOnCommitTest DFE551FCA5F08D31-001/tempDir-001/jetty1/index' doesn't exist. Creating new index...
   [junit4]   2> 116886 T359 oasc.CachingDirectoryFactory.get return new directory for /usr/home/jenkins/jenkins-slave/workspace/Lucene-Solr-Tests-5.x-Java7/solr/build/solr-core/test/J3/temp/solr.cloud.LeaderInitiatedRecoveryOnCommitTest DFE551FCA5F08D31-001/tempDir-001/jetty1/index
   [junit4]   2> 116887 T359 oasu.RandomMergePolicy.<init> RandomMergePolicy wrapping class org.apache.lucene.index.TieredMergePolicy: [TieredMergePolicy: maxMergeAtOnce=16, maxMergeAtOnceExplicit=46, maxMergedSegmentMB=81.966796875, floorSegmentMB=1.25390625, forceMergeDeletesPctAllowed=3.030721350073573, segmentsPerTier=11.0, maxCFSSegmentSizeMB=8.796093022207999E12, noCFSRatio=0.6171410654543157
   [junit4]   2> 116888 T359 oasc.SolrDeletionPolicy.onCommit SolrDeletionPolicy.onCommit: commits: num=1
   [junit4]   2> 		commit{dir=MockDirectoryWrapper(RAMDirectory@7e93e411 lockFactory=org.apache.lucene.store.SingleInstanceLockFactory@1f625903),segFN=segments_1,generation=1}
   [junit4]   2> 116888 T359 oasc.SolrDeletionPolicy.updateCommits newest commit generation = 1
   [junit4]   2> 116896 T359 oasup.UpdateRequestProcessorChain.init creating updateRequestProcessorChain "nodistrib"
   [junit4]   2> 116896 T359 oasup.UpdateRequestProcessorChain.init creating updateRequestProcessorChain "dedupe"
   [junit4]   2> 116897 T359 oasup.UpdateRequestProcessorChain.init inserting DistributedUpdateProcessorFactory into updateRequestProcessorChain "dedupe"
   [junit4]   2> 116897 T359 oasup.UpdateRequestProcessorChain.init creating updateRequestProcessorChain "stored_sig"
   [junit4]   2> 116897 T359 oasup.UpdateRequestProcessorChain.init inserting DistributedUpdateProcessorFactory into updateRequestProcessorChain "stored_sig"
   [junit4]   2> 116898 T359 oasup.UpdateRequestProcessorChain.init creating updateRequestProcessorChain "distrib-dup-test-chain-explicit"
   [junit4]   2> 116898 T359 oasup.UpdateRequestProcessorChain.init creating updateRequestProcessorChain "distrib-dup-test-chain-implicit"
   [junit4]   2> 116899 T359 oasup.UpdateRequestProcessorChain.init inserting DistributedUpdateProcessorFactory into updateRequestProcessorChain "distrib-dup-test-chain-implicit"
   [junit4]   2> 116899 T359 oasc.SolrCore.loadUpdateProcessorChains no updateRequestProcessorChain defined as default, creating implicit default
   [junit4]   2> 116900 T359 oasc.RequestHandlers.initHandlersFromConfig created /update: org.apache.solr.handler.UpdateRequestHandler
   [junit4]   2> 116901 T359 oasc.RequestHandlers.initHandlersFromConfig created /update/json: org.apache.solr.handler.UpdateRequestHandler
   [junit4]   2> 116902 T359 oasc.RequestHandlers.initHandlersFromConfig created /update/csv: org.apache.solr.handler.UpdateRequestHandler
   [junit4]   2> 116902 T359 oasc.RequestHandlers.initHandlersFromConfig created /update/json/docs: org.apache.solr.handler.UpdateRequestHandler
   [junit4]   2> 116903 T359 oasc.RequestHandlers.initHandlersFromConfig created /config: org.apache.solr.handler.SolrConfigHandler
   [junit4]   2> 116904 T359 oasc.RequestHandlers.initHandlersFromConfig created /schema: org.apache.solr.handler.SchemaHandler
   [junit4]   2> 116912 T359 oasc.RequestHandlers.initHandlersFromConfig created /replication: org.apache.solr.handler.ReplicationHandler
   [junit4]   2> 116913 T359 oasc.RequestHandlers.initHandlersFromConfig created /get: org.apache.solr.handler.RealTimeGetHandler
   [junit4]   2> 116914 T359 oasc.RequestHandlers.initHandlersFromConfig created /admin/luke: org.apache.solr.handler.admin.LukeRequestHandler
   [junit4]   2> 116916 T359 oasc.RequestHandlers.initHandlersFromConfig created /admin/system: org.apache.solr.handler.admin.SystemInfoHandler
   [junit4]   2> 116918 T359 oasc.RequestHandlers.initHandlersFromConfig created /admin/mbeans: org.apache.solr.handler.admin.SolrInfoMBeanHandler
   [junit4]   2> 116919 T359 oasc.RequestHandlers.initHandlersFromConfig created /admin/plugins: org.apache.solr.handler.admin.PluginInfoHandler
   [junit4]   2> 116919 T359 oasc.RequestHandlers.initHandlersFromConfig created /admin/threads: org.apache.solr.handler.admin.ThreadDumpHandler
   [junit4]   2> 116920 T359 oasc.RequestHandlers.initHandlersFromConfig created /admin/properties: org.apache.solr.handler.admin.PropertiesRequestHandler
   [junit4]   2> 116921 T359 oasc.RequestHandlers.initHandlersFromConfig created /admin/logging: org.apache.solr.handler.admin.LoggingHandler
   [junit4]   2> 116922 T359 oasc.RequestHandlers.initHandlersFromConfig created /admin/ping: org.apache.solr.handler.PingRequestHandler
   [junit4]   2> 116922 T359 oasc.RequestHandlers.initHandlersFromConfig created standard: solr.StandardRequestHandler
   [junit4]   2> 116923 T359 oasc.RequestHandlers.initHandlersFromConfig created /admin/file: solr.admin.ShowFileRequestHandler
   [junit4]   2> 116944 T359 oashl.XMLLoader.init xsltCacheLifetimeSeconds=60
   [junit4]   2> 116947 T359 oashl.XMLLoader.init xsltCacheLifetimeSeconds=60
   [junit4]   2> 116949 T359 oashl.XMLLoader.init xsltCacheLifetimeSeconds=60
   [junit4]   2> 116951 T359 oashl.XMLLoader.init xsltCacheLifetimeSeconds=60
   [junit4]   2> 116954 T359 oasc.SolrCore.initStatsCache Using default statsCache cache: org.apache.solr.search.stats.LocalStatsCache
   [junit4]   2> 116963 T359 oasu.CommitTracker.<init> Hard AutoCommit: disabled
   [junit4]   2> 116963 T359 oasu.CommitTracker.<init> Soft AutoCommit: disabled
   [junit4]   2> 116965 T359 oasu.RandomMergePolicy.<init> RandomMergePolicy wrapping class org.apache.lucene.index.TieredMergePolicy: [TieredMergePolicy: maxMergeAtOnce=24, maxMergeAtOnceExplicit=32, maxMergedSegmentMB=4.560546875, floorSegmentMB=0.8701171875, forceMergeDeletesPctAllowed=1.878900277874589, segmentsPerTier=25.0, maxCFSSegmentSizeMB=8.796093022207999E12, noCFSRatio=0.0
   [junit4]   2> 116966 T359 oasc.SolrDeletionPolicy.onInit SolrDeletionPolicy.onInit: commits: num=1
   [junit4]   2> 		commit{dir=MockDirectoryWrapper(RAMDirectory@7e93e411 lockFactory=org.apache.lucene.store.SingleInstanceLockFactory@1f625903),segFN=segments_1,generation=1}
   [junit4]   2> 116966 T359 oasc.SolrDeletionPolicy.updateCommits newest commit generation = 1
   [junit4]   2> 116967 T359 oass.SolrIndexSearcher.<init> Opening Searcher@6beb722d[collection1] main
   [junit4]   2> 116968 T359 oascc.ZkStateReader.readConfigName Load collection config from:/collections/collection1
   [junit4]   2> 116969 T359 oascc.ZkStateReader.readConfigName path=/collections/collection1 configName=conf1 specified config exists in ZooKeeper
   [junit4]   2> 116970 T359 oasr.ManagedResourceStorage.newStorageIO Setting up ZooKeeper-based storage for the RestManager with znodeBase: /configs/conf1
   [junit4]   2> 116970 T359 oasr.ManagedResourceStorage$ZooKeeperStorageIO.configure Configured ZooKeeperStorageIO with znodeBase: /configs/conf1
   [junit4]   2> 116971 T359 oasr.RestManager.init Initializing RestManager with initArgs: {}
   [junit4]   2> 116971 T359 oasr.ManagedResourceStorage.load Reading _rest_managed.json using ZooKeeperStorageIO:path=/configs/conf1
   [junit4]   2> 116972 T359 oasr.ManagedResourceStorage$ZooKeeperStorageIO.openInputStream No data found for znode /configs/conf1/_rest_managed.json
   [junit4]   2> 116973 T359 oasr.ManagedResourceStorage.load Loaded null at path _rest_managed.json using ZooKeeperStorageIO:path=/configs/conf1
   [junit4]   2> 116973 T359 oasr.RestManager.init Initializing 0 registered ManagedResources
   [junit4]   2> 116973 T359 oash.ReplicationHandler.inform Commits will be reserved for  10000
   [junit4]   2> 116975 T360 oasc.SolrCore.registerSearcher [collection1] Registered new searcher Searcher@6beb722d[collection1] main{ExitableDirectoryReader(UninvertingDirectoryReader())}
   [junit4]   2> 116976 T359 oasc.CoreContainer.registerCore registering core: collection1
   [junit4]   2> 116977 T363 oasc.ZkController.register Register replica - core:collection1 address:http://127.0.0.1:53670/fb collection:collection1 shard:shard1
   [junit4]   2> 116977 T303 oass.SolrDispatchFilter.init user.dir=/usr/home/jenkins/jenkins-slave/workspace/Lucene-Solr-Tests-5.x-Java7/solr/build/solr-core/test/J3
   [junit4]   2> 116978 T363 oascc.SolrZkClient.makePath makePath: /collections/collection1/leader_elect/shard1/election
   [junit4]   2> 116978 T303 oass.SolrDispatchFilter.init SolrDispatchFilter.init() done
   [junit4]   2> 116986 T363 oasc.ShardLeaderElectionContext.runLeaderProcess Running the leader process for shard shard1
   [junit4]   2> 116989 T330 oasc.DistributedQueue$LatchWatcher.process NodeChildrenChanged fired on path /overseer/queue state SyncConnected
   [junit4]   2> 116989 T363 oasc.ShardLeaderElectionContext.waitForReplicasToComeUp Enough replicas found to continue.
   [junit4]   2> 116990 T363 oasc.ShardLeaderElectionContext.runLeaderProcess I may be the new leader - try and sync
   [junit4]   2> ASYNC  NEW_CORE C59 name=collection1 org.apache.solr.core.SolrCore@1f65ece url=http://127.0.0.1:53670/fb/collection1 node=127.0.0.1:53670_fb C59_STATE=coll:collection1 core:collection1 props:{node_name=127.0.0.1:53670_fb, core=collection1, base_url=http://127.0.0.1:53670/fb, state=down}
   [junit4]   2> 116990 T363 C59 P53670 oasc.SyncStrategy.sync Sync replicas to http://127.0.0.1:53670/fb/collection1/
   [junit4]   2> 116990 T363 C59 P53670 oasc.SyncStrategy.syncReplicas Sync Success - now sync replicas to me
   [junit4]   2> 116990 T331 oasc.Overseer$ClusterStateUpdater.run processMessage: queueSize: 1, message = {
   [junit4]   2> 	  "operation":"leader",
   [junit4]   2> 	  "shard":"shard1",
   [junit4]   2> 	  "collection":"collection1"} current state version: 5
   [junit4]   2> 116991 T363 C59 P53670 oasc.SyncStrategy.syncToMe http://127.0.0.1:53670/fb/collection1/ has no replicas
   [junit4]   2> 116991 T363 oasc.ShardLeaderElectionContext.runLeaderProcess I am the new leader: http://127.0.0.1:53670/fb/collection1/ shard1
   [junit4]   2> 116991 T363 oascc.SolrZkClient.makePath makePath: /collections/collection1/leaders/shard1
   [junit4]   2> 116993 T343 oascc.ZkStateReader$2.process A cluster state change: WatchedEvent state:SyncConnected type:NodeDataChanged path:/clusterstate.json, has occurred - updating... (live nodes size: 2)
   [junit4]   2> 116993 T358 oascc.ZkStateReader$2.process A cluster state change: WatchedEvent state:SyncConnected type:NodeDataChanged path:/clusterstate.json, has occurred - updating... (live nodes size: 2)
   [junit4]   2> 116993 T330 oascc.ZkStateReader$2.process A cluster state change: WatchedEvent state:SyncConnected type:NodeDataChanged path:/clusterstate.json, has occurred - updating... (live nodes size: 2)
   [junit4]   2> 116999 T340 oasc.DistributedQueue$LatchWatcher.process NodeChildrenChanged fired on path /overseer/queue state SyncConnected
   [junit4]   2> 117000 T331 oasc.Overseer$ClusterStateUpdater.run processMessage: queueSize: 1, message = {
   [junit4]   2> 	  "operation":"leader",
   [junit4]   2> 	  "shard":"shard1",
   [junit4]   2> 	  "collection":"collection1",
   [junit4]   2> 	  "base_url":"http://127.0.0.1:53670/fb",
   [junit4]   2> 	  "core":"collection1",
   [junit4]   2> 	  "state":"active"} current state version: 6
   [junit4]   2> 117105 T358 oascc.ZkStateReader$2.process A cluster state change: WatchedEvent state:SyncConnected type:NodeDataChanged path:/clusterstate.json, has occurred - updating... (live nodes size: 2)
   [junit4]   2> 117105 T343 oascc.ZkStateReader$2.process A cluster state change: WatchedEvent state:SyncConnected type:NodeDataChanged path:/clusterstate.json, has occurred - updating... (live nodes size: 2)
   [junit4]   2> 117152 T363 oasc.ZkController.register We are http://127.0.0.1:53670/fb/collection1/ and leader is http://127.0.0.1:53670/fb/collection1/
   [junit4]   2> 117153 T363 oasc.ZkController.register No LogReplay needed for core=collection1 baseURL=http://127.0.0.1:53670/fb
   [junit4]   2> 117153 T363 oasc.ZkController.checkRecovery I am the leader, no recovery necessary
   [junit4]   2> 117153 T363 oasc.ZkController.publish publishing core=collection1 state=active collection=collection1
   [junit4]   2> 117154 T363 oasc.ZkController.publish numShards not found on descriptor - reading it from system property
   [junit4]   2> 117156 T330 oasc.DistributedQueue$LatchWatcher.process NodeChildrenChanged fired on path /overseer/queue state SyncConnected
   [junit4]   2> 117157 T331 oasc.Overseer$ClusterStateUpdater.run processMessage: queueSize: 1, message = {
   [junit4]   2> 	  "shard":"shard1",
   [junit4]   2> 	  "node_name":"127.0.0.1:53670_fb",
   [junit4]   2> 	  "c

[...truncated too long message...]

necting to 127.0.0.1:58094 58094
   [junit4]   2> 1065661 T3253 oasc.ZkTestServer.send4LetterWord connecting to 127.0.0.1:58094 58094
   [junit4]   2> 1065662 T3253 oasc.ZkTestServer$ZKServerMain.runFromConfig WARN Watch limit violations: 
   [junit4]   2> 	Maximum concurrent create/delete watches above limit:
   [junit4]   2> 	
   [junit4]   2> 		5	/solr/clusterstate.json
   [junit4]   2> 		5	/solr/aliases.json
   [junit4]   2> 		4	/solr/configs/conf1
   [junit4]   2> 	
   [junit4]   2> 	Maximum concurrent children watches above limit:
   [junit4]   2> 	
   [junit4]   2> 		5	/solr/live_nodes
   [junit4]   2> 		4	/solr/overseer/queue
   [junit4]   2> 		4	/solr/overseer/collection-queue-work
   [junit4]   2> 	
   [junit4]   2> 1065663 T3252 oasc.SocketProxy.close WARN Closing 0 connections to: http://127.0.0.1:30648/mn_fof/v
   [junit4]   2> 1065663 T3252 oasc.SocketProxy.close WARN Closing 12 connections to: http://127.0.0.1:26679/mn_fof/v
   [junit4]   2> 1065663 T3252 oasc.SocketProxy.close WARN Closing 4 connections to: http://127.0.0.1:15010/mn_fof/v
   [junit4]   2> 1065664 T3252 oasc.SocketProxy.close WARN Closing 1 connections to: http://127.0.0.1:26766/mn_fof/v
   [junit4]   2> NOTE: reproduce with: ant test  -Dtestcase=LeaderFailoverAfterPartitionTest -Dtests.method=testDistribSearch -Dtests.seed=DFE551FCA5F08D31 -Dtests.multiplier=2 -Dtests.slow=true -Dtests.locale=pt_BR -Dtests.timezone=Europe/Mariehamn -Dtests.asserts=true -Dtests.file.encoding=UTF-8
   [junit4] ERROR   85.6s J2 | LeaderFailoverAfterPartitionTest.testDistribSearch <<<
   [junit4]    > Throwable #1: org.apache.solr.client.solrj.SolrServerException: org.apache.solr.client.solrj.SolrServerException: IOException occured when talking to server at: http://127.0.0.1:26679/mn_fof/v/c8n_1x3_lf_shard1_replica1
   [junit4]    > 	at __randomizedtesting.SeedInfo.seed([DFE551FCA5F08D31:5E03DFE4D2AFED0D]:0)
   [junit4]    > 	at org.apache.solr.client.solrj.impl.CloudSolrClient.directUpdate(CloudSolrClient.java:581)
   [junit4]    > 	at org.apache.solr.client.solrj.impl.CloudSolrClient.sendRequest(CloudSolrClient.java:890)
   [junit4]    > 	at org.apache.solr.client.solrj.impl.CloudSolrClient.requestWithRetryOnStaleState(CloudSolrClient.java:793)
   [junit4]    > 	at org.apache.solr.client.solrj.impl.CloudSolrClient.request(CloudSolrClient.java:736)
   [junit4]    > 	at org.apache.solr.cloud.HttpPartitionTest.sendDoc(HttpPartitionTest.java:480)
   [junit4]    > 	at org.apache.solr.cloud.LeaderFailoverAfterPartitionTest.testRf3WithLeaderFailover(LeaderFailoverAfterPartitionTest.java:77)
   [junit4]    > 	at org.apache.solr.cloud.LeaderFailoverAfterPartitionTest.doTest(LeaderFailoverAfterPartitionTest.java:50)
   [junit4]    > 	at org.apache.solr.BaseDistributedSearchTestCase.testDistribSearch(BaseDistributedSearchTestCase.java:868)
   [junit4]    > 	at java.lang.Thread.run(Thread.java:745)
   [junit4]    > Caused by: org.apache.solr.client.solrj.SolrServerException: IOException occured when talking to server at: http://127.0.0.1:26679/mn_fof/v/c8n_1x3_lf_shard1_replica1
   [junit4]    > 	at org.apache.solr.client.solrj.impl.HttpSolrClient.executeMethod(HttpSolrClient.java:572)
   [junit4]    > 	at org.apache.solr.client.solrj.impl.HttpSolrClient.request(HttpSolrClient.java:214)
   [junit4]    > 	at org.apache.solr.client.solrj.impl.HttpSolrClient.request(HttpSolrClient.java:210)
   [junit4]    > 	at org.apache.solr.client.solrj.impl.LBHttpSolrClient.doRequest(LBHttpSolrClient.java:353)
   [junit4]    > 	at org.apache.solr.client.solrj.impl.LBHttpSolrClient.request(LBHttpSolrClient.java:312)
   [junit4]    > 	at org.apache.solr.client.solrj.impl.CloudSolrClient.directUpdate(CloudSolrClient.java:578)
   [junit4]    > 	... 47 more
   [junit4]    > Caused by: org.apache.http.NoHttpResponseException: The target server failed to respond
   [junit4]    > 	at org.apache.http.impl.conn.DefaultHttpResponseParser.parseHead(DefaultHttpResponseParser.java:143)
   [junit4]    > 	at org.apache.http.impl.conn.DefaultHttpResponseParser.parseHead(DefaultHttpResponseParser.java:57)
   [junit4]    > 	at org.apache.http.impl.io.AbstractMessageParser.parse(AbstractMessageParser.java:260)
   [junit4]    > 	at org.apache.http.impl.AbstractHttpClientConnection.receiveResponseHeader(AbstractHttpClientConnection.java:283)
   [junit4]    > 	at org.apache.http.impl.conn.DefaultClientConnection.receiveResponseHeader(DefaultClientConnection.java:251)
   [junit4]    > 	at org.apache.http.impl.conn.ManagedClientConnectionImpl.receiveResponseHeader(ManagedClientConnectionImpl.java:197)
   [junit4]    > 	at org.apache.http.protocol.HttpRequestExecutor.doReceiveResponse(HttpRequestExecutor.java:271)
   [junit4]    > 	at org.apache.http.protocol.HttpRequestExecutor.execute(HttpRequestExecutor.java:123)
   [junit4]    > 	at org.apache.http.impl.client.DefaultRequestDirector.tryExecute(DefaultRequestDirector.java:682)
   [junit4]    > 	at org.apache.http.impl.client.DefaultRequestDirector.execute(DefaultRequestDirector.java:486)
   [junit4]    > 	at org.apache.http.impl.client.AbstractHttpClient.doExecute(AbstractHttpClient.java:863)
   [junit4]    > 	at org.apache.http.impl.client.CloseableHttpClient.execute(CloseableHttpClient.java:82)
   [junit4]    > 	at org.apache.http.impl.client.CloseableHttpClient.execute(CloseableHttpClient.java:106)
   [junit4]    > 	at org.apache.http.impl.client.CloseableHttpClient.execute(CloseableHttpClient.java:57)
   [junit4]    > 	at org.apache.solr.client.solrj.impl.HttpSolrClient.executeMethod(HttpSolrClient.java:464)
   [junit4]    > 	... 52 more
   [junit4]   2> 1065673 T3252 oas.SolrTestCaseJ4.deleteCore ###deleteCore
   [junit4]   2> NOTE: leaving temporary files on disk at: /usr/home/jenkins/jenkins-slave/workspace/Lucene-Solr-Tests-5.x-Java7/solr/build/solr-core/test/J2/temp/solr.cloud.LeaderFailoverAfterPartitionTest DFE551FCA5F08D31-001
   [junit4]   2> 85566 T3251 ccr.ThreadLeakControl.checkThreadLeaks WARNING Will linger awaiting termination of 1 leaked thread(s).
   [junit4]   2> NOTE: test params are: codec=Asserting(Lucene50): {intDefault=BlockTreeOrds(blocksize=128), range_facet_l=PostingsFormat(name=Memory doPackFST= false), id=Lucene50(blocksize=128), timestamp=PostingsFormat(name=Memory doPackFST= false), _version_=BlockTreeOrds(blocksize=128), text=PostingsFormat(name=MockRandom), a_t=PostingsFormat(name=Memory doPackFST= false), multiDefault=PostingsFormat(name=Memory doPackFST= false)}, docValues:{timestamp=DocValuesFormat(name=SimpleText)}, sim=DefaultSimilarity, locale=pt_BR, timezone=Europe/Mariehamn
   [junit4]   2> NOTE: FreeBSD 9.1-RELEASE-p3 amd64/Oracle Corporation 1.7.0_65 (64-bit)/cpus=16,threads=1,free=178496000,total=291504128
   [junit4]   2> NOTE: All tests run in this JVM: [HdfsBasicDistributedZkTest, DocExpirationUpdateProcessorFactoryTest, LegacyHTMLStripCharFilterTest, OverseerStatusTest, PreAnalyzedFieldTest, TestSuggestSpellingConverter, TestSolrConfigHandlerCloud, DistributedSuggestComponentTest, BufferStoreTest, TestDistribDocBasedVersion, HdfsUnloadDistributedZkTest, TestMiniSolrCloudCluster, TestCopyFieldCollectionResource, TestDynamicLoading, CachingDirectoryFactoryTest, SystemInfoHandlerTest, ExternalCollectionsTest, TestSolrQueryParser, AnalyticsMergeStrategyTest, SolrCoreCheckLockOnStartupTest, TestClassNameShortening, RequestHandlersTest, TestReplicationHandlerBackup, TestSolrXml, TestRandomMergePolicy, TestQueryTypes, TestBlendedInfixSuggestions, XmlUpdateRequestHandlerTest, UpdateRequestProcessorFactoryTest, AnalysisAfterCoreReloadTest, TestDocSet, TestSolr4Spatial2, TestStressUserVersions, TermsComponentTest, DateRangeFieldTest, TestConfigOverlay, SuggesterWFSTTest, CollectionsAPIDistributedZkTest, DirectUpdateHandlerOptimizeTest, TestMaxScoreQueryParser, TestManagedResource, CopyFieldTest, SortByFunctionTest, HighlighterMaxOffsetTest, TestReloadAndDeleteDocs, ExternalFileFieldSortTest, DistributedFacetPivotSmallAdvancedTest, IndexBasedSpellCheckerTest, DirectSolrConnectionTest, CoreAdminCreateDiscoverTest, TestFieldTypeResource, TestPhraseSuggestions, HdfsRecoveryZkTest, DistributedSpellCheckComponentTest, JsonLoaderTest, ReplicationFactorTest, BasicDistributedZk2Test, TestReplicationHandler, LeaderFailoverAfterPartitionTest]
   [junit4] Completed on J2 in 86.12s, 1 test, 1 error <<< FAILURES!

[...truncated 707 lines...]
BUILD FAILED
/usr/home/jenkins/jenkins-slave/workspace/Lucene-Solr-Tests-5.x-Java7/build.xml:529: The following error occurred while executing this line:
/usr/home/jenkins/jenkins-slave/workspace/Lucene-Solr-Tests-5.x-Java7/build.xml:477: The following error occurred while executing this line:
/usr/home/jenkins/jenkins-slave/workspace/Lucene-Solr-Tests-5.x-Java7/build.xml:61: The following error occurred while executing this line:
/usr/home/jenkins/jenkins-slave/workspace/Lucene-Solr-Tests-5.x-Java7/extra-targets.xml:39: The following error occurred while executing this line:
/usr/home/jenkins/jenkins-slave/workspace/Lucene-Solr-Tests-5.x-Java7/solr/build.xml:190: The following error occurred while executing this line:
/usr/home/jenkins/jenkins-slave/workspace/Lucene-Solr-Tests-5.x-Java7/solr/common-build.xml:508: The following error occurred while executing this line:
/usr/home/jenkins/jenkins-slave/workspace/Lucene-Solr-Tests-5.x-Java7/lucene/common-build.xml:1363: The following error occurred while executing this line:
/usr/home/jenkins/jenkins-slave/workspace/Lucene-Solr-Tests-5.x-Java7/lucene/common-build.xml:970: There were test failures: 460 suites, 1871 tests, 4 errors, 61 ignored (23 assumptions)

Total time: 43 minutes 4 seconds
Build step 'Invoke Ant' marked build as failure
Archiving artifacts
Sending artifact delta relative to Lucene-Solr-Tests-5.x-Java7 #2431
Archived 5 artifacts
Archive block size is 32768
Received 0 blocks and 194671186 bytes
Compression is 0.0%
Took 38 sec
Recording test results
Email was triggered for: Failure
Sending email for trigger: Failure



Mime
View raw message