lucene-dev mailing list archives

Site index · List index
Message view « Date » · « Thread »
Top « Date » · « Thread »
From Apache Jenkins Server <jenk...@builds.apache.org>
Subject [JENKINS] Lucene-Solr-NightlyTests-5.x - Build # 727 - Still Failing
Date Wed, 07 Jan 2015 18:39:47 GMT
Build: https://builds.apache.org/job/Lucene-Solr-NightlyTests-5.x/727/

2 tests failed.
REGRESSION:  org.apache.lucene.index.Test4GBStoredFields.test

Error Message:
Test abandoned because suite timeout was reached.

Stack Trace:
java.lang.Exception: Test abandoned because suite timeout was reached.
	at __randomizedtesting.SeedInfo.seed([A2D310980D63ED69]:0)


FAILED:  junit.framework.TestSuite.org.apache.lucene.index.Test4GBStoredFields

Error Message:
Suite timeout exceeded (>= 14400000 msec).

Stack Trace:
java.lang.Exception: Suite timeout exceeded (>= 14400000 msec).
	at __randomizedtesting.SeedInfo.seed([A2D310980D63ED69]:0)




Build Log:
[...truncated 1942 lines...]
   [junit4] Suite: org.apache.lucene.index.Test4GBStoredFields
   [junit4]   2> NOTE: download the large Jenkins line-docs file by running 'ant get-jenkins-line-docs'
in the lucene directory.
   [junit4]   2> NOTE: reproduce with: ant test  -Dtestcase=Test4GBStoredFields -Dtests.method=test
-Dtests.seed=A2D310980D63ED69 -Dtests.multiplier=2 -Dtests.nightly=true -Dtests.slow=true
-Dtests.linedocsfile=/home/jenkins/lucene-data/enwiki.random.lines.txt -Dtests.locale=en_ZA
-Dtests.timezone=Pacific/Guadalcanal -Dtests.asserts=true -Dtests.file.encoding=ISO-8859-1
   [junit4] ERROR   14400s J0 | Test4GBStoredFields.test <<<
   [junit4]    > Throwable #1: java.lang.Exception: Test abandoned because suite timeout
was reached.
   [junit4]    > 	at __randomizedtesting.SeedInfo.seed([A2D310980D63ED69]:0)
   [junit4]   2> NOTE: leaving temporary files on disk at: /usr/home/jenkins/jenkins-slave/workspace/Lucene-Solr-NightlyTests-5.x/lucene/build/core/test/J0/temp/lucene.index.Test4GBStoredFields
A2D310980D63ED69-001
   [junit4]   2> NOTE: test params are: codec=HighCompressionCompressingStoredFields(storedFieldsFormat=CompressingStoredFieldsFormat(compressionMode=HIGH_COMPRESSION,
chunkSize=1, maxDocsPerChunk=920, blockSize=9), termVectorsFormat=CompressingTermVectorsFormat(compressionMode=HIGH_COMPRESSION,
chunkSize=1, blockSize=9)), sim=RandomSimilarityProvider(queryNorm=true,coord=crazy): {},
locale=en_ZA, timezone=Pacific/Guadalcanal
   [junit4]   2> NOTE: FreeBSD 9.1-RELEASE-p3 amd64/Oracle Corporation 1.7.0_65 (64-bit)/cpus=16,threads=1,free=228253960,total=454033408
   [junit4]   2> NOTE: All tests run in this JVM: [TestDisjunctionMaxQuery, TestBytesStore,
TestLazyProxSkipping, TestLevenshteinAutomata, TestIndexInput, TestSimpleSearchEquivalence,
TestAssertingTermVectorsFormat, TestAutomatonQuery, TestCachingTokenFilter, TestNotDocIdSet,
TestMatchAllDocsQuery, TestLongPostings, TestNRTReaderWithThreads, TestComplexExplanationsOfNonMatches,
TestSparseFixedBitDocIdSet, TestVirtualMethod, TestPrefixFilter, TestGroupFiltering, TestSpanFirstQuery,
TestScorerPerf, TestIndexWriterExceptions, Nested, TestRollingBuffer, TestForTooMuchCloning,
TestNewestSegment, TestCachingCollector, TestLucene50DocValuesFormat, TestSpans, TestBooleanOr,
TestPayloads, TestConstantScoreQuery, ThrowInUncaught, TestMergeSchedulerExternal, TestCharsRef,
TestNorms, TestForUtil, TestTransactions, TestFixedBitDocIdSet, TestSumDocFreq, TestTermdocPerf,
TestControlledRealTimeReopenThread, TestSimpleFSDirectory, TestWildcardRandom, TestExitableDirectoryReader,
TestDemo, TestPositionIncrement, Test4GBStoredFields]
   [junit4]   2> NOTE: download the large Jenkins line-docs file by running 'ant get-jenkins-line-docs'
in the lucene directory.
   [junit4]   2> NOTE: reproduce with: ant test  -Dtestcase=Test4GBStoredFields -Dtests.seed=A2D310980D63ED69
-Dtests.multiplier=2 -Dtests.nightly=true -Dtests.slow=true -Dtests.linedocsfile=/home/jenkins/lucene-data/enwiki.random.lines.txt
-Dtests.locale=en_ZA -Dtests.timezone=Pacific/Guadalcanal -Dtests.asserts=true -Dtests.file.encoding=ISO-8859-1
   [junit4] ERROR   0.00s J0 | Test4GBStoredFields (suite) <<<
   [junit4]    > Throwable #1: java.lang.Exception: Suite timeout exceeded (>= 14400000
msec).
   [junit4]    > 	at __randomizedtesting.SeedInfo.seed([A2D310980D63ED69]:0)
   [junit4] Completed on J0 in 14420.30s, 1 test, 2 errors <<< FAILURES!

[...truncated 30 lines...]
BUILD FAILED
/usr/home/jenkins/jenkins-slave/workspace/Lucene-Solr-NightlyTests-5.x/build.xml:536: The
following error occurred while executing this line:
/usr/home/jenkins/jenkins-slave/workspace/Lucene-Solr-NightlyTests-5.x/build.xml:477: The
following error occurred while executing this line:
/usr/home/jenkins/jenkins-slave/workspace/Lucene-Solr-NightlyTests-5.x/build.xml:61: The following
error occurred while executing this line:
/usr/home/jenkins/jenkins-slave/workspace/Lucene-Solr-NightlyTests-5.x/extra-targets.xml:39:
The following error occurred while executing this line:
/usr/home/jenkins/jenkins-slave/workspace/Lucene-Solr-NightlyTests-5.x/lucene/build.xml:49:
The following error occurred while executing this line:
/usr/home/jenkins/jenkins-slave/workspace/Lucene-Solr-NightlyTests-5.x/lucene/common-build.xml:1363:
The following error occurred while executing this line:
/usr/home/jenkins/jenkins-slave/workspace/Lucene-Solr-NightlyTests-5.x/lucene/common-build.xml:970:
There were test failures: 409 suites, 3232 tests, 1 suite-level error, 1 error, 37 ignored
(27 assumptions)

Total time: 274 minutes 21 seconds
Build step 'Invoke Ant' marked build as failure
Archiving artifacts
Sending artifact delta relative to Lucene-Solr-NightlyTests-5.x #716
Archived 5 artifacts
Archive block size is 32768
Received 0 blocks and 3488820 bytes
Compression is 0.0%
Took 1.1 sec
Recording test results
Email was triggered for: Failure
Sending email for trigger: Failure



Mime
View raw message