lucene-dev mailing list archives

Site index · List index
Message view « Date » · « Thread »
Top « Date » · « Thread »
From Apache Jenkins Server <jenk...@builds.apache.org>
Subject [JENKINS-MAVEN] Lucene-Solr-Maven-5.x #791: POMs out of sync
Date Thu, 18 Dec 2014 16:40:35 GMT
Build: https://builds.apache.org/job/Lucene-Solr-Maven-5.x/791/

2 tests failed.
FAILED:  org.apache.solr.hadoop.MorphlineBasicMiniMRTest.testPathParts

Error Message:
Test abandoned because suite timeout was reached.

Stack Trace:
java.lang.Exception: Test abandoned because suite timeout was reached.
	at __randomizedtesting.SeedInfo.seed([965D5543C663DC82]:0)


FAILED:  org.apache.solr.hadoop.MorphlineBasicMiniMRTest.org.apache.solr.hadoop.MorphlineBasicMiniMRTest

Error Message:
Suite timeout exceeded (>= 7200000 msec).

Stack Trace:
java.lang.Exception: Suite timeout exceeded (>= 7200000 msec).
	at __randomizedtesting.SeedInfo.seed([965D5543C663DC82]:0)




Build Log:
[...truncated 53824 lines...]
BUILD FAILED
/usr/home/jenkins/jenkins-slave/workspace/Lucene-Solr-Maven-5.x/build.xml:552: The following
error occurred while executing this line:
/usr/home/jenkins/jenkins-slave/workspace/Lucene-Solr-Maven-5.x/build.xml:204: The following
error occurred while executing this line:
: Java returned: 1

Total time: 390 minutes 59 seconds
Build step 'Invoke Ant' marked build as failure
Recording test results
Email was triggered for: Failure
Sending email for trigger: Failure



Mime
View raw message