lucene-dev mailing list archives

Site index · List index
Message view « Date » · « Thread »
Top « Date » · « Thread »
From Apache Jenkins Server <jenk...@builds.apache.org>
Subject [JENKINS-MAVEN] Lucene-Solr-Maven-5.x #786: POMs out of sync
Date Sat, 13 Dec 2014 16:34:28 GMT
Build: https://builds.apache.org/job/Lucene-Solr-Maven-5.x/786/

4 tests failed.
FAILED:  org.apache.solr.hadoop.MapReduceIndexerToolArgumentParserTest.org.apache.solr.hadoop.MapReduceIndexerToolArgumentParserTest

Error Message:
null

Stack Trace:
java.lang.AssertionError: null
	at __randomizedtesting.SeedInfo.seed([CB01E23A4368E92B]:0)
	at org.apache.lucene.util.TestRuleTemporaryFilesCleanup.before(TestRuleTemporaryFilesCleanup.java:105)
	at com.carrotsearch.randomizedtesting.rules.TestRuleAdapter$1.before(TestRuleAdapter.java:26)
	at com.carrotsearch.randomizedtesting.rules.StatementAdapter.evaluate(StatementAdapter.java:35)
	at com.carrotsearch.randomizedtesting.rules.StatementAdapter.evaluate(StatementAdapter.java:36)
	at org.apache.lucene.util.TestRuleAssertionsRequired$1.evaluate(TestRuleAssertionsRequired.java:54)
	at org.apache.lucene.util.TestRuleMarkFailure$1.evaluate(TestRuleMarkFailure.java:48)
	at org.apache.lucene.util.TestRuleIgnoreAfterMaxFailures$1.evaluate(TestRuleIgnoreAfterMaxFailures.java:65)
	at org.apache.lucene.util.TestRuleIgnoreTestSuites$1.evaluate(TestRuleIgnoreTestSuites.java:55)
	at com.carrotsearch.randomizedtesting.rules.StatementAdapter.evaluate(StatementAdapter.java:36)
	at com.carrotsearch.randomizedtesting.ThreadLeakControl$StatementRunner.run(ThreadLeakControl.java:365)
	at java.lang.Thread.run(Thread.java:745)


REGRESSION:  org.apache.solr.hadoop.MorphlineGoLiveMiniMRTest.testDistribSearch

Error Message:
org.apache.solr.client.solrj.SolrServerException: IOException occured when talking to server
at: https://127.0.0.1:12203/collection1

Stack Trace:
org.apache.solr.client.solrj.impl.HttpSolrServer$RemoteSolrException: org.apache.solr.client.solrj.SolrServerException:
IOException occured when talking to server at: https://127.0.0.1:12203/collection1
	at __randomizedtesting.SeedInfo.seed([8364E20280D836F5:2826C1AF78756C9]:0)
	at org.apache.solr.client.solrj.impl.HttpSolrServer.executeMethod(HttpSolrServer.java:569)
	at org.apache.solr.client.solrj.impl.HttpSolrServer.request(HttpSolrServer.java:215)
	at org.apache.solr.client.solrj.impl.HttpSolrServer.request(HttpSolrServer.java:211)
	at org.apache.solr.client.solrj.request.QueryRequest.process(QueryRequest.java:91)
	at org.apache.solr.client.solrj.SolrServer.query(SolrServer.java:301)
	at org.apache.solr.hadoop.MorphlineGoLiveMiniMRTest.doTest(MorphlineGoLiveMiniMRTest.java:410)


FAILED:  org.apache.solr.hadoop.MorphlineBasicMiniMRTest.testPathParts

Error Message:
Test abandoned because suite timeout was reached.

Stack Trace:
java.lang.Exception: Test abandoned because suite timeout was reached.
	at __randomizedtesting.SeedInfo.seed([6D0F1AA9C71759FE]:0)


FAILED:  org.apache.solr.hadoop.MorphlineBasicMiniMRTest.org.apache.solr.hadoop.MorphlineBasicMiniMRTest

Error Message:
Suite timeout exceeded (>= 7200000 msec).

Stack Trace:
java.lang.Exception: Suite timeout exceeded (>= 7200000 msec).
	at __randomizedtesting.SeedInfo.seed([6D0F1AA9C71759FE]:0)




Build Log:
[...truncated 53779 lines...]
BUILD FAILED
/usr/home/jenkins/jenkins-slave/workspace/Lucene-Solr-Maven-5.x/build.xml:552: The following
error occurred while executing this line:
/usr/home/jenkins/jenkins-slave/workspace/Lucene-Solr-Maven-5.x/build.xml:204: The following
error occurred while executing this line:
: Java returned: 1

Total time: 383 minutes 47 seconds
Build step 'Invoke Ant' marked build as failure
Recording test results
Email was triggered for: Failure
Sending email for trigger: Failure



Mime
View raw message