lucene-dev mailing list archives

Site index · List index
Message view « Date » · « Thread »
Top « Date » · « Thread »
From Policeman Jenkins Server <jenk...@thetaphi.de>
Subject [JENKINS] Lucene-Solr-4.10-Linux (64bit/jdk1.8.0_20) - Build # 110 - Failure!
Date Sat, 22 Nov 2014 07:04:27 GMT
Build: http://jenkins.thetaphi.de/job/Lucene-Solr-4.10-Linux/110/
Java: 64bit/jdk1.8.0_20 -XX:+UseCompressedOops -XX:+UseConcMarkSweepGC (asserts: true)

1 tests failed.
REGRESSION:  org.apache.lucene.index.TestIndexWriter.testCorruptFirstCommit

Error Message:
segments in dir=RAMDirectory@fda35a8 lockFactory=org.apache.lucene.store.SingleInstanceLockFactory@177705a0

Stack Trace:
java.nio.file.NoSuchFileException: segments in dir=RAMDirectory@fda35a8 lockFactory=org.apache.lucene.store.SingleInstanceLockFactory@177705a0
	at __randomizedtesting.SeedInfo.seed([E70D8668746F2F4D:CDE6A3F23A096215]:0)
	at org.apache.lucene.store.MockDirectoryWrapper.openInput(MockDirectoryWrapper.java:603)
	at org.apache.lucene.store.Directory.openChecksumInput(Directory.java:113)
	at org.apache.lucene.index.SegmentInfos.read(SegmentInfos.java:341)
	at org.apache.lucene.index.SegmentInfos$1.doBody(SegmentInfos.java:454)
	at org.apache.lucene.index.SegmentInfos$FindSegmentsFile.run(SegmentInfos.java:906)
	at org.apache.lucene.index.SegmentInfos$FindSegmentsFile.run(SegmentInfos.java:752)
	at org.apache.lucene.index.SegmentInfos.read(SegmentInfos.java:457)
	at org.apache.lucene.index.CheckIndex.checkIndex(CheckIndex.java:414)
	at org.apache.lucene.util.TestUtil.checkIndex(TestUtil.java:207)
	at org.apache.lucene.store.MockDirectoryWrapper.close(MockDirectoryWrapper.java:724)
	at org.apache.lucene.index.TestIndexWriter.testCorruptFirstCommit(TestIndexWriter.java:2520)
	at sun.reflect.NativeMethodAccessorImpl.invoke0(Native Method)
	at sun.reflect.NativeMethodAccessorImpl.invoke(NativeMethodAccessorImpl.java:62)
	at sun.reflect.DelegatingMethodAccessorImpl.invoke(DelegatingMethodAccessorImpl.java:43)
	at java.lang.reflect.Method.invoke(Method.java:483)
	at com.carrotsearch.randomizedtesting.RandomizedRunner.invoke(RandomizedRunner.java:1618)
	at com.carrotsearch.randomizedtesting.RandomizedRunner$6.evaluate(RandomizedRunner.java:827)
	at com.carrotsearch.randomizedtesting.RandomizedRunner$7.evaluate(RandomizedRunner.java:863)
	at com.carrotsearch.randomizedtesting.RandomizedRunner$8.evaluate(RandomizedRunner.java:877)
	at org.apache.lucene.util.TestRuleSetupTeardownChained$1.evaluate(TestRuleSetupTeardownChained.java:50)
	at org.apache.lucene.util.TestRuleFieldCacheSanity$1.evaluate(TestRuleFieldCacheSanity.java:51)
	at org.apache.lucene.util.AbstractBeforeAfterRule$1.evaluate(AbstractBeforeAfterRule.java:46)
	at com.carrotsearch.randomizedtesting.rules.SystemPropertiesInvariantRule$1.evaluate(SystemPropertiesInvariantRule.java:55)
	at org.apache.lucene.util.TestRuleThreadAndTestName$1.evaluate(TestRuleThreadAndTestName.java:49)
	at org.apache.lucene.util.TestRuleIgnoreAfterMaxFailures$1.evaluate(TestRuleIgnoreAfterMaxFailures.java:65)
	at org.apache.lucene.util.TestRuleMarkFailure$1.evaluate(TestRuleMarkFailure.java:48)
	at com.carrotsearch.randomizedtesting.rules.StatementAdapter.evaluate(StatementAdapter.java:36)
	at com.carrotsearch.randomizedtesting.ThreadLeakControl$StatementRunner.run(ThreadLeakControl.java:365)
	at com.carrotsearch.randomizedtesting.ThreadLeakControl.forkTimeoutingTask(ThreadLeakControl.java:798)
	at com.carrotsearch.randomizedtesting.ThreadLeakControl$3.evaluate(ThreadLeakControl.java:458)
	at com.carrotsearch.randomizedtesting.RandomizedRunner.runSingleTest(RandomizedRunner.java:836)
	at com.carrotsearch.randomizedtesting.RandomizedRunner$3.evaluate(RandomizedRunner.java:738)
	at com.carrotsearch.randomizedtesting.RandomizedRunner$4.evaluate(RandomizedRunner.java:772)
	at com.carrotsearch.randomizedtesting.RandomizedRunner$5.evaluate(RandomizedRunner.java:783)
	at org.apache.lucene.util.AbstractBeforeAfterRule$1.evaluate(AbstractBeforeAfterRule.java:46)
	at org.apache.lucene.util.TestRuleStoreClassName$1.evaluate(TestRuleStoreClassName.java:42)
	at com.carrotsearch.randomizedtesting.rules.SystemPropertiesInvariantRule$1.evaluate(SystemPropertiesInvariantRule.java:55)
	at com.carrotsearch.randomizedtesting.rules.NoShadowingOrOverridesOnMethodsRule$1.evaluate(NoShadowingOrOverridesOnMethodsRule.java:39)
	at com.carrotsearch.randomizedtesting.rules.NoShadowingOrOverridesOnMethodsRule$1.evaluate(NoShadowingOrOverridesOnMethodsRule.java:39)
	at com.carrotsearch.randomizedtesting.rules.StatementAdapter.evaluate(StatementAdapter.java:36)
	at com.carrotsearch.randomizedtesting.rules.StatementAdapter.evaluate(StatementAdapter.java:36)
	at com.carrotsearch.randomizedtesting.rules.StatementAdapter.evaluate(StatementAdapter.java:36)
	at org.apache.lucene.util.TestRuleAssertionsRequired$1.evaluate(TestRuleAssertionsRequired.java:54)
	at org.apache.lucene.util.TestRuleMarkFailure$1.evaluate(TestRuleMarkFailure.java:48)
	at org.apache.lucene.util.TestRuleIgnoreAfterMaxFailures$1.evaluate(TestRuleIgnoreAfterMaxFailures.java:65)
	at org.apache.lucene.util.TestRuleIgnoreTestSuites$1.evaluate(TestRuleIgnoreTestSuites.java:55)
	at com.carrotsearch.randomizedtesting.rules.StatementAdapter.evaluate(StatementAdapter.java:36)
	at com.carrotsearch.randomizedtesting.ThreadLeakControl$StatementRunner.run(ThreadLeakControl.java:365)
	at java.lang.Thread.run(Thread.java:745)




Build Log:
[...truncated 1233 lines...]
   [junit4] Suite: org.apache.lucene.index.TestIndexWriter
   [junit4] IGNOR/A 0.00s J0 | TestIndexWriter.testHasUncommittedChangesAfterException
   [junit4]    > Assumption #1: requires doc values
   [junit4]   2> NOTE: reproduce with: ant test  -Dtestcase=TestIndexWriter -Dtests.method=testCorruptFirstCommit
-Dtests.seed=E70D8668746F2F4D -Dtests.multiplier=3 -Dtests.slow=true -Dtests.locale=nl_NL
-Dtests.timezone=America/Santo_Domingo -Dtests.asserts=true -Dtests.file.encoding=ISO-8859-1
   [junit4] ERROR   0.07s J0 | TestIndexWriter.testCorruptFirstCommit <<<
   [junit4]    > Throwable #1: java.nio.file.NoSuchFileException: segments in dir=RAMDirectory@fda35a8
lockFactory=org.apache.lucene.store.SingleInstanceLockFactory@177705a0
   [junit4]    > 	at __randomizedtesting.SeedInfo.seed([E70D8668746F2F4D:CDE6A3F23A096215]:0)
   [junit4]    > 	at org.apache.lucene.store.MockDirectoryWrapper.openInput(MockDirectoryWrapper.java:603)
   [junit4]    > 	at org.apache.lucene.store.Directory.openChecksumInput(Directory.java:113)
   [junit4]    > 	at org.apache.lucene.index.SegmentInfos.read(SegmentInfos.java:341)
   [junit4]    > 	at org.apache.lucene.index.SegmentInfos$1.doBody(SegmentInfos.java:454)
   [junit4]    > 	at org.apache.lucene.index.SegmentInfos$FindSegmentsFile.run(SegmentInfos.java:906)
   [junit4]    > 	at org.apache.lucene.index.SegmentInfos$FindSegmentsFile.run(SegmentInfos.java:752)
   [junit4]    > 	at org.apache.lucene.index.SegmentInfos.read(SegmentInfos.java:457)
   [junit4]    > 	at org.apache.lucene.index.CheckIndex.checkIndex(CheckIndex.java:414)
   [junit4]    > 	at org.apache.lucene.util.TestUtil.checkIndex(TestUtil.java:207)
   [junit4]    > 	at org.apache.lucene.store.MockDirectoryWrapper.close(MockDirectoryWrapper.java:724)
   [junit4]    > 	at org.apache.lucene.index.TestIndexWriter.testCorruptFirstCommit(TestIndexWriter.java:2520)
   [junit4]    > 	at java.lang.Thread.run(Thread.java:745)
   [junit4]   2> NOTE: leaving temporary files on disk at: /mnt/ssd/jenkins/workspace/Lucene-Solr-4.10-Linux/lucene/build/core/test/J0/./lucene.index.TestIndexWriter-E70D8668746F2F4D-001
   [junit4]   2> NOTE: test params are: codec=Lucene3x, sim=RandomSimilarityProvider(queryNorm=true,coord=yes):
{=IB LL-L2, b0=DFR I(F)B2, b1=DFR I(F)L3(800.0), b2=IB LL-L1, b3=DFR GZ(0.3), b4=DFR I(n)L2,
b5=DFR I(n)2, b6=IB LL-L2, b7=DFR I(n)L1, b8=DFR GB2, b9=LM Jelinek-Mercer(0.100000), str2=DFR
I(n)3(800.0), c0=IB SPL-D2, c1=DFR I(F)Z(0.3), c2=DFR I(ne)L2, c3=DFR GB1, c4=DFR I(n)3(800.0),
c5=DFR I(ne)LZ(0.3), c6=IB LL-LZ(0.3), c7=DFR GL1, c8=IB LL-L3(800.0), c9=IB SPL-L1, d0=DFR
I(n)B2, d1=DFR I(F)B3(800.0), d2=IB LL-D2, d3=DFR I(n)B3(800.0), d4=DFR I(F)L1, d5=IB SPL-D2,
d6=DFR I(F)Z(0.3), d7=DFR I(ne)L2, d8=IB LL-L1, d9=DFR GZ(0.3), a=DFR I(n)3(800.0), c=IB LL-LZ(0.3),
e0=DFR I(F)3(800.0), e1=BM25(k1=1.2,b=0.75), e2=IB SPL-D1, e3=IB SPL-L2, e4=DFR I(F)B1, e5=DFR
GL2, e6=DefaultSimilarity, e7=IB LL-D1, e8=DFR G2, e9=DFR GB1, f0=DFR I(ne)1, f1=DFR G3(800.0),
f2=DFR GL3(800.0), f3=IB SPL-D3(800.0), f4=DFR GBZ(0.3), f5=DFR I(ne)B3(800.0), f6=BM25(k1=1.2,b=0.75),
f7=IB SPL-D1, f8=IB SPL-L2, f9=DFR I(F)B1, myfield=DFR I(ne)LZ(0.3), foo=IB LL-D3(800.0),
content=DFR GZ(0.3), content5=DFR I(ne)3(800.0), content4=DFR I(F)BZ(0.3), content3=DFR GBZ(0.3),
content1=DFR GB3(800.0), f10=IB LL-L3(800.0), f12=DFR I(n)B1, f11=IB SPL-L1, f14=DFR I(F)1,
f13=IB LL-DZ(0.3), f16=DFR I(F)LZ(0.3), f15=DFR I(ne)B2, f18=DFR I(ne)BZ(0.3), f17=DFR I(n)L3(800.0),
f19=DFR G1, id=DFR I(F)B1, f21=DFR I(n)BZ(0.3), f20=DFR I(ne)L3(800.0), f23=DFR I(n)LZ(0.3),
f22=IB SPL-LZ(0.3), f25=DFR I(n)1, f24=DFR I(ne)3(800.0), f27=DFR I(F)2, f26=IB SPL-L3(800.0),
f29=DFR I(F)BZ(0.3), f28=DFR GB3(800.0), field=IB LL-D1, binary=DFR G3(800.0), f30=DFR G2,
e11=DefaultSimilarity, f32=DFR I(n)3(800.0), e10=DFR GL2, f31=DFR GB1, e13=DFR G2, f34=IB
LL-LZ(0.3), e12=IB LL-D1, f33=DFR I(ne)LZ(0.3), e15=DFR I(n)3(800.0), f36=IB LL-L3(800.0),
e14=DFR GB1, f35=DFR GL1, e17=IB LL-LZ(0.3), f38=DFR I(n)B1, e16=DFR I(ne)LZ(0.3), f37=IB
SPL-L1, e19=IB LL-L3(800.0), e18=DFR GL1, f39=IB LL-DZ(0.3), e20=DFR I(ne)L2, f41=DFR I(n)2,
f40=DFR I(n)L2, e22=DFR GZ(0.3), f43=DFR I(n)L1, e21=IB LL-L1, f42=IB LL-L2, e24=DFR I(n)2,
f45=LM Jelinek-Mercer(0.100000), e23=DFR I(n)L2, f44=DFR GB2, e26=DFR I(n)L1, f47=DFR I(n)BZ(0.3),
e25=IB LL-L2, f46=DFR I(ne)L3(800.0), e28=LM Jelinek-Mercer(0.100000), f49=DFR I(n)LZ(0.3),
e27=DFR GB2, f48=IB SPL-LZ(0.3), e29=DFR I(ne)L3(800.0), f50=DFR I(ne)L1, d10=DFR I(ne)L2,
e31=DFR I(n)B3(800.0), f52=DFR I(F)L3(800.0), e30=IB LL-D2, f51=DFR I(F)B2, d12=DFR GZ(0.3),
e33=DFR I(ne)L1, f54=DefaultSimilarity, d11=IB LL-L1, e32=DFR GLZ(0.3), f53=DFR GL2, d14=DFR
I(n)2, e35=DFR I(F)L3(800.0), f56=DFR G2, d13=DFR I(n)L2, e34=DFR I(F)B2, f55=IB LL-D1, d16=DFR
I(n)L1, e37=DefaultSimilarity, f58=DFR I(n)3(800.0), d15=IB LL-L2, e36=DFR GL2, f57=DFR GB1,
d18=LM Jelinek-Mercer(0.100000), e39=DFR G2, d17=DFR GB2, e38=IB LL-D1, f59=DFR I(ne)LZ(0.3),
body=IB LL-D3(800.0), d19=DFR I(ne)L3(800.0), e40=IB SPL-D1, f61=IB SPL-D2, f60=DFR I(F)L1,
d21=DFR G2, e42=DFR I(F)B1, f63=DFR I(ne)L2, d20=IB LL-D1, e41=IB SPL-L2, f62=DFR I(F)Z(0.3),
d23=DFR I(n)3(800.0), e44=IB SPL-D2, f65=DFR GZ(0.3), d22=DFR GB1, e43=DFR I(F)L1, f64=IB
LL-L1, d25=IB LL-LZ(0.3), e46=DFR I(ne)L2, f67=DFR I(n)2, d24=DFR I(ne)LZ(0.3), e45=DFR I(F)Z(0.3),
f66=DFR I(n)L2, d27=IB LL-L3(800.0), e48=DFR GZ(0.3), f69=DFR I(n)L1, d26=DFR GL1, e47=IB
LL-L1, f68=IB LL-L2, d29=DFR I(n)B1, d28=IB SPL-L1, e49=DFR I(n)L2, f70=DFR I(F)B1, d30=IB
SPL-D1, e51=IB SPL-D3(800.0), f72=DFR I(F)B3(800.0), e50=DFR GL3(800.0), f71=DFR I(n)B2, c11=DFR
I(F)3(800.0), d32=DFR I(F)B1, e53=DFR I(ne)B3(800.0), f74=DFR I(n)B3(800.0), c10=DFR I(ne)B1,
d31=IB SPL-L2, e52=DFR GBZ(0.3), f73=IB LL-D2, c13=IB SPL-D1, d34=IB SPL-D2, e55=DFR I(F)B3(800.0),
f76=DFR I(ne)L1, c12=BM25(k1=1.2,b=0.75), d33=DFR I(F)L1, e54=DFR I(n)B2, f75=DFR GLZ(0.3),
c15=DFR I(F)B1, d36=DFR I(ne)L2, e57=DFR I(n)B3(800.0), f78=DFR I(F)L3(800.0), c14=IB SPL-L2,
d35=DFR I(F)Z(0.3), e56=IB LL-D2, f77=DFR I(F)B2, c17=IB SPL-D2, d38=DFR GZ(0.3), e59=DFR
I(ne)L1, c16=DFR I(F)L1, d37=IB LL-L1, e58=DFR GLZ(0.3), f79=DFR GL2, c19=DFR I(ne)L2, c18=DFR
I(F)Z(0.3), d39=DFR I(n)L2, e60=DFR G3(800.0), f81=DFR I(ne)B3(800.0), f80=DFR GBZ(0.3), c20=DFR
I(F)B3(800.0), d41=DFR I(ne)L1, e62=DFR I(ne)Z(0.3), f83=IB SPL-D1, d40=DFR GLZ(0.3), e61=LM
Jelinek-Mercer(0.700000), f82=BM25(k1=1.2,b=0.75), c22=DFR I(n)B3(800.0), d43=DFR I(F)L3(800.0),
e64=DFR I(F)3(800.0), f85=DFR I(F)B1, c21=IB LL-D2, d42=DFR I(F)B2, e63=DFR I(ne)B1, f84=IB
SPL-L2, c24=DFR I(ne)L1, d45=DefaultSimilarity, e66=IB SPL-D1, f87=IB SPL-D2, c23=DFR GLZ(0.3),
d44=DFR GL2, e65=BM25(k1=1.2,b=0.75), f86=DFR I(F)L1, c26=DFR I(F)L3(800.0), d47=DFR G2, e68=DFR
I(F)B1, f89=DFR I(ne)L2, c25=DFR I(F)B2, d46=IB LL-D1, e67=IB SPL-L2, f88=DFR I(F)Z(0.3),
c28=DefaultSimilarity, d49=DFR I(n)3(800.0), c27=DFR GL2, d48=DFR GB1, e69=DFR I(F)L1, c29=IB
LL-D1, f90=DFR I(ne)Z(0.3), d50=DFR I(n)B3(800.0), e71=DFR I(F)L2, f92=DFR I(F)3(800.0), e70=IB
LL-D3(800.0), f91=DFR I(ne)B1, b10=DFR I(F)1, c31=DFR I(ne)BZ(0.3), d52=IB SPL-DZ(0.3), e73=DFR
I(n)1, f94=DFR I(F)BZ(0.3), c30=DFR I(n)L3(800.0), d51=DFR I(n)Z(0.3), e72=DFR I(ne)3(800.0),
f93=DFR GB3(800.0), b12=DFR I(F)LZ(0.3), c33=DFR I(ne)2, d54=DFR I(F)L2, e75=DFR I(F)2, f96=DFR
G3(800.0), b11=DFR I(ne)B2, c32=DFR G1, d53=IB LL-D3(800.0), e74=IB SPL-L3(800.0), f95=DFR
I(ne)1, b14=DFR I(ne)BZ(0.3), c35=IB SPL-DZ(0.3), d56=DFR I(ne)Z(0.3), e77=DFR I(F)BZ(0.3),
f98=IB SPL-D3(800.0), b13=DFR I(n)L3(800.0), c34=DFR I(n)Z(0.3), d55=LM Jelinek-Mercer(0.700000),
e76=DFR GB3(800.0), f97=DFR GL3(800.0), b16=DFR I(ne)2, c37=DFR I(F)L2, d58=DFR I(F)3(800.0),
e79=DFR G3(800.0), b15=DFR G1, c36=IB LL-D3(800.0), d57=DFR I(ne)B1, e78=DFR I(ne)1, f99=DFR
GBZ(0.3), b18=IB SPL-DZ(0.3), c39=DFR I(ne)Z(0.3), b17=DFR I(n)Z(0.3), c38=LM Jelinek-Mercer(0.700000),
d59=BM25(k1=1.2,b=0.75), b19=IB LL-D3(800.0), e80=DFR I(n)BZ(0.3), c40=DFR I(F)LZ(0.3), d61=DFR
I(ne)2, e82=DFR I(n)LZ(0.3), d60=DFR G1, e81=IB SPL-LZ(0.3), b21=DFR I(n)1, c42=DFR I(F)BZ(0.3),
d63=IB SPL-D3(800.0), e84=DFR I(ne)BZ(0.3), b20=DFR I(ne)3(800.0), c41=DFR GB3(800.0), d62=DFR
GL3(800.0), e83=DFR I(n)L3(800.0), b23=DFR I(F)2, c44=DFR G3(800.0), d65=DFR I(ne)B3(800.0),
e86=DFR I(ne)2, b22=IB SPL-L3(800.0), c43=DFR I(ne)1, d64=DFR GBZ(0.3), e85=DFR G1, b25=DFR
I(F)BZ(0.3), c46=IB SPL-D3(800.0), d67=DFR I(F)B3(800.0), e88=IB SPL-DZ(0.3), b24=DFR GB3(800.0),
c45=DFR GL3(800.0), d66=DFR I(n)B2, e87=DFR I(n)Z(0.3), b27=DFR G3(800.0), c48=DFR I(ne)B3(800.0),
d69=DFR I(n)B3(800.0), b26=DFR I(ne)1, c47=DFR GBZ(0.3), d68=IB LL-D2, e89=IB LL-D3(800.0),
b29=IB SPL-D3(800.0), b28=DFR GL3(800.0), c49=DFR I(n)B2, str=IB SPL-D1, d70=DFR I(F)BZ(0.3),
e91=DFR I(F)1, e90=IB LL-DZ(0.3), b30=DFR I(n)LZ(0.3), c51=DFR I(F)2, d72=DFR G3(800.0), e93=DFR
I(F)LZ(0.3), c50=IB SPL-L3(800.0), d71=DFR I(ne)1, e92=DFR I(ne)B2, a11=DFR I(n)3(800.0),
b32=IB LL-L3(800.0), c53=DFR I(F)1, d74=DFR I(ne)BZ(0.3), e95=DFR I(n)BZ(0.3), a10=DFR GB1,
b31=DFR GL1, c52=IB LL-DZ(0.3), d73=DFR I(n)L3(800.0), e94=DFR I(ne)L3(800.0), a13=IB LL-LZ(0.3),
b34=DFR I(n)B1, c55=DFR I(F)LZ(0.3), d76=DFR I(ne)2, e97=DFR I(n)LZ(0.3), a12=DFR I(ne)LZ(0.3),
b33=IB SPL-L1, c54=DFR I(ne)B2, d75=DFR G1, e96=IB SPL-LZ(0.3), a15=IB LL-L3(800.0), b36=DFR
I(F)1, c57=DFR I(ne)BZ(0.3), d78=IB SPL-DZ(0.3), e99=DFR I(n)1, a14=DFR GL1, b35=IB LL-DZ(0.3),
c56=DFR I(n)L3(800.0), d77=DFR I(n)Z(0.3), e98=DFR I(ne)3(800.0), a17=DFR I(n)B1, b38=DFR
I(F)LZ(0.3), c59=DFR I(ne)2, a16=IB SPL-L1, b37=DFR I(ne)B2, c58=DFR G1, d79=IB LL-D3(800.0),
a19=DFR I(F)1, a18=IB LL-DZ(0.3), b39=DFR I(n)L3(800.0), c60=IB LL-L3(800.0), d81=DFR I(F)1,
d80=IB LL-DZ(0.3), a20=DFR G2, b41=IB LL-LZ(0.3), c62=DFR I(n)B1, d83=DFR I(F)LZ(0.3), b40=DFR
I(ne)LZ(0.3), c61=IB SPL-L1, d82=DFR I(ne)B2, a22=DFR I(n)L1, b43=DFR I(n)BZ(0.3), c64=DFR
I(n)1, d85=DFR I(F)BZ(0.3), a21=IB LL-L2, b42=DFR I(ne)L3(800.0), c63=DFR I(ne)3(800.0), d84=DFR
GB3(800.0), a24=LM Jelinek-Mercer(0.100000), b45=DFR I(n)LZ(0.3), c66=DFR I(F)2, d87=DFR G3(800.0),
a23=DFR GB2, b44=IB SPL-LZ(0.3), c65=IB SPL-L3(800.0), d86=DFR I(ne)1, a26=DFR I(n)BZ(0.3),
b47=DFR I(n)1, c68=DFR I(F)BZ(0.3), d89=IB SPL-D3(800.0), a25=DFR I(ne)L3(800.0), b46=DFR
I(ne)3(800.0), c67=DFR GB3(800.0), d88=DFR GL3(800.0), a28=DFR I(n)LZ(0.3), b49=DFR I(F)2,
a27=IB SPL-LZ(0.3), b48=IB SPL-L3(800.0), c69=DFR I(ne)1, a29=DFR I(ne)3(800.0), d90=DFR I(n)LZ(0.3),
b50=DFR I(n)L1, c71=DFR I(n)BZ(0.3), d92=DFR I(n)1, c70=DFR I(ne)L3(800.0), d91=DFR I(ne)3(800.0),
a31=DFR I(n)2, b52=LM Jelinek-Mercer(0.100000), c73=DFR I(n)LZ(0.3), d94=DFR I(F)2, a30=DFR
I(n)L2, b51=DFR GB2, c72=IB SPL-LZ(0.3), d93=IB SPL-L3(800.0), a33=DefaultSimilarity, b54=DFR
I(n)3(800.0), c75=IB LL-L3(800.0), d96=DFR I(F)1, a32=DFR GL2, b53=DFR GB1, c74=DFR GL1, d95=IB
LL-DZ(0.3), a35=DFR G2, b56=IB LL-LZ(0.3), c77=DFR I(n)B1, d98=DFR I(F)LZ(0.3), a34=IB LL-D1,
b55=DFR I(ne)LZ(0.3), c76=IB SPL-L1, d97=DFR I(ne)B2, a37=DFR I(n)3(800.0), b58=IB LL-L3(800.0),
c79=DFR I(F)1, a36=DFR GB1, b57=DFR GL1, c78=IB LL-DZ(0.3), d99=DFR I(n)L3(800.0), a39=IB
LL-LZ(0.3), a38=DFR I(ne)LZ(0.3), b59=IB SPL-L1, c80=DFR G2, a40=DFR I(ne)L1, b61=DefaultSimilarity,
c82=DFR I(n)3(800.0), b60=DFR GL2, c81=DFR GB1, a42=DFR I(F)L3(800.0), b63=DFR G2, c84=IB
LL-LZ(0.3), a41=DFR I(F)B2, b62=IB LL-D1, c83=DFR I(ne)LZ(0.3), a44=DFR GZ(0.3), b65=DFR I(n)L1,
c86=DFR I(n)BZ(0.3), a43=IB LL-L1, b64=IB LL-L2, c85=DFR I(ne)L3(800.0), a46=DFR I(n)2, b67=LM
Jelinek-Mercer(0.100000), c88=DFR I(n)LZ(0.3), a45=DFR I(n)L2, b66=DFR GB2, c87=IB SPL-LZ(0.3),
a48=DFR I(n)L1, b69=DFR I(n)BZ(0.3), a47=IB LL-L2, b68=DFR I(ne)L3(800.0), c89=DFR I(ne)3(800.0),
a49=DFR GB2, tvtest=DFR I(F)L1, b70=DFR I(ne)L2, c91=DFR I(n)2, c90=DFR I(n)L2, a51=IB SPL-D2,
b72=DFR GZ(0.3), c93=DFR I(n)L1, a50=DFR I(F)L1, b71=IB LL-L1, c92=IB LL-L2, a53=DFR I(ne)L2,
b74=DFR I(n)2, c95=LM Jelinek-Mercer(0.100000), a52=DFR I(F)Z(0.3), b73=DFR I(n)L2, c94=DFR
GB2, a55=DFR I(ne)L1, b76=DefaultSimilarity, c97=DFR I(n)3(800.0), a54=DFR GLZ(0.3), b75=DFR
GL2, c96=DFR GB1, a57=DFR I(F)L3(800.0), b78=DFR G2, c99=IB LL-LZ(0.3), a56=DFR I(F)B2, b77=IB
LL-D1, c98=DFR I(ne)LZ(0.3), a59=DefaultSimilarity, string=DFR I(F)LZ(0.3), a58=DFR GL2, b79=DFR
GB1, a60=DFR I(ne)B3(800.0), b81=DFR I(n)B3(800.0), b80=IB LL-D2, a62=DFR I(F)B3(800.0), b83=DFR
I(ne)L1, a61=DFR I(n)B2, b82=DFR GLZ(0.3), a64=DFR I(n)B3(800.0), b85=DFR I(F)L3(800.0), a63=IB
LL-D2, b84=DFR I(F)B2, a66=IB SPL-D2, b87=DFR GZ(0.3), a65=DFR I(F)L1, b86=IB LL-L1, a68=DFR
I(ne)L2, b89=DFR I(n)2, a67=DFR I(F)Z(0.3), b88=DFR I(n)L2, a69=IB LL-L1, b90=IB SPL-D1, a71=DFR
I(F)3(800.0), b92=DFR I(F)B1, a70=DFR I(ne)B1, b91=IB SPL-L2, a73=IB SPL-D1, b94=IB SPL-D2,
a72=BM25(k1=1.2,b=0.75), b93=DFR I(F)L1, a75=DFR I(F)B1, b96=DFR I(ne)L2, a74=IB SPL-L2, b95=DFR
I(F)Z(0.3), a77=DFR I(F)B3(800.0), b98=DFR I(ne)L1, a76=DFR I(n)B2, b97=DFR GLZ(0.3), a79=DFR
I(n)B3(800.0), a78=IB LL-D2, b99=DFR I(F)B2, a80=DFR I(F)BZ(0.3), a82=DFR G3(800.0), a81=DFR
I(ne)1, a84=IB SPL-D3(800.0), a83=DFR GL3(800.0), a86=DFR I(ne)B3(800.0), a85=DFR GBZ(0.3),
a88=IB SPL-D1, a87=BM25(k1=1.2,b=0.75), a89=IB SPL-L2, a91=IB SPL-DZ(0.3), a90=DFR I(n)Z(0.3),
a93=DFR I(F)L2, a92=IB LL-D3(800.0), a95=DFR I(ne)Z(0.3), a94=LM Jelinek-Mercer(0.700000),
a97=DFR I(F)3(800.0), a96=DFR I(ne)B1, a99=IB SPL-D3(800.0), a98=DFR GL3(800.0), a0=DFR I(ne)L2,
a1=DFR GB1, a2=DFR I(n)3(800.0), a3=DFR I(ne)LZ(0.3), a4=IB LL-LZ(0.3), a5=DFR GL1, a6=IB
LL-L3(800.0), a7=IB SPL-L1, a8=DFR I(n)B1, a9=IB LL-DZ(0.3)}, locale=nl_NL, timezone=America/Santo_Domingo
   [junit4]   2> NOTE: Linux 3.13.0-39-generic amd64/Oracle Corporation 1.8.0_20 (64-bit)/cpus=8,threads=1,free=322975360,total=518979584
   [junit4]   2> NOTE: All tests run in this JVM: [TestFieldReuse, TestNearSpansOrdered,
TestSearcherManager, TestPackedTokenAttributeImpl, TestLucene42DocValuesFormat, TestCrash,
TestAutomatonQueryUnicode, TestFastDecompressionMode, TestNGramPhraseQuery, TestPagedBytes,
TestLucene3xStoredFieldsFormat, TestSort, TestIntsRef, TestNoDeletionPolicy, TestPerSegmentDeletes,
TestDocTermOrdsRewriteMethod, TestSimpleExplanations, TestLucene40DocValuesFormat, TestLazyProxSkipping,
TestNumericDocValuesUpdates, TestFieldMaskingSpanQuery, TestLiveFieldValues, TestIndexableBinaryStringTools,
TestSentinelIntSet, TestTermScorer, TestBytesStore, TestDeletionPolicy, TestTermVectors, TestRecyclingByteBlockAllocator,
Test2BPositions, TestSearchForDuplicates, TestNoMergeScheduler, TestLucene40PostingsFormat,
TestTopScoreDocCollector, TestFixedBitSet, TestRollingUpdates, TestNRTReaderWithThreads, TestLock,
TestFlushByRamOrCountsPolicy, TestCustomSearcherSort, TestLucene41StoredFieldsFormat, TestBagOfPositions,
TestMinShouldMatch2, TestPersistentSnapshotDeletionPolicy, TestFieldsReader, Nested, Nested2,
TestStoredFieldsFormat, InBeforeClass, InAfterClass, InTestMethod, NonStringProperties, TestIndexWriterReader,
TestMathUtil, TestLucene49NormsFormat, TestSpanExplanationsOfNonMatches, TestFieldCacheRewriteMethod,
Nested, Nested, TestBitVectorBackCompat, TestStressNRT, TestSimilarityProvider, TestCloseableThreadLocal,
TestTerm, TestConcurrentMergeScheduler, TestVirtualMethod, TestMmapDirectory, TestDocInverterPerFieldErrorInfo,
TestCompoundFile, TestIndexWriterCommit, TestTimeLimitingCollector, TestCharTermAttributeImpl,
TestWildcardRandom, TestNumericRangeQuery64, TestWorstCaseTestBehavior, TestDirectoryReader,
TestTermsEnum, TestMergeSchedulerExternal, TestStringHelper, Nested1, Nested2, Nested3, TestIndexWriterLockRelease,
TestIndexWriterThreadsToSegments, TestDirectPacked, TestMultiPhraseQuery, TestTermVectorsReader,
TestDemo, TestLookaheadTokenFilter, TestLucene40NormsFormat, TestStressDeletes, TestIndexWriterMerging,
Nested1, TestCachingCollector, TestLucene40StoredFieldsFormat, TestDocValuesWithThreads, TestIndexWriter]
   [junit4] Completed on J0 in 36.89s, 70 tests, 1 error, 1 skipped <<< FAILURES!

[...truncated 771 lines...]
BUILD FAILED
/mnt/ssd/jenkins/workspace/Lucene-Solr-4.10-Linux/build.xml:474: The following error occurred
while executing this line:
/mnt/ssd/jenkins/workspace/Lucene-Solr-4.10-Linux/build.xml:454: The following error occurred
while executing this line:
/mnt/ssd/jenkins/workspace/Lucene-Solr-4.10-Linux/build.xml:45: The following error occurred
while executing this line:
/mnt/ssd/jenkins/workspace/Lucene-Solr-4.10-Linux/extra-targets.xml:37: The following error
occurred while executing this line:
/mnt/ssd/jenkins/workspace/Lucene-Solr-4.10-Linux/lucene/build.xml:49: The following error
occurred while executing this line:
/mnt/ssd/jenkins/workspace/Lucene-Solr-4.10-Linux/lucene/common-build.xml:1350: The following
error occurred while executing this line:
/mnt/ssd/jenkins/workspace/Lucene-Solr-4.10-Linux/lucene/common-build.xml:970: There were
test failures: 420 suites, 3744 tests, 1 error, 182 ignored (171 assumptions)

Total time: 35 minutes 23 seconds
Build step 'Invoke Ant' marked build as failure
[description-setter] Description set: Java: 64bit/jdk1.8.0_20 -XX:+UseCompressedOops -XX:+UseConcMarkSweepGC
(asserts: true)
Archiving artifacts
Recording test results
Email was triggered for: Failure - Any
Sending email for trigger: Failure - Any



Mime
View raw message