lucene-dev mailing list archives

Site index · List index
Message view « Date » · « Thread »
Top « Date » · « Thread »
From Policeman Jenkins Server <jenk...@thetaphi.de>
Subject [JENKINS] Lucene-Solr-trunk-Linux (64bit/jdk1.8.0_40-ea-b09) - Build # 11470 - Failure!
Date Fri, 17 Oct 2014 22:10:41 GMT
Build: http://jenkins.thetaphi.de/job/Lucene-Solr-trunk-Linux/11470/
Java: 64bit/jdk1.8.0_40-ea-b09 -XX:+UseCompressedOops -XX:+UseConcMarkSweepGC

4 tests failed.
FAILED:  junit.framework.TestSuite.org.apache.solr.cloud.CollectionsAPIDistributedZkTest

Error Message:
ERROR: SolrZkClient opens=20 closes=19

Stack Trace:
java.lang.AssertionError: ERROR: SolrZkClient opens=20 closes=19
	at __randomizedtesting.SeedInfo.seed([3C8147AC723F39AB]:0)
	at org.junit.Assert.fail(Assert.java:93)
	at org.apache.solr.SolrTestCaseJ4.endTrackingZkClients(SolrTestCaseJ4.java:455)
	at org.apache.solr.SolrTestCaseJ4.afterClass(SolrTestCaseJ4.java:188)
	at sun.reflect.GeneratedMethodAccessor32.invoke(Unknown Source)
	at sun.reflect.DelegatingMethodAccessorImpl.invoke(DelegatingMethodAccessorImpl.java:43)
	at java.lang.reflect.Method.invoke(Method.java:497)
	at com.carrotsearch.randomizedtesting.RandomizedRunner.invoke(RandomizedRunner.java:1618)
	at com.carrotsearch.randomizedtesting.RandomizedRunner$5.evaluate(RandomizedRunner.java:790)
	at com.carrotsearch.randomizedtesting.rules.StatementAdapter.evaluate(StatementAdapter.java:36)
	at com.carrotsearch.randomizedtesting.rules.SystemPropertiesRestoreRule$1.evaluate(SystemPropertiesRestoreRule.java:53)
	at org.apache.lucene.util.AbstractBeforeAfterRule$1.evaluate(AbstractBeforeAfterRule.java:46)
	at org.apache.lucene.util.TestRuleStoreClassName$1.evaluate(TestRuleStoreClassName.java:42)
	at com.carrotsearch.randomizedtesting.rules.SystemPropertiesInvariantRule$1.evaluate(SystemPropertiesInvariantRule.java:55)
	at com.carrotsearch.randomizedtesting.rules.NoShadowingOrOverridesOnMethodsRule$1.evaluate(NoShadowingOrOverridesOnMethodsRule.java:39)
	at com.carrotsearch.randomizedtesting.rules.NoShadowingOrOverridesOnMethodsRule$1.evaluate(NoShadowingOrOverridesOnMethodsRule.java:39)
	at com.carrotsearch.randomizedtesting.rules.StatementAdapter.evaluate(StatementAdapter.java:36)
	at com.carrotsearch.randomizedtesting.rules.StatementAdapter.evaluate(StatementAdapter.java:36)
	at com.carrotsearch.randomizedtesting.rules.StatementAdapter.evaluate(StatementAdapter.java:36)
	at org.apache.lucene.util.TestRuleAssertionsRequired$1.evaluate(TestRuleAssertionsRequired.java:43)
	at org.apache.lucene.util.TestRuleMarkFailure$1.evaluate(TestRuleMarkFailure.java:48)
	at org.apache.lucene.util.TestRuleIgnoreAfterMaxFailures$1.evaluate(TestRuleIgnoreAfterMaxFailures.java:65)
	at org.apache.lucene.util.TestRuleIgnoreTestSuites$1.evaluate(TestRuleIgnoreTestSuites.java:55)
	at com.carrotsearch.randomizedtesting.rules.StatementAdapter.evaluate(StatementAdapter.java:36)
	at com.carrotsearch.randomizedtesting.ThreadLeakControl$StatementRunner.run(ThreadLeakControl.java:365)
	at java.lang.Thread.run(Thread.java:745)


FAILED:  junit.framework.TestSuite.org.apache.solr.cloud.CollectionsAPIDistributedZkTest

Error Message:
4 threads leaked from SUITE scope at org.apache.solr.cloud.CollectionsAPIDistributedZkTest:     1) Thread[id=1166, name=zkCallback-187-thread-1, state=TIMED_WAITING, group=TGRP-CollectionsAPIDistributedZkTest]         at sun.misc.Unsafe.park(Native Method)         at java.util.concurrent.locks.LockSupport.parkNanos(LockSupport.java:215)         at java.util.concurrent.SynchronousQueue$TransferStack.awaitFulfill(SynchronousQueue.java:460)         at java.util.concurrent.SynchronousQueue$TransferStack.transfer(SynchronousQueue.java:362)         at java.util.concurrent.SynchronousQueue.poll(SynchronousQueue.java:941)         at java.util.concurrent.ThreadPoolExecutor.getTask(ThreadPoolExecutor.java:1066)         at java.util.concurrent.ThreadPoolExecutor.runWorker(ThreadPoolExecutor.java:1127)         at java.util.concurrent.ThreadPoolExecutor$Worker.run(ThreadPoolExecutor.java:617)         at java.lang.Thread.run(Thread.java:745)    2) Thread[id=1163, name=TEST-CollectionsAPIDistributedZkTest.testDistribSearch-seed#[3C8147AC723F39AB]-EventThread, state=WAITING, group=TGRP-CollectionsAPIDistributedZkTest]         at sun.misc.Unsafe.park(Native Method)         at java.util.concurrent.locks.LockSupport.park(LockSupport.java:175)         at java.util.concurrent.locks.AbstractQueuedSynchronizer$ConditionObject.await(AbstractQueuedSynchronizer.java:2039)         at java.util.concurrent.LinkedBlockingQueue.take(LinkedBlockingQueue.java:442)         at org.apache.zookeeper.ClientCnxn$EventThread.run(ClientCnxn.java:494)    3) Thread[id=1162, name=TEST-CollectionsAPIDistributedZkTest.testDistribSearch-seed#[3C8147AC723F39AB]-SendThread(127.0.0.1:56209), state=TIMED_WAITING, group=TGRP-CollectionsAPIDistributedZkTest]         at java.lang.Thread.sleep(Native Method)         at org.apache.zookeeper.client.StaticHostProvider.next(StaticHostProvider.java:101)         at org.apache.zookeeper.ClientCnxn$SendThread.startConnect(ClientCnxn.java:940)         at org.apache.zookeeper.ClientCnxn$SendThread.run(ClientCnxn.java:1003)    4) Thread[id=1235, name=zkCallback-187-thread-2, state=TIMED_WAITING, group=TGRP-CollectionsAPIDistributedZkTest]         at sun.misc.Unsafe.park(Native Method)         at java.util.concurrent.locks.LockSupport.parkNanos(LockSupport.java:215)         at java.util.concurrent.SynchronousQueue$TransferStack.awaitFulfill(SynchronousQueue.java:460)         at java.util.concurrent.SynchronousQueue$TransferStack.transfer(SynchronousQueue.java:362)         at java.util.concurrent.SynchronousQueue.poll(SynchronousQueue.java:941)         at java.util.concurrent.ThreadPoolExecutor.getTask(ThreadPoolExecutor.java:1066)         at java.util.concurrent.ThreadPoolExecutor.runWorker(ThreadPoolExecutor.java:1127)         at java.util.concurrent.ThreadPoolExecutor$Worker.run(ThreadPoolExecutor.java:617)         at java.lang.Thread.run(Thread.java:745)

Stack Trace:
com.carrotsearch.randomizedtesting.ThreadLeakError: 4 threads leaked from SUITE scope at org.apache.solr.cloud.CollectionsAPIDistributedZkTest: 
   1) Thread[id=1166, name=zkCallback-187-thread-1, state=TIMED_WAITING, group=TGRP-CollectionsAPIDistributedZkTest]
        at sun.misc.Unsafe.park(Native Method)
        at java.util.concurrent.locks.LockSupport.parkNanos(LockSupport.java:215)
        at java.util.concurrent.SynchronousQueue$TransferStack.awaitFulfill(SynchronousQueue.java:460)
        at java.util.concurrent.SynchronousQueue$TransferStack.transfer(SynchronousQueue.java:362)
        at java.util.concurrent.SynchronousQueue.poll(SynchronousQueue.java:941)
        at java.util.concurrent.ThreadPoolExecutor.getTask(ThreadPoolExecutor.java:1066)
        at java.util.concurrent.ThreadPoolExecutor.runWorker(ThreadPoolExecutor.java:1127)
        at java.util.concurrent.ThreadPoolExecutor$Worker.run(ThreadPoolExecutor.java:617)
        at java.lang.Thread.run(Thread.java:745)
   2) Thread[id=1163, name=TEST-CollectionsAPIDistributedZkTest.testDistribSearch-seed#[3C8147AC723F39AB]-EventThread, state=WAITING, group=TGRP-CollectionsAPIDistributedZkTest]
        at sun.misc.Unsafe.park(Native Method)
        at java.util.concurrent.locks.LockSupport.park(LockSupport.java:175)
        at java.util.concurrent.locks.AbstractQueuedSynchronizer$ConditionObject.await(AbstractQueuedSynchronizer.java:2039)
        at java.util.concurrent.LinkedBlockingQueue.take(LinkedBlockingQueue.java:442)
        at org.apache.zookeeper.ClientCnxn$EventThread.run(ClientCnxn.java:494)
   3) Thread[id=1162, name=TEST-CollectionsAPIDistributedZkTest.testDistribSearch-seed#[3C8147AC723F39AB]-SendThread(127.0.0.1:56209), state=TIMED_WAITING, group=TGRP-CollectionsAPIDistributedZkTest]
        at java.lang.Thread.sleep(Native Method)
        at org.apache.zookeeper.client.StaticHostProvider.next(StaticHostProvider.java:101)
        at org.apache.zookeeper.ClientCnxn$SendThread.startConnect(ClientCnxn.java:940)
        at org.apache.zookeeper.ClientCnxn$SendThread.run(ClientCnxn.java:1003)
   4) Thread[id=1235, name=zkCallback-187-thread-2, state=TIMED_WAITING, group=TGRP-CollectionsAPIDistributedZkTest]
        at sun.misc.Unsafe.park(Native Method)
        at java.util.concurrent.locks.LockSupport.parkNanos(LockSupport.java:215)
        at java.util.concurrent.SynchronousQueue$TransferStack.awaitFulfill(SynchronousQueue.java:460)
        at java.util.concurrent.SynchronousQueue$TransferStack.transfer(SynchronousQueue.java:362)
        at java.util.concurrent.SynchronousQueue.poll(SynchronousQueue.java:941)
        at java.util.concurrent.ThreadPoolExecutor.getTask(ThreadPoolExecutor.java:1066)
        at java.util.concurrent.ThreadPoolExecutor.runWorker(ThreadPoolExecutor.java:1127)
        at java.util.concurrent.ThreadPoolExecutor$Worker.run(ThreadPoolExecutor.java:617)
        at java.lang.Thread.run(Thread.java:745)
	at __randomizedtesting.SeedInfo.seed([3C8147AC723F39AB]:0)


FAILED:  junit.framework.TestSuite.org.apache.solr.cloud.CollectionsAPIDistributedZkTest

Error Message:
There are still zombie threads that couldn't be terminated:    1) Thread[id=1166, name=zkCallback-187-thread-1, state=TIMED_WAITING, group=TGRP-CollectionsAPIDistributedZkTest]         at sun.misc.Unsafe.park(Native Method)         at java.util.concurrent.locks.LockSupport.parkNanos(LockSupport.java:215)         at java.util.concurrent.SynchronousQueue$TransferStack.awaitFulfill(SynchronousQueue.java:460)         at java.util.concurrent.SynchronousQueue$TransferStack.transfer(SynchronousQueue.java:362)         at java.util.concurrent.SynchronousQueue.poll(SynchronousQueue.java:941)         at java.util.concurrent.ThreadPoolExecutor.getTask(ThreadPoolExecutor.java:1066)         at java.util.concurrent.ThreadPoolExecutor.runWorker(ThreadPoolExecutor.java:1127)         at java.util.concurrent.ThreadPoolExecutor$Worker.run(ThreadPoolExecutor.java:617)         at java.lang.Thread.run(Thread.java:745)    2) Thread[id=1162, name=TEST-CollectionsAPIDistributedZkTest.testDistribSearch-seed#[3C8147AC723F39AB]-SendThread(127.0.0.1:56209), state=TIMED_WAITING, group=TGRP-CollectionsAPIDistributedZkTest]         at java.lang.Thread.sleep(Native Method)         at org.apache.zookeeper.ClientCnxn$SendThread.run(ClientCnxn.java:994)    3) Thread[id=1235, name=zkCallback-187-thread-2, state=TIMED_WAITING, group=TGRP-CollectionsAPIDistributedZkTest]         at sun.misc.Unsafe.park(Native Method)         at java.util.concurrent.locks.LockSupport.parkNanos(LockSupport.java:215)         at java.util.concurrent.SynchronousQueue$TransferStack.awaitFulfill(SynchronousQueue.java:460)         at java.util.concurrent.SynchronousQueue$TransferStack.transfer(SynchronousQueue.java:362)         at java.util.concurrent.SynchronousQueue.poll(SynchronousQueue.java:941)         at java.util.concurrent.ThreadPoolExecutor.getTask(ThreadPoolExecutor.java:1066)         at java.util.concurrent.ThreadPoolExecutor.runWorker(ThreadPoolExecutor.java:1127)         at java.util.concurrent.ThreadPoolExecutor$Worker.run(ThreadPoolExecutor.java:617)         at java.lang.Thread.run(Thread.java:745)

Stack Trace:
com.carrotsearch.randomizedtesting.ThreadLeakError: There are still zombie threads that couldn't be terminated:
   1) Thread[id=1166, name=zkCallback-187-thread-1, state=TIMED_WAITING, group=TGRP-CollectionsAPIDistributedZkTest]
        at sun.misc.Unsafe.park(Native Method)
        at java.util.concurrent.locks.LockSupport.parkNanos(LockSupport.java:215)
        at java.util.concurrent.SynchronousQueue$TransferStack.awaitFulfill(SynchronousQueue.java:460)
        at java.util.concurrent.SynchronousQueue$TransferStack.transfer(SynchronousQueue.java:362)
        at java.util.concurrent.SynchronousQueue.poll(SynchronousQueue.java:941)
        at java.util.concurrent.ThreadPoolExecutor.getTask(ThreadPoolExecutor.java:1066)
        at java.util.concurrent.ThreadPoolExecutor.runWorker(ThreadPoolExecutor.java:1127)
        at java.util.concurrent.ThreadPoolExecutor$Worker.run(ThreadPoolExecutor.java:617)
        at java.lang.Thread.run(Thread.java:745)
   2) Thread[id=1162, name=TEST-CollectionsAPIDistributedZkTest.testDistribSearch-seed#[3C8147AC723F39AB]-SendThread(127.0.0.1:56209), state=TIMED_WAITING, group=TGRP-CollectionsAPIDistributedZkTest]
        at java.lang.Thread.sleep(Native Method)
        at org.apache.zookeeper.ClientCnxn$SendThread.run(ClientCnxn.java:994)
   3) Thread[id=1235, name=zkCallback-187-thread-2, state=TIMED_WAITING, group=TGRP-CollectionsAPIDistributedZkTest]
        at sun.misc.Unsafe.park(Native Method)
        at java.util.concurrent.locks.LockSupport.parkNanos(LockSupport.java:215)
        at java.util.concurrent.SynchronousQueue$TransferStack.awaitFulfill(SynchronousQueue.java:460)
        at java.util.concurrent.SynchronousQueue$TransferStack.transfer(SynchronousQueue.java:362)
        at java.util.concurrent.SynchronousQueue.poll(SynchronousQueue.java:941)
        at java.util.concurrent.ThreadPoolExecutor.getTask(ThreadPoolExecutor.java:1066)
        at java.util.concurrent.ThreadPoolExecutor.runWorker(ThreadPoolExecutor.java:1127)
        at java.util.concurrent.ThreadPoolExecutor$Worker.run(ThreadPoolExecutor.java:617)
        at java.lang.Thread.run(Thread.java:745)
	at __randomizedtesting.SeedInfo.seed([3C8147AC723F39AB]:0)


REGRESSION:  org.apache.solr.cloud.CollectionsAPIDistributedZkTest.testDistribSearch

Error Message:
some core start times did not change on reload

Stack Trace:
java.lang.AssertionError: some core start times did not change on reload
	at __randomizedtesting.SeedInfo.seed([3C8147AC723F39AB:BD67C9B405605997]:0)
	at org.junit.Assert.fail(Assert.java:93)
	at org.junit.Assert.assertTrue(Assert.java:43)
	at org.apache.solr.cloud.CollectionsAPIDistributedZkTest.testCollectionsAPI(CollectionsAPIDistributedZkTest.java:884)
	at org.apache.solr.cloud.CollectionsAPIDistributedZkTest.doTest(CollectionsAPIDistributedZkTest.java:203)
	at org.apache.solr.BaseDistributedSearchTestCase.testDistribSearch(BaseDistributedSearchTestCase.java:869)
	at sun.reflect.NativeMethodAccessorImpl.invoke0(Native Method)
	at sun.reflect.NativeMethodAccessorImpl.invoke(NativeMethodAccessorImpl.java:62)
	at sun.reflect.DelegatingMethodAccessorImpl.invoke(DelegatingMethodAccessorImpl.java:43)
	at java.lang.reflect.Method.invoke(Method.java:497)
	at com.carrotsearch.randomizedtesting.RandomizedRunner.invoke(RandomizedRunner.java:1618)
	at com.carrotsearch.randomizedtesting.RandomizedRunner$6.evaluate(RandomizedRunner.java:827)
	at com.carrotsearch.randomizedtesting.RandomizedRunner$7.evaluate(RandomizedRunner.java:863)
	at com.carrotsearch.randomizedtesting.RandomizedRunner$8.evaluate(RandomizedRunner.java:877)
	at com.carrotsearch.randomizedtesting.rules.SystemPropertiesRestoreRule$1.evaluate(SystemPropertiesRestoreRule.java:53)
	at org.apache.lucene.util.TestRuleSetupTeardownChained$1.evaluate(TestRuleSetupTeardownChained.java:50)
	at org.apache.lucene.util.AbstractBeforeAfterRule$1.evaluate(AbstractBeforeAfterRule.java:46)
	at com.carrotsearch.randomizedtesting.rules.SystemPropertiesInvariantRule$1.evaluate(SystemPropertiesInvariantRule.java:55)
	at org.apache.lucene.util.TestRuleThreadAndTestName$1.evaluate(TestRuleThreadAndTestName.java:49)
	at org.apache.lucene.util.TestRuleIgnoreAfterMaxFailures$1.evaluate(TestRuleIgnoreAfterMaxFailures.java:65)
	at org.apache.lucene.util.TestRuleMarkFailure$1.evaluate(TestRuleMarkFailure.java:48)
	at com.carrotsearch.randomizedtesting.rules.StatementAdapter.evaluate(StatementAdapter.java:36)
	at com.carrotsearch.randomizedtesting.ThreadLeakControl$StatementRunner.run(ThreadLeakControl.java:365)
	at com.carrotsearch.randomizedtesting.ThreadLeakControl.forkTimeoutingTask(ThreadLeakControl.java:798)
	at com.carrotsearch.randomizedtesting.ThreadLeakControl$3.evaluate(ThreadLeakControl.java:458)
	at com.carrotsearch.randomizedtesting.RandomizedRunner.runSingleTest(RandomizedRunner.java:836)
	at com.carrotsearch.randomizedtesting.RandomizedRunner$3.evaluate(RandomizedRunner.java:738)
	at com.carrotsearch.randomizedtesting.RandomizedRunner$4.evaluate(RandomizedRunner.java:772)
	at com.carrotsearch.randomizedtesting.RandomizedRunner$5.evaluate(RandomizedRunner.java:783)
	at com.carrotsearch.randomizedtesting.rules.StatementAdapter.evaluate(StatementAdapter.java:36)
	at com.carrotsearch.randomizedtesting.rules.SystemPropertiesRestoreRule$1.evaluate(SystemPropertiesRestoreRule.java:53)
	at org.apache.lucene.util.AbstractBeforeAfterRule$1.evaluate(AbstractBeforeAfterRule.java:46)
	at org.apache.lucene.util.TestRuleStoreClassName$1.evaluate(TestRuleStoreClassName.java:42)
	at com.carrotsearch.randomizedtesting.rules.SystemPropertiesInvariantRule$1.evaluate(SystemPropertiesInvariantRule.java:55)
	at com.carrotsearch.randomizedtesting.rules.NoShadowingOrOverridesOnMethodsRule$1.evaluate(NoShadowingOrOverridesOnMethodsRule.java:39)
	at com.carrotsearch.randomizedtesting.rules.NoShadowingOrOverridesOnMethodsRule$1.evaluate(NoShadowingOrOverridesOnMethodsRule.java:39)
	at com.carrotsearch.randomizedtesting.rules.StatementAdapter.evaluate(StatementAdapter.java:36)
	at com.carrotsearch.randomizedtesting.rules.StatementAdapter.evaluate(StatementAdapter.java:36)
	at com.carrotsearch.randomizedtesting.rules.StatementAdapter.evaluate(StatementAdapter.java:36)
	at org.apache.lucene.util.TestRuleAssertionsRequired$1.evaluate(TestRuleAssertionsRequired.java:43)
	at org.apache.lucene.util.TestRuleMarkFailure$1.evaluate(TestRuleMarkFailure.java:48)
	at org.apache.lucene.util.TestRuleIgnoreAfterMaxFailures$1.evaluate(TestRuleIgnoreAfterMaxFailures.java:65)
	at org.apache.lucene.util.TestRuleIgnoreTestSuites$1.evaluate(TestRuleIgnoreTestSuites.java:55)
	at com.carrotsearch.randomizedtesting.rules.StatementAdapter.evaluate(StatementAdapter.java:36)
	at com.carrotsearch.randomizedtesting.ThreadLeakControl$StatementRunner.run(ThreadLeakControl.java:365)
	at java.lang.Thread.run(Thread.java:745)




Build Log:
[...truncated 11086 lines...]
   [junit4] Suite: org.apache.solr.cloud.CollectionsAPIDistributedZkTest
   [junit4]   2> Creating dataDir: /mnt/ssd/jenkins/workspace/Lucene-Solr-trunk-Linux/solr/build/solr-core/test/J1/temp/solr.cloud.CollectionsAPIDistributedZkTest-3C8147AC723F39AB-001/init-core-data-001
   [junit4]   2> 361081 T990 oas.SolrTestCaseJ4.buildSSLConfig Randomized ssl (true) and clientAuth (false)
   [junit4]   2> 361081 T990 oas.BaseDistributedSearchTestCase.initHostContext Setting hostContext system property: /n_/c
   [junit4]   2> 361084 T990 oas.SolrTestCaseJ4.setUp ###Starting testDistribSearch
   [junit4]   2> 361084 T990 oasc.ZkTestServer.run STARTING ZK TEST SERVER
   [junit4]   1> client port:0.0.0.0/0.0.0.0:0
   [junit4]   2> 361085 T991 oasc.ZkTestServer$ZKServerMain.runFromConfig Starting server
   [junit4]   2> 361185 T990 oasc.ZkTestServer.run start zk server on port:56209
   [junit4]   2> 361185 T990 oascc.SolrZkClient.createZkCredentialsToAddAutomatically Using default ZkCredentialsProvider
   [junit4]   2> 361186 T990 oascc.ConnectionManager.waitForConnected Waiting for client to connect to ZooKeeper
   [junit4]   2> 361200 T997 oascc.ConnectionManager.process Watcher org.apache.solr.common.cloud.ConnectionManager@1517b563 name:ZooKeeperConnection Watcher:127.0.0.1:56209 got event WatchedEvent state:SyncConnected type:None path:null path:null type:None
   [junit4]   2> 361201 T990 oascc.ConnectionManager.waitForConnected Client is connected to ZooKeeper
   [junit4]   2> 361201 T990 oascc.SolrZkClient.createZkACLProvider Using default ZkACLProvider
   [junit4]   2> 361201 T990 oascc.SolrZkClient.makePath makePath: /solr
   [junit4]   2> 361203 T990 oascc.SolrZkClient.createZkCredentialsToAddAutomatically Using default ZkCredentialsProvider
   [junit4]   2> 361223 T990 oascc.ConnectionManager.waitForConnected Waiting for client to connect to ZooKeeper
   [junit4]   2> 361228 T999 oascc.ConnectionManager.process Watcher org.apache.solr.common.cloud.ConnectionManager@50612f00 name:ZooKeeperConnection Watcher:127.0.0.1:56209/solr got event WatchedEvent state:SyncConnected type:None path:null path:null type:None
   [junit4]   2> 361229 T990 oascc.ConnectionManager.waitForConnected Client is connected to ZooKeeper
   [junit4]   2> 361229 T990 oascc.SolrZkClient.createZkACLProvider Using default ZkACLProvider
   [junit4]   2> 361229 T990 oascc.SolrZkClient.makePath makePath: /collections/collection1
   [junit4]   2> 361232 T990 oascc.SolrZkClient.makePath makePath: /collections/collection1/shards
   [junit4]   2> 361233 T990 oascc.SolrZkClient.makePath makePath: /collections/control_collection
   [junit4]   2> 361237 T990 oascc.SolrZkClient.makePath makePath: /collections/control_collection/shards
   [junit4]   2> 361238 T990 oasc.AbstractZkTestCase.putConfig put /mnt/ssd/jenkins/workspace/Lucene-Solr-trunk-Linux/solr/core/src/test-files/solr/collection1/conf/solrconfig-tlog.xml to /configs/conf1/solrconfig.xml
   [junit4]   2> 361239 T990 oascc.SolrZkClient.makePath makePath: /configs/conf1/solrconfig.xml
   [junit4]   2> 361241 T990 oasc.AbstractZkTestCase.putConfig put /mnt/ssd/jenkins/workspace/Lucene-Solr-trunk-Linux/solr/core/src/test-files/solr/collection1/conf/schema.xml to /configs/conf1/schema.xml
   [junit4]   2> 361241 T990 oascc.SolrZkClient.makePath makePath: /configs/conf1/schema.xml
   [junit4]   2> 361242 T990 oasc.AbstractZkTestCase.putConfig put /mnt/ssd/jenkins/workspace/Lucene-Solr-trunk-Linux/solr/core/src/test-files/solr/collection1/conf/solrconfig.snippet.randomindexconfig.xml to /configs/conf1/solrconfig.snippet.randomindexconfig.xml
   [junit4]   2> 361243 T990 oascc.SolrZkClient.makePath makePath: /configs/conf1/solrconfig.snippet.randomindexconfig.xml
   [junit4]   2> 361244 T990 oasc.AbstractZkTestCase.putConfig put /mnt/ssd/jenkins/workspace/Lucene-Solr-trunk-Linux/solr/core/src/test-files/solr/collection1/conf/stopwords.txt to /configs/conf1/stopwords.txt
   [junit4]   2> 361244 T990 oascc.SolrZkClient.makePath makePath: /configs/conf1/stopwords.txt
   [junit4]   2> 361245 T990 oasc.AbstractZkTestCase.putConfig put /mnt/ssd/jenkins/workspace/Lucene-Solr-trunk-Linux/solr/core/src/test-files/solr/collection1/conf/protwords.txt to /configs/conf1/protwords.txt
   [junit4]   2> 361246 T990 oascc.SolrZkClient.makePath makePath: /configs/conf1/protwords.txt
   [junit4]   2> 361247 T990 oasc.AbstractZkTestCase.putConfig put /mnt/ssd/jenkins/workspace/Lucene-Solr-trunk-Linux/solr/core/src/test-files/solr/collection1/conf/currency.xml to /configs/conf1/currency.xml
   [junit4]   2> 361247 T990 oascc.SolrZkClient.makePath makePath: /configs/conf1/currency.xml
   [junit4]   2> 361249 T990 oasc.AbstractZkTestCase.putConfig put /mnt/ssd/jenkins/workspace/Lucene-Solr-trunk-Linux/solr/core/src/test-files/solr/collection1/conf/enumsConfig.xml to /configs/conf1/enumsConfig.xml
   [junit4]   2> 361249 T990 oascc.SolrZkClient.makePath makePath: /configs/conf1/enumsConfig.xml
   [junit4]   2> 361250 T990 oasc.AbstractZkTestCase.putConfig put /mnt/ssd/jenkins/workspace/Lucene-Solr-trunk-Linux/solr/core/src/test-files/solr/collection1/conf/open-exchange-rates.json to /configs/conf1/open-exchange-rates.json
   [junit4]   2> 361251 T990 oascc.SolrZkClient.makePath makePath: /configs/conf1/open-exchange-rates.json
   [junit4]   2> 361252 T990 oasc.AbstractZkTestCase.putConfig put /mnt/ssd/jenkins/workspace/Lucene-Solr-trunk-Linux/solr/core/src/test-files/solr/collection1/conf/mapping-ISOLatin1Accent.txt to /configs/conf1/mapping-ISOLatin1Accent.txt
   [junit4]   2> 361253 T990 oascc.SolrZkClient.makePath makePath: /configs/conf1/mapping-ISOLatin1Accent.txt
   [junit4]   2> 361254 T990 oasc.AbstractZkTestCase.putConfig put /mnt/ssd/jenkins/workspace/Lucene-Solr-trunk-Linux/solr/core/src/test-files/solr/collection1/conf/old_synonyms.txt to /configs/conf1/old_synonyms.txt
   [junit4]   2> 361255 T990 oascc.SolrZkClient.makePath makePath: /configs/conf1/old_synonyms.txt
   [junit4]   2> 361256 T990 oasc.AbstractZkTestCase.putConfig put /mnt/ssd/jenkins/workspace/Lucene-Solr-trunk-Linux/solr/core/src/test-files/solr/collection1/conf/synonyms.txt to /configs/conf1/synonyms.txt
   [junit4]   2> 361256 T990 oascc.SolrZkClient.makePath makePath: /configs/conf1/synonyms.txt
   [junit4]   2> 361259 T990 oascc.SolrZkClient.createZkCredentialsToAddAutomatically Using default ZkCredentialsProvider
   [junit4]   2> 361275 T990 oascc.ConnectionManager.waitForConnected Waiting for client to connect to ZooKeeper
   [junit4]   2> 361279 T1001 oascc.ConnectionManager.process Watcher org.apache.solr.common.cloud.ConnectionManager@3567a44b name:ZooKeeperConnection Watcher:127.0.0.1:56209/solr got event WatchedEvent state:SyncConnected type:None path:null path:null type:None
   [junit4]   2> 361279 T990 oascc.ConnectionManager.waitForConnected Client is connected to ZooKeeper
   [junit4]   2> 361279 T990 oascc.SolrZkClient.createZkACLProvider Using default ZkACLProvider
   [junit4]   2> Using old style solr.xml
   [junit4]   2> 361696 T990 oejs.Server.doStart jetty-8.1.10.v20130312
   [junit4]   2> 361717 T990 oejus.SslContextFactory.doStart Enabled Protocols [SSLv2Hello, SSLv3, TLSv1, TLSv1.1, TLSv1.2] of [SSLv2Hello, SSLv3, TLSv1, TLSv1.1, TLSv1.2]
   [junit4]   2> 361722 T990 oejs.AbstractConnector.doStart Started SslSelectChannelConnector@127.0.0.1:56608
   [junit4]   2> 361724 T990 oass.SolrDispatchFilter.init SolrDispatchFilter.init()
   [junit4]   2> 361724 T990 oasc.SolrResourceLoader.locateSolrHome JNDI not configured for solr (NoInitialContextEx)
   [junit4]   2> 361725 T990 oasc.SolrResourceLoader.locateSolrHome using system property solr.solr.home: /mnt/ssd/jenkins/workspace/Lucene-Solr-trunk-Linux/solr/build/solr-core/test/J1/temp/solr.cloud.CollectionsAPIDistributedZkTest-3C8147AC723F39AB-001/tempDir-002
   [junit4]   2> 361725 T990 oasc.SolrResourceLoader.<init> new SolrResourceLoader for directory: '/mnt/ssd/jenkins/workspace/Lucene-Solr-trunk-Linux/solr/build/solr-core/test/J1/temp/solr.cloud.CollectionsAPIDistributedZkTest-3C8147AC723F39AB-001/tempDir-002/'
   [junit4]   2> 361741 T990 oasc.ConfigSolr.fromFile Loading container configuration from /mnt/ssd/jenkins/workspace/Lucene-Solr-trunk-Linux/solr/build/solr-core/test/J1/temp/solr.cloud.CollectionsAPIDistributedZkTest-3C8147AC723F39AB-001/tempDir-002/solr.xml
   [junit4]   2> 361752 T990 oasc.CoreContainer.<init> New CoreContainer 2033583961
   [junit4]   2> 361752 T990 oasc.CoreContainer.load Loading cores into CoreContainer [instanceDir=/mnt/ssd/jenkins/workspace/Lucene-Solr-trunk-Linux/solr/build/solr-core/test/J1/temp/solr.cloud.CollectionsAPIDistributedZkTest-3C8147AC723F39AB-001/tempDir-002/]
   [junit4]   2> 361753 T990 oashc.HttpShardHandlerFactory.getParameter Setting socketTimeout to: 120000
   [junit4]   2> 361753 T990 oashc.HttpShardHandlerFactory.getParameter Setting urlScheme to: null
   [junit4]   2> 361754 T990 oashc.HttpShardHandlerFactory.getParameter Setting connTimeout to: 15000
   [junit4]   2> 361754 T990 oashc.HttpShardHandlerFactory.getParameter Setting maxConnectionsPerHost to: 20
   [junit4]   2> 361754 T990 oashc.HttpShardHandlerFactory.getParameter Setting maxConnections to: 10000
   [junit4]   2> 361754 T990 oashc.HttpShardHandlerFactory.getParameter Setting corePoolSize to: 0
   [junit4]   2> 361755 T990 oashc.HttpShardHandlerFactory.getParameter Setting maximumPoolSize to: 2147483647
   [junit4]   2> 361755 T990 oashc.HttpShardHandlerFactory.getParameter Setting maxThreadIdleTime to: 5
   [junit4]   2> 361755 T990 oashc.HttpShardHandlerFactory.getParameter Setting sizeOfQueue to: -1
   [junit4]   2> 361764 T990 oashc.HttpShardHandlerFactory.getParameter Setting fairnessPolicy to: false
   [junit4]   2> 361767 T990 oasu.UpdateShardHandler.<init> Creating UpdateShardHandler HTTP client with params: socketTimeout=3400000&connTimeout=45000&retry=false
   [junit4]   2> 361769 T990 oasl.LogWatcher.createWatcher SLF4J impl is org.slf4j.impl.Log4jLoggerFactory
   [junit4]   2> 361769 T990 oasl.LogWatcher.newRegisteredLogWatcher Registering Log Listener [Log4j (org.slf4j.impl.Log4jLoggerFactory)]
   [junit4]   2> 361769 T990 oasc.CoreContainer.load Host Name: 127.0.0.1
   [junit4]   2> 361770 T990 oasc.ZkContainer.initZooKeeper Zookeeper client=127.0.0.1:56209/solr
   [junit4]   2> 361770 T990 oasc.ZkController.checkChrootPath zkHost includes chroot
   [junit4]   2> 361770 T990 oascc.SolrZkClient.createZkCredentialsToAddAutomatically Using default ZkCredentialsProvider
   [junit4]   2> 361776 T990 oascc.ConnectionManager.waitForConnected Waiting for client to connect to ZooKeeper
   [junit4]   2> 361788 T1012 oascc.ConnectionManager.process Watcher org.apache.solr.common.cloud.ConnectionManager@4b79579e name:ZooKeeperConnection Watcher:127.0.0.1:56209 got event WatchedEvent state:SyncConnected type:None path:null path:null type:None
   [junit4]   2> 361789 T990 oascc.ConnectionManager.waitForConnected Client is connected to ZooKeeper
   [junit4]   2> 361790 T990 oascc.SolrZkClient.createZkACLProvider Using default ZkACLProvider
   [junit4]   2> 361828 T990 oascc.ConnectionManager.waitForConnected Waiting for client to connect to ZooKeeper
   [junit4]   2> 361836 T1014 oascc.ConnectionManager.process Watcher org.apache.solr.common.cloud.ConnectionManager@4e69236a name:ZooKeeperConnection Watcher:127.0.0.1:56209/solr got event WatchedEvent state:SyncConnected type:None path:null path:null type:None
   [junit4]   2> 361836 T990 oascc.ConnectionManager.waitForConnected Client is connected to ZooKeeper
   [junit4]   2> 361837 T990 oascc.SolrZkClient.makePath makePath: /overseer/queue
   [junit4]   2> 361839 T990 oascc.SolrZkClient.makePath makePath: /overseer/collection-queue-work
   [junit4]   2> 361842 T990 oascc.SolrZkClient.makePath makePath: /overseer/collection-map-running
   [junit4]   2> 361843 T990 oascc.SolrZkClient.makePath makePath: /overseer/collection-map-completed
   [junit4]   2> 361845 T990 oascc.SolrZkClient.makePath makePath: /overseer/collection-map-failure
   [junit4]   2> 361848 T990 oascc.SolrZkClient.makePath makePath: /live_nodes
   [junit4]   2> 361849 T990 oasc.ZkController.createEphemeralLiveNode Register node as live in ZooKeeper:/live_nodes/127.0.0.1:56608_n_%2Fc
   [junit4]   2> 361850 T990 oascc.SolrZkClient.makePath makePath: /live_nodes/127.0.0.1:56608_n_%2Fc
   [junit4]   2> 361851 T990 oascc.SolrZkClient.makePath makePath: /overseer_elect
   [junit4]   2> 361853 T990 oascc.SolrZkClient.makePath makePath: /overseer_elect/election
   [junit4]   2> 361854 T990 oasc.Overseer.close Overseer (id=null) closing
   [junit4]   2> 361855 T990 oasc.OverseerElectionContext.runLeaderProcess I am going to be the leader 127.0.0.1:56608_n_%2Fc
   [junit4]   2> 361855 T990 oascc.SolrZkClient.makePath makePath: /overseer_elect/leader
   [junit4]   2> 361856 T990 oasc.Overseer.start Overseer (id=92640548012228612-127.0.0.1:56608_n_%2Fc-n_0000000000) starting
   [junit4]   2> 361858 T990 oascc.SolrZkClient.makePath makePath: /overseer/queue-work
   [junit4]   2> 361863 T990 oasc.OverseerAutoReplicaFailoverThread.<init> Starting OverseerAutoReplicaFailoverThread autoReplicaFailoverWorkLoopDelay=10000 autoReplicaFailoverWaitAfterExpiration=30000 autoReplicaFailoverBadNodeExpiration=60000
   [junit4]   2> 361863 T1016 oasc.OverseerCollectionProcessor.run Process current queue of collection creations
   [junit4]   2> 361864 T990 oascc.SolrZkClient.makePath makePath: /clusterstate.json
   [junit4]   2> 361869 T990 oascc.SolrZkClient.makePath makePath: /aliases.json
   [junit4]   2> 361871 T990 oascc.ZkStateReader.createClusterStateWatchersAndUpdate Updating cluster state from ZooKeeper... 
   [junit4]   2> 361874 T1015 oasc.Overseer$ClusterStateUpdater.run Starting to work on the main queue
   [junit4]   2> 361875 T990 oass.SolrDispatchFilter.init user.dir=/mnt/ssd/jenkins/workspace/Lucene-Solr-trunk-Linux/solr/build/solr-core/test/J1
   [junit4]   2> 361876 T990 oass.SolrDispatchFilter.init SolrDispatchFilter.init() done
   [junit4]   2> 361886 T990 oascc.SolrZkClient.createZkCredentialsToAddAutomatically Using default ZkCredentialsProvider
   [junit4]   2> 361914 T990 oascc.ConnectionManager.waitForConnected Waiting for client to connect to ZooKeeper
   [junit4]   2> 361916 T1020 oascc.ConnectionManager.process Watcher org.apache.solr.common.cloud.ConnectionManager@f2ac74e name:ZooKeeperConnection Watcher:127.0.0.1:56209/solr got event WatchedEvent state:SyncConnected type:None path:null path:null type:None
   [junit4]   2> 361916 T990 oascc.ConnectionManager.waitForConnected Client is connected to ZooKeeper
   [junit4]   2> 361917 T990 oascc.SolrZkClient.createZkACLProvider Using default ZkACLProvider
   [junit4]   2> 361918 T990 oascc.ZkStateReader.createClusterStateWatchersAndUpdate Updating cluster state from ZooKeeper... 
   [junit4]   2> 361920 T990 oasc.ChaosMonkey.monkeyLog monkey: init - expire sessions:false cause connection loss:false
   [junit4]   2> 361921 T990 oasc.AbstractFullDistribZkTestBase.createJettys Creating collection1 with stateFormat=2
   [junit4]   2> 361921 T990 oascc.SolrZkClient.createZkCredentialsToAddAutomatically Using default ZkCredentialsProvider
   [junit4]   2> 361923 T990 oascc.ConnectionManager.waitForConnected Waiting for client to connect to ZooKeeper
   [junit4]   2> 361938 T1022 oascc.ConnectionManager.process Watcher org.apache.solr.common.cloud.ConnectionManager@3da36c25 name:ZooKeeperConnection Watcher:127.0.0.1:56209/solr got event WatchedEvent state:SyncConnected type:None path:null path:null type:None
   [junit4]   2> 361938 T990 oascc.ConnectionManager.waitForConnected Client is connected to ZooKeeper
   [junit4]   2> 361938 T990 oascc.SolrZkClient.createZkACLProvider Using default ZkACLProvider
   [junit4]   2> 361941 T1023 oasc.DistributedQueue$LatchChildWatcher.process LatchChildWatcher fired on path: /overseer/queue state: SyncConnected type NodeChildrenChanged
   [junit4]   2> 361945 T1015 oasc.Overseer$ClusterStateUpdater.buildCollection building a new collection: collection1
   [junit4]   2> 361946 T1015 oasc.Overseer$ClusterStateUpdater.createCollection Create collection collection1 with shards [shard1, shard2]
   [junit4]   2> 361946 T1015 oasc.Overseer$ClusterStateUpdater.createCollection state version collection1 2
   [junit4]   2> 361948 T1015 oasc.Overseer$ClusterStateUpdater.updateZkStates going to create_collection /collections/collection1/state.json
   [junit4]   2> 361949 T1023 oascc.ZkStateReader$2.process A cluster state change: WatchedEvent state:SyncConnected type:NodeDataChanged path:/clusterstate.json, has occurred - updating... (live nodes size: 1)
   [junit4]   2> 361950 T1024 oascc.ZkStateReader$2.process A cluster state change: WatchedEvent state:SyncConnected type:NodeDataChanged path:/clusterstate.json, has occurred - updating... (live nodes size: 1)
   [junit4]   2> 362339 T990 oasc.AbstractFullDistribZkTestBase.createJettys create jetty 1
   [junit4]   2> 362339 T990 oejs.Server.doStart jetty-8.1.10.v20130312
   [junit4]   2> 362342 T990 oejus.SslContextFactory.doStart Enabled Protocols [SSLv2Hello, SSLv3, TLSv1, TLSv1.1, TLSv1.2] of [SSLv2Hello, SSLv3, TLSv1, TLSv1.1, TLSv1.2]
   [junit4]   2> 362344 T990 oejs.AbstractConnector.doStart Started SslSelectChannelConnector@127.0.0.1:52043
   [junit4]   2> 362348 T990 oass.SolrDispatchFilter.init SolrDispatchFilter.init()
   [junit4]   2> 362349 T990 oasc.SolrResourceLoader.locateSolrHome JNDI not configured for solr (NoInitialContextEx)
   [junit4]   2> 362349 T990 oasc.SolrResourceLoader.locateSolrHome using system property solr.solr.home: /mnt/ssd/jenkins/workspace/Lucene-Solr-trunk-Linux/solr/build/solr-core/test/J1/temp/solr.cloud.CollectionsAPIDistributedZkTest-3C8147AC723F39AB-001/tempDir-003
   [junit4]   2> 362349 T990 oasc.SolrResourceLoader.<init> new SolrResourceLoader for directory: '/mnt/ssd/jenkins/workspace/Lucene-Solr-trunk-Linux/solr/build/solr-core/test/J1/temp/solr.cloud.CollectionsAPIDistributedZkTest-3C8147AC723F39AB-001/tempDir-003/'
   [junit4]   2> 362375 T990 oasc.ConfigSolr.fromFile Loading container configuration from /mnt/ssd/jenkins/workspace/Lucene-Solr-trunk-Linux/solr/build/solr-core/test/J1/temp/solr.cloud.CollectionsAPIDistributedZkTest-3C8147AC723F39AB-001/tempDir-003/solr.xml
   [junit4]   2> 362405 T990 oasc.CoreContainer.<init> New CoreContainer 863888406
   [junit4]   2> 362406 T990 oasc.CoreContainer.load Loading cores into CoreContainer [instanceDir=/mnt/ssd/jenkins/workspace/Lucene-Solr-trunk-Linux/solr/build/solr-core/test/J1/temp/solr.cloud.CollectionsAPIDistributedZkTest-3C8147AC723F39AB-001/tempDir-003/]
   [junit4]   2> 362406 T990 oashc.HttpShardHandlerFactory.getParameter Setting socketTimeout to: 120000
   [junit4]   2> 362406 T990 oashc.HttpShardHandlerFactory.getParameter Setting urlScheme to: null
   [junit4]   2> 362407 T990 oashc.HttpShardHandlerFactory.getParameter Setting connTimeout to: 15000
   [junit4]   2> 362407 T990 oashc.HttpShardHandlerFactory.getParameter Setting maxConnectionsPerHost to: 20
   [junit4]   2> 362407 T990 oashc.HttpShardHandlerFactory.getParameter Setting maxConnections to: 10000
   [junit4]   2> 362408 T990 oashc.HttpShardHandlerFactory.getParameter Setting corePoolSize to: 0
   [junit4]   2> 362408 T990 oashc.HttpShardHandlerFactory.getParameter Setting maximumPoolSize to: 2147483647
   [junit4]   2> 362410 T990 oashc.HttpShardHandlerFactory.getParameter Setting maxThreadIdleTime to: 5
   [junit4]   2> 362410 T990 oashc.HttpShardHandlerFactory.getParameter Setting sizeOfQueue to: -1
   [junit4]   2> 362410 T990 oashc.HttpShardHandlerFactory.getParameter Setting fairnessPolicy to: false
   [junit4]   2> 362412 T990 oasu.UpdateShardHandler.<init> Creating UpdateShardHandler HTTP client with params: socketTimeout=3400000&connTimeout=45000&retry=false
   [junit4]   2> 362414 T990 oasl.LogWatcher.createWatcher SLF4J impl is org.slf4j.impl.Log4jLoggerFactory
   [junit4]   2> 362415 T990 oasl.LogWatcher.newRegisteredLogWatcher Registering Log Listener [Log4j (org.slf4j.impl.Log4jLoggerFactory)]
   [junit4]   2> 362415 T990 oasc.CoreContainer.load Host Name: 127.0.0.1
   [junit4]   2> 362416 T990 oasc.ZkContainer.initZooKeeper Zookeeper client=127.0.0.1:56209/solr
   [junit4]   2> 362416 T990 oasc.ZkController.checkChrootPath zkHost includes chroot
   [junit4]   2> 362416 T990 oascc.SolrZkClient.createZkCredentialsToAddAutomatically Using default ZkCredentialsProvider
   [junit4]   2> 362448 T990 oascc.ConnectionManager.waitForConnected Waiting for client to connect to ZooKeeper
   [junit4]   2> 362454 T1035 oascc.ConnectionManager.process Watcher org.apache.solr.common.cloud.ConnectionManager@e84244e name:ZooKeeperConnection Watcher:127.0.0.1:56209 got event WatchedEvent state:SyncConnected type:None path:null path:null type:None
   [junit4]   2> 362455 T990 oascc.ConnectionManager.waitForConnected Client is connected to ZooKeeper
   [junit4]   2> 362455 T990 oascc.SolrZkClient.createZkACLProvider Using default ZkACLProvider
   [junit4]   2> 362475 T990 oascc.ConnectionManager.waitForConnected Waiting for client to connect to ZooKeeper
   [junit4]   2> 362477 T1037 oascc.ConnectionManager.process Watcher org.apache.solr.common.cloud.ConnectionManager@61f40ac7 name:ZooKeeperConnection Watcher:127.0.0.1:56209/solr got event WatchedEvent state:SyncConnected type:None path:null path:null type:None
   [junit4]   2> 362477 T990 oascc.ConnectionManager.waitForConnected Client is connected to ZooKeeper
   [junit4]   2> 362482 T990 oascc.ZkStateReader.createClusterStateWatchersAndUpdate Updating cluster state from ZooKeeper... 
   [junit4]   2> 363485 T990 oasc.ZkController.createEphemeralLiveNode Register node as live in ZooKeeper:/live_nodes/127.0.0.1:52043_n_%2Fc
   [junit4]   2> 363486 T990 oascc.SolrZkClient.makePath makePath: /live_nodes/127.0.0.1:52043_n_%2Fc
   [junit4]   2> 363489 T990 oasc.Overseer.close Overseer (id=null) closing
   [junit4]   2> 363492 T990 oass.SolrDispatchFilter.init user.dir=/mnt/ssd/jenkins/workspace/Lucene-Solr-trunk-Linux/solr/build/solr-core/test/J1
   [junit4]   2> 363492 T990 oass.SolrDispatchFilter.init SolrDispatchFilter.init() done
   [junit4]   2> 363856 T990 oasc.AbstractFullDistribZkTestBase.createJettys create jetty 2
   [junit4]   2> 363857 T990 oejs.Server.doStart jetty-8.1.10.v20130312
   [junit4]   2> 363893 T990 oejus.SslContextFactory.doStart Enabled Protocols [SSLv2Hello, SSLv3, TLSv1, TLSv1.1, TLSv1.2] of [SSLv2Hello, SSLv3, TLSv1, TLSv1.1, TLSv1.2]
   [junit4]   2> 363904 T990 oejs.AbstractConnector.doStart Started SslSelectChannelConnector@127.0.0.1:59894
   [junit4]   2> 363909 T990 oass.SolrDispatchFilter.init SolrDispatchFilter.init()
   [junit4]   2> 363910 T990 oasc.SolrResourceLoader.locateSolrHome JNDI not configured for solr (NoInitialContextEx)
   [junit4]   2> 363910 T990 oasc.SolrResourceLoader.locateSolrHome using system property solr.solr.home: ../../../../../../../../../../mnt/ssd/jenkins/workspace/Lucene-Solr-trunk-Linux/solr/build/solr-core/test/J1/temp/solr.cloud.CollectionsAPIDistributedZkTest-3C8147AC723F39AB-001/tempDir-004
   [junit4]   2> 363910 T990 oasc.SolrResourceLoader.<init> new SolrResourceLoader for directory: '../../../../../../../../../../mnt/ssd/jenkins/workspace/Lucene-Solr-trunk-Linux/solr/build/solr-core/test/J1/temp/solr.cloud.CollectionsAPIDistributedZkTest-3C8147AC723F39AB-001/tempDir-004/'
   [junit4]   2> 363938 T990 oasc.ConfigSolr.fromFile Loading container configuration from /mnt/ssd/jenkins/workspace/Lucene-Solr-trunk-Linux/solr/build/solr-core/test/J1/../../../../../../../../../../mnt/ssd/jenkins/workspace/Lucene-Solr-trunk-Linux/solr/build/solr-core/test/J1/temp/solr.cloud.CollectionsAPIDistributedZkTest-3C8147AC723F39AB-001/tempDir-004/solr.xml
   [junit4]   2> 363994 T990 oasc.CoreContainer.<init> New CoreContainer 1046698586
   [junit4]   2> 363995 T990 oasc.CoreContainer.load Loading cores into CoreContainer [instanceDir=../../../../../../../../../../mnt/ssd/jenkins/workspace/Lucene-Solr-trunk-Linux/solr/build/solr-core/test/J1/temp/solr.cloud.CollectionsAPIDistributedZkTest-3C8147AC723F39AB-001/tempDir-004/]
   [junit4]   2> 363995 T990 oashc.HttpShardHandlerFactory.getParameter Setting socketTimeout to: 120000
   [junit4]   2> 363996 T990 oashc.HttpShardHandlerFactory.getParameter Setting urlScheme to: null
   [junit4]   2> 363996 T990 oashc.HttpShardHandlerFactory.getParameter Setting connTimeout to: 15000
   [junit4]   2> 363996 T990 oashc.HttpShardHandlerFactory.getParameter Setting maxConnectionsPerHost to: 20
   [junit4]   2> 363997 T990 oashc.HttpShardHandlerFactory.getParameter Setting maxConnections to: 10000
   [junit4]   2> 363997 T990 oashc.HttpShardHandlerFactory.getParameter Setting corePoolSize to: 0
   [junit4]   2> 363997 T990 oashc.HttpShardHandlerFactory.getParameter Setting maximumPoolSize to: 2147483647
   [junit4]   2> 363998 T990 oashc.HttpShardHandlerFactory.getParameter Setting maxThreadIdleTime to: 5
   [junit4]   2> 363998 T990 oashc.HttpShardHandlerFactory.getParameter Setting sizeOfQueue to: -1
   [junit4]   2> 363998 T990 oashc.HttpShardHandlerFactory.getParameter Setting fairnessPolicy to: false
   [junit4]   2> 364000 T990 oasu.UpdateShardHandler.<init> Creating UpdateShardHandler HTTP client with params: socketTimeout=3400000&connTimeout=45000&retry=false
   [junit4]   2> 364001 T990 oasl.LogWatcher.createWatcher SLF4J impl is org.slf4j.impl.Log4jLoggerFactory
   [junit4]   2> 364001 T990 oasl.LogWatcher.newRegisteredLogWatcher Registering Log Listener [Log4j (org.slf4j.impl.Log4jLoggerFactory)]
   [junit4]   2> 364002 T990 oasc.CoreContainer.load Host Name: 127.0.0.1
   [junit4]   2> 364002 T990 oasc.ZkContainer.initZooKeeper Zookeeper client=127.0.0.1:56209/solr
   [junit4]   2> 364002 T990 oasc.ZkController.checkChrootPath zkHost includes chroot
   [junit4]   2> 364003 T990 oascc.SolrZkClient.createZkCredentialsToAddAutomatically Using default ZkCredentialsProvider
   [junit4]   2> 364003 T990 oascc.ConnectionManager.waitForConnected Waiting for client to connect to ZooKeeper
   [junit4]   2> 364006 T1050 oascc.ConnectionManager.process Watcher org.apache.solr.common.cloud.ConnectionManager@74aecb43 name:ZooKeeperConnection Watcher:127.0.0.1:56209 got event WatchedEvent state:SyncConnected type:None path:null path:null type:None
   [junit4]   2> 364007 T990 oascc.ConnectionManager.waitForConnected Client is connected to ZooKeeper
   [junit4]   2> 364007 T990 oascc.SolrZkClient.createZkACLProvider Using default ZkACLProvider
   [junit4]   2> 364017 T990 oascc.ConnectionManager.waitForConnected Waiting for client to connect to ZooKeeper
   [junit4]   2> 364020 T1052 oascc.ConnectionManager.process Watcher org.apache.solr.common.cloud.ConnectionManager@6ccd0a6a name:ZooKeeperConnection Watcher:127.0.0.1:56209/solr got event WatchedEvent state:SyncConnected type:None path:null path:null type:None
   [junit4]   2> 364020 T990 oascc.ConnectionManager.waitForConnected Client is connected to ZooKeeper
   [junit4]   2> 364024 T990 oascc.ZkStateReader.createClusterStateWatchersAndUpdate Updating cluster state from ZooKeeper... 
   [junit4]   2> 365030 T990 oasc.ZkController.createEphemeralLiveNode Register node as live in ZooKeeper:/live_nodes/127.0.0.1:59894_n_%2Fc
   [junit4]   2> 365031 T990 oascc.SolrZkClient.makePath makePath: /live_nodes/127.0.0.1:59894_n_%2Fc
   [junit4]   2> 365033 T990 oasc.Overseer.close Overseer (id=null) closing
   [junit4]   2> 365042 T990 oass.SolrDispatchFilter.init user.dir=/mnt/ssd/jenkins/workspace/Lucene-Solr-trunk-Linux/solr/build/solr-core/test/J1
   [junit4]   2> 365045 T990 oass.SolrDispatchFilter.init SolrDispatchFilter.init() done
   [junit4]   2> 365468 T990 oasc.AbstractFullDistribZkTestBase.createJettys create jetty 3
   [junit4]   2> 365468 T990 oejs.Server.doStart jetty-8.1.10.v20130312
   [junit4]   2> 365471 T990 oejus.SslContextFactory.doStart Enabled Protocols [SSLv2Hello, SSLv3, TLSv1, TLSv1.1, TLSv1.2] of [SSLv2Hello, SSLv3, TLSv1, TLSv1.1, TLSv1.2]
   [junit4]   2> 365473 T990 oejs.AbstractConnector.doStart Started SslSelectChannelConnector@127.0.0.1:34996
   [junit4]   2> 365475 T990 oass.SolrDispatchFilter.init SolrDispatchFilter.init()
   [junit4]   2> 365476 T990 oasc.SolrResourceLoader.locateSolrHome JNDI not configured for solr (NoInitialContextEx)
   [junit4]   2> 365476 T990 oasc.SolrResourceLoader.locateSolrHome using system property solr.solr.home: ../../../../../../../../../../mnt/ssd/jenkins/workspace/Lucene-Solr-trunk-Linux/solr/build/solr-core/test/J1/temp/solr.cloud.CollectionsAPIDistributedZkTest-3C8147AC723F39AB-001/tempDir-005
   [junit4]   2> 365476 T990 oasc.SolrResourceLoader.<init> new SolrResourceLoader for directory: '../../../../../../../../../../mnt/ssd/jenkins/workspace/Lucene-Solr-trunk-Linux/solr/build/solr-core/test/J1/temp/solr.cloud.CollectionsAPIDistributedZkTest-3C8147AC723F39AB-001/tempDir-005/'
   [junit4]   2> 365493 T990 oasc.ConfigSolr.fromFile Loading container configuration from /mnt/ssd/jenkins/workspace/Lucene-Solr-trunk-Linux/solr/build/solr-core/test/J1/../../../../../../../../../../mnt/ssd/jenkins/workspace/Lucene-Solr-trunk-Linux/solr/build/solr-core/test/J1/temp/solr.cloud.CollectionsAPIDistributedZkTest-3C8147AC723F39AB-001/tempDir-005/solr.xml
   [junit4]   2> 365516 T990 oasc.CoreContainer.<init> New CoreContainer 951625275
   [junit4]   2> 365516 T990 oasc.CoreContainer.load Loading cores into CoreContainer [instanceDir=../../../../../../../../../../mnt/ssd/jenkins/workspace/Lucene-Solr-trunk-Linux/solr/build/solr-core/test/J1/temp/solr.cloud.CollectionsAPIDistributedZkTest-3C8147AC723F39AB-001/tempDir-005/]
   [junit4]   2> 365517 T990 oashc.HttpShardHandlerFactory.getParameter Setting socketTimeout to: 120000
   [junit4]   2> 365517 T990 oashc.HttpShardHandlerFactory.getParameter Setting urlScheme to: null
   [junit4]   2> 365518 T990 oashc.HttpShardHandlerFactory.getParameter Setting connTimeout to: 15000
   [junit4]   2> 365518 T990 oashc.HttpShardHandlerFactory.getParameter Setting maxConnectionsPerHost to: 20
   [junit4]   2> 365518 T990 oashc.HttpShardHandlerFactory.getParameter Setting maxConnections to: 10000
   [junit4]   2> 365518 T990 oashc.HttpShardHandlerFactory.getParameter Setting corePoolSize to: 0
   [junit4]   2> 365519 T990 oashc.HttpShardHandlerFactory.getParameter Setting maximumPoolSize to: 2147483647
   [junit4]   2> 365519 T990 oashc.HttpShardHandlerFactory.getParameter Setting maxThreadIdleTime to: 5
   [junit4]   2> 365519 T990 oashc.HttpShardHandlerFactory.getParameter Setting sizeOfQueue to: -1
   [junit4]   2> 365520 T990 oashc.HttpShardHandlerFactory.getParameter Setting fairnessPolicy to: false
   [junit4]   2> 365521 T990 oasu.UpdateShardHandler.<init> Creating UpdateShardHandler HTTP client with params: socketTimeout=3400000&connTimeout=45000&retry=false
   [junit4]   2> 365523 T990 oasl.LogWatcher.createWatcher SLF4J impl is org.slf4j.impl.Log4jLoggerFactory
   [junit4]   2> 365523 T990 oasl.LogWatcher.newRegisteredLogWatcher Registering Log Listener [Log4j (org.slf4j.impl.Log4jLoggerFactory)]
   [junit4]   2> 365523 T990 oasc.CoreContainer.load Host Name: 127.0.0.1
   [junit4]   2> 365524 T990 oasc.ZkContainer.initZooKeeper Zookeeper client=127.0.0.1:56209/solr
   [junit4]   2> 365524 T990 oasc.ZkController.checkChrootPath zkHost includes chroot
   [junit4]   2> 365524 T990 oascc.SolrZkClient.createZkCredentialsToAddAutomatically Using default ZkCredentialsProvider
   [junit4]   2> 365526 T990 oascc.ConnectionManager.waitForConnected Waiting for client to connect to ZooKeeper
   [junit4]   2> 365528 T1065 oascc.ConnectionManager.process Watcher org.apache.solr.common.cloud.ConnectionManager@4232b1cc name:ZooKeeperConnection Watcher:127.0.0.1:56209 got event WatchedEvent state:SyncConnected type:None path:null path:null type:None
   [junit4]   2> 365529 T990 oascc.ConnectionManager.waitForConnected Client is connected to ZooKeeper
   [junit4]   2> 365530 T990 oascc.SolrZkClient.createZkACLProvider Using default ZkACLProvider
   [junit4]   2> 365532 T990 oascc.ConnectionManager.waitForConnected Waiting for client to connect to ZooKeeper
   [junit4]   2> 365535 T1067 oascc.ConnectionManager.process Watcher org.apache.solr.common.cloud.ConnectionManager@27b90b6c name:ZooKeeperConnection Watcher:127.0.0.1:56209/solr got event WatchedEvent state:SyncConnected type:None path:null path:null type:None
   [junit4]   2> 365535 T990 oascc.ConnectionManager.waitForConnected Client is connected to ZooKeeper
   [junit4]   2> 365539 T990 oascc.ZkStateReader.createClusterStateWatchersAndUpdate Updating cluster state from ZooKeeper... 
   [junit4]   2> 366543 T990 oasc.ZkController.createEphemeralLiveNode Register node as live in ZooKeeper:/live_nodes/127.0.0.1:34996_n_%2Fc
   [junit4]   2> 366544 T990 oascc.SolrZkClient.makePath makePath: /live_nodes/127.0.0.1:34996_n_%2Fc
   [junit4]   2> 366547 T990 oasc.Overseer.close Overseer (id=null) closing
   [junit4]   2> 366549 T990 oass.SolrDispatchFilter.init user.dir=/mnt/ssd/jenkins/workspace/Lucene-Solr-trunk-Linux/solr/build/solr-core/test/J1
   [junit4]   2> 366549 T990 oass.SolrDispatchFilter.init SolrDispatchFilter.init() done
   [junit4]   2> 366787 T990 oasc.AbstractFullDistribZkTestBase.createJettys create jetty 4
   [junit4]   2> 366788 T990 oejs.Server.doStart jetty-8.1.10.v20130312
   [junit4]   2> 366790 T990 oejus.SslContextFactory.doStart Enabled Protocols [SSLv2Hello, SSLv3, TLSv1, TLSv1.1, TLSv1.2] of [SSLv2Hello, SSLv3, TLSv1, TLSv1.1, TLSv1.2]
   [junit4]   2> 366791 T990 oejs.AbstractConnector.doStart Started SslSelectChannelConnector@127.0.0.1:59899
   [junit4]   2> 366793 T990 oass.SolrDispatchFilter.init SolrDispatchFilter.init()
   [junit4]   2> 366793 T990 oasc.SolrResourceLoader.locateSolrHome JNDI not configured for solr (NoInitialContextEx)
   [junit4]   2> 366793 T990 oasc.SolrResourceLoader.locateSolrHome using system property solr.solr.home: ../../../../../../../../../../mnt/ssd/jenkins/workspace/Lucene-Solr-trunk-Linux/solr/build/solr-core/test/J1/temp/solr.cloud.CollectionsAPIDistributedZkTest-3C8147AC723F39AB-001/tempDir-006
   [junit4]   2> 366793 T990 oasc.SolrResourceLoader.<init> new SolrResourceLoader for directory: '../../../../../../../../../../mnt/ssd/jenkins/workspace/Lucene-Solr-trunk-Linux/solr/build/solr-core/test/J1/temp/solr.cloud.CollectionsAPIDistributedZkTest-3C8147AC723F39AB-001/tempDir-006/'
   [junit4]   2> 366803 T990 oasc.ConfigSolr.fromFile Loading container configuration from /mnt/ssd/jenkins/workspace/Lucene-Solr-trunk-Linux/solr/build/solr-core/test/J1/../../../../../../../../../../mnt/ssd/jenkins/workspace/Lucene-Solr-trunk-Linux/solr/build/solr-core/test/J1/temp/solr.cloud.CollectionsAPIDistributedZkTest-3C8147AC723F39AB-001/tempDir-006/solr.xml
   [junit4]   2> 366826 T990 oasc.CoreContainer.<init> New CoreContainer 483197927
   [junit4]   2> 366826 T990 oasc.CoreContainer.load Loading cores into CoreContainer [instanceDir=../../../../../../../../../../mnt/ssd/jenkins/workspace/Lucene-Solr-trunk-Linux/solr/build/solr-core/test/J1/temp/solr.cloud.CollectionsAPIDistributedZkTest-3C8147AC723F39AB-001/tempDir-006/]
   [junit4]   2> 366826 T990 oashc.HttpShardHandlerFactory.getParameter Setting socketTimeout to: 120000
   [junit4]   2> 366827 T990 oashc.HttpShardHandlerFactory.getParameter Setting urlScheme to: null
   [junit4]   2> 366827 T990 oashc.HttpShardHandlerFactory.getParameter Setting connTimeout to: 15000
   [junit4]   2> 366827 T990 oashc.HttpShardHandlerFactory.getParameter Setting maxConnectionsPerHost to: 20
   [junit4]   2> 366827 T990 oashc.HttpShardHandlerFactory.getParameter Setting maxConnections to: 10000
   [junit4]   2> 366827 T990 oashc.HttpShardHandlerFactory.getParameter Setting corePoolSize to: 0
   [junit4]   2> 366828 T990 oashc.HttpShardHandlerFactory.getParameter Setting maximumPoolSize to: 2147483647
   [junit4]   2> 366828 T990 oashc.HttpShardHandlerFactory.getParameter Setting maxThreadIdleTime to: 5
   [junit4]   2> 366828 T990 oashc.HttpShardHandlerFactory.getParameter Setting sizeOfQueue to: -1
   [junit4]   2> 366828 T990 oashc.HttpShardHandlerFactory.getParameter Setting fairnessPolicy to: false
   [junit4]   2> 366829 T990 oasu.UpdateShardHandler.<init> Creating UpdateShardHandler HTTP client with params: socketTimeout=3400000&connTimeout=45000&retry=false
   [junit4]   2> 366830 T990 oasl.LogWatcher.createWatcher SLF4J impl is org.slf4j.impl.Log4jLoggerFactory
   [junit4]   2> 366830 T990 oasl.LogWatcher.newRegisteredLogWatcher Registering Log Listener [Log4j (org.slf4j.impl.Log4jLoggerFactory)]
   [junit4]   2> 366831 T990 oasc.CoreContainer.load Host Name: 127.0.0.1
   [junit4]   2> 366831 T990 oasc.ZkContainer.initZooKeeper Zookeeper client=127.0.0.1:56209/solr
   [junit4]   2> 366831 T990 oasc.ZkController.checkChrootPath zkHost includes chroot
   [junit4]   2> 366831 T990 oascc.SolrZkClient.createZkCredentialsToAddAutomatically Using default ZkCredentialsProvider
   [junit4]   2> 366832 T990 oascc.ConnectionManager.waitForConnected Waiting for client to connect to ZooKeeper
   [junit4]   2> 366833 T1080 oascc.ConnectionManager.process Watcher org.apache.solr.common.cloud.ConnectionManager@49fc5d6d name:ZooKeeperConnection Watcher:127.0.0.1:56209 got event WatchedEvent state:SyncConnected type:None path:null path:null type:None
   [junit4]   2> 366834 T990 oascc.ConnectionManager.waitForConnected Client is connected to ZooKeeper
   [junit4]   2> 366834 T990 oascc.SolrZkClient.createZkACLProvider Using default ZkACLProvider
   [junit4]   2> 366836 T990 oascc.ConnectionManager.waitForConnected Waiting for client to connect to ZooKeeper
   [junit4]   2> 366837 T1082 oascc.ConnectionManager.process Watcher org.apache.solr.common.cloud.ConnectionManager@1455592 name:ZooKeeperConnection Watcher:127.0.0.1:56209/solr got event WatchedEvent state:SyncConnected type:None path:null path:null type:None
   [junit4]   2> 366838 T990 oascc.ConnectionManager.waitForConnected Client is connected to ZooKeeper
   [junit4]   2> 366841 T990 oascc.ZkStateReader.createClusterStateWatchersAndUpdate Updating cluster state from ZooKeeper... 
   [junit4]   2> 367849 T990 oasc.ZkController.createEphemeralLiveNode Register node as live in ZooKeeper:/live_nodes/127.0.0.1:59899_n_%2Fc
   [junit4]   2> 367850 T990 oascc.SolrZkClient.makePath makePath: /live_nodes/127.0.0.1:59899_n_%2Fc
   [junit4]   2> 367852 T990 oasc.Overseer.close Overseer (id=null) closing
   [junit4]   2> 367855 T990 oass.SolrDispatchFilter.init user.dir=/mnt/ssd/jenkins/workspace/Lucene-Solr-trunk-Linux/solr/build/solr-core/test/J1
   [junit4]   2> 367855 T990 oass.SolrDispatchFilter.init SolrDispatchFilter.init() done
   [junit4]   2> 367925 T1032 oasha.CollectionsHandler.handleCreateAction Creating Collection : replicationFactor=2&collection.configName=conf1&router.field=myOwnField&name=solrj_collection&action=CREATE&numShards=2&wt=javabin&version=2
   [junit4]   2> 367926 T1023 oasc.DistributedQueue$LatchChildWatcher.process LatchChildWatcher fired on path: /overseer/collection-queue-work state: SyncConnected type NodeChildrenChanged
   [junit4]   2> 367927 T1016 oasc.OverseerCollectionProcessor.run Overseer Collection Processor: Get the message id:/overseer/collection-queue-work/qn-0000000000 message:{
   [junit4]   2> 	  "operation":"create",
   [junit4]   2> 	  "fromApi":"true",
   [junit4]   2> 	  "name":"solrj_collection",
   [junit4]   2> 	  "replicationFactor":"2",
   [junit4]   2> 	  "collection.configName":"conf1",
   [junit4]   2> 	  "numShards":"2",
   [junit4]   2> 	  "router.field":"myOwnField"}
   [junit4]   2> 367928 T1085 oasc.OverseerCollectionProcessor.processMessage WARN OverseerCollectionProcessor.processMessage : create , {
   [junit4]   2> 	  "operation":"create",
   [junit4]   2> 	  "fromApi":"true",
   [junit4]   2> 	  "name":"solrj_collection",
   [junit4]   2> 	  "replicationFactor":"2",
   [junit4]   2> 	  "collection.configName":"conf1",
   [junit4]   2> 	  "numShards":"2",
   [junit4]   2> 	  "router.field":"myOwnField"}
   [junit4]   2> 367929 T1085 oasc.OverseerCollectionProcessor.createConfNode creating collections conf node /collections/solrj_collection 
   [junit4]   2> 367929 T1085 oascc.SolrZkClient.makePath makePath: /collections/solrj_collection
   [junit4]   2> 367931 T1023 oasc.DistributedQueue$LatchChildWatcher.process LatchChildWatcher fired on path: /overseer/queue state: SyncConnected type NodeChildrenChanged
   [junit4]   2> 367934 T1015 oasc.Overseer$ClusterStateUpdater.buildCollection building a new collection: solrj_collection
   [junit4]   2> 367934 T1015 oasc.Overseer$ClusterStateUpdater.createCollection Create collection solrj_collection with shards [shard1, shard2]
   [junit4]   2> 367935 T1015 oasc.Overseer$ClusterStateUpdater.createCollection state version solrj_collection 1
   [junit4]   2> 367936 T1024 oascc.ZkStateReader$2.process A cluster state change: WatchedEvent state:SyncConnected type:NodeDataChanged path:/clusterstate.json, has occurred - updating... (live nodes size: 5)
   [junit4]   2> 367936 T1023 oascc.ZkStateReader$2.process A cluster state change: WatchedEvent state:SyncConnected type:NodeDataChanged path:/clusterstate.json, has occurred - updating... (live nodes size: 5)
   [junit4]   2> 367936 T1068 oascc.ZkStateReader$2.process A cluster state change: WatchedEvent state:SyncConnected type:NodeDataChanged path:/clusterstate.json, has occurred - updating... (live nodes size: 5)
   [junit4]   2> 367936 T1083 oascc.ZkStateReader$2.process A cluster state change: WatchedEvent state:SyncConnected type:NodeDataChanged path:/clusterstate.json, has occurred - updating... (live nodes size: 5)
   [junit4]   2> 367936 T1038 oascc.ZkStateReader$2.process A cluster state change: WatchedEvent state:SyncConnected type:NodeDataChanged path:/clusterstate.json, has occurred - updating... (live nodes size: 5)
   [junit4]   2> 367936 T1053 oascc.ZkStateReader$2.process A cluster state change: WatchedEvent state:SyncConnected type:NodeDataChanged path:/clusterstate.json, has occurred - updating... (live nodes size: 5)
   [junit4]   2> 368031 T1085 oasc.OverseerCollectionProcessor.createCollection Creating SolrCores for new collection solrj_collection, shardNames [shard1, shard2] , replicationFactor : 2
   [junit4]   2> 368032 T1085 oasc.OverseerCollectionProcessor.createCollection Creating shard solrj_collection_shard1_replica1 as part of slice shard1 of collection solrj_collection on 127.0.0.1:59899_n_%2Fc
   [junit4]   2> 368032 T1085 oasc.OverseerCollectionProcessor.createCollection Creating shard solrj_collection_shard1_replica2 as part of slice shard1 of collection solrj_collection on 127.0.0.1:59894_n_%2Fc
   [junit4]   2> 368039 T1085 oasc.OverseerCollectionProcessor.createCollection Creating shard solrj_collection_shard2_replica1 as part of slice shard2 of collection solrj_collection on 127.0.0.1:56608_n_%2Fc
   [junit4]   2> 368040 T1085 oasc.OverseerCollectionProcessor.createCollection Creating shard solrj_collection_shard2_replica2 as part of slice shard2 of collection solrj_collection on 127.0.0.1:34996_n_%2Fc
   [junit4]   2> 368113 T1008 oasha.CoreAdminHandler.handleCreateAction core create command qt=/admin/cores&collection.configName=conf1&name=solrj_collection_shard2_replica1&action=CREATE&numShards=2&collection=solrj_collection&shard=shard2&wt=javabin&version=2
   [junit4]   2> 368114 T1077 oasha.CoreAdminHandler.handleCreateAction core create command qt=/admin/cores&collection.configName=conf1&name=solrj_collection_shard1_replica1&action=CREATE&numShards=2&collection=solrj_collection&shard=shard1&wt=javabin&version=2
   [junit4]   2> 368117 T1045 oasha.CoreAdminHandler.handleCreateAction core create command qt=/admin/cores&collection.configName=conf1&name=solrj_collection_shard1_replica2&action=CREATE&numShards=2&collection=solrj_collection&shard=shard1&wt=javabin&version=2
   [junit4]   2> 368121 T1063 oasha.CoreAdminHandler.handleCreateAction core create command qt=/admin/cores&collection.configName=conf1&name=solrj_collection_shard2_replica2&action=CREATE&numShards=2&collection=solrj_collection&shard=shard2&wt=javabin&version=2
   [junit4]   2> 368127 T1077 oasc.ZkController.publish publishing core=solrj_collection_shard1_replica1 state=down collection=solrj_collection
   [junit4]   2> 368128 T1077 oasc.ZkController.waitForCoreNodeName look for our core node name
   [junit4]   2> 368128 T1045 oasc.ZkController.publish publishing core=solrj_collection_shard1_replica2 state=down collection=solrj_collection
   [junit4]   2> 368128 T1063 oasc.ZkController.publish publishing core=solrj_collection_shard2_replica2 state=down collection=solrj_collection
   [junit4]   2> 368128 T1008 oasc.ZkController.publish publishing core=solrj_collection_shard2_replica1 state=down collection=solrj_collection
   [junit4]   2> 368128 T1023 oasc.DistributedQueue$LatchChildWatcher.process LatchChildWatcher fired on path: /overseer/queue state: SyncConnected type NodeChildrenChanged
   [junit4]   2> 368129 T1045 oasc.ZkController.waitForCoreNodeName look for our core node name
   [junit4]   2> 368129 T1063 oasc.ZkController.waitForCoreNodeName look for our core node name
   [junit4]   2> 368129 T1008 oasc.ZkController.waitForCoreNodeName look for our core node name
   [junit4]   2> 368131 T1015 oasc.Overseer$ClusterStateUpdater.updateState Update state numShards=2 message={
   [junit4]   2> 	  "core":"solrj_collection_shard1_replica1",
   [junit4]   2> 	  "roles":null,
   [junit4]   2> 	  "base_url":"https://127.0.0.1:59899/n_/c",
   [junit4]   2> 	  "node_name":"127.0.0.1:59899_n_%2Fc",
   [junit4]   2> 	  "numShards":"2",
   [junit4]   2> 	  "state":"down",
   [junit4]   2> 	  "shard":"shard1",
   [junit4]   2> 	  "collection":"solrj_collection",
   [junit4]   2> 	  "operation":"state"}
   [junit4]   2> 368133 T1015 oasc.Overseer$ClusterStateUpdater.updateState Update state numShards=2 message={
   [junit4]   2> 	  "core":"solrj_collection_shard1_replica2",
   [junit4]   2> 	  "roles":null,
   [junit4]   2> 	  "base_url":"https://127.0.0.1:59894/n_/c",
   [junit4]   2> 	  "node_name":"127.0.0.1:59894_n_%2Fc",
   [junit4]   2> 	  "numShards":"2",
   [junit4]   2> 	  "state":"down",
   [junit4]   2> 	  "shard":"shard1",
   [junit4]   2> 	  "collection":"solrj_collection",
   [junit4]   2> 	  "operation":"state"}
   [junit4]   2> 368135 T1023 oasc.DistributedQueue$LatchChildWatcher.process LatchChildWatcher fired on path: /overseer/queue state: SyncConnected type NodeChildrenChanged
   [junit4]   2> 368135 T1015 oasc.Overseer$ClusterStateUpdater.updateState Update state numShards=2 message={
   [junit4]   2> 	  "core":"solrj_collection_shard2_replica2",
   [junit4]   2> 	  "roles":null,
   [junit4]   2> 	  "base_url":"https://127.0.0.1:34996/n_/c",
   [junit4]   2> 	  "node_name":"127.0.0.1:34996_n_%2Fc",
   [junit4]   2> 	  "numShards":"2",
   [junit4]   2> 	  "state":"down",
   [junit4]   2> 	  "shard":"shard2",
   [junit4]   2> 	  "collection":"solrj_collection",
   [junit4]   2> 	  "operation":"state"}
   [junit4]   2> 368137 T1015 oasc.Overseer$ClusterStateUpdater.updateState Update state numShards=2 message={
   [junit4]   2> 	  "core":"solrj_collection_shard2_replica1",
   [junit4]   2> 	  "roles":null,
   [junit4]   2> 	  "base_url":"https://127.0.0.1:56608/n_/c",
   [junit4]   2> 	  "node_name":"127.0.0.1:56608_n_%2Fc",
   [junit4]   2> 	  "numShards":"2",
   [junit4]   2> 	  "state":"down",
   [junit4]   2> 	  "shard":"shard2",
   [junit4]   2> 	  "collection":"solrj_collection",
   [junit4]   2> 	  "operation":"state"}
   [junit4]   2> 368138 T1023 oasc.DistributedQueue$LatchChildWatcher.process LatchChildWatcher fired on path: /overseer/queue state: SyncConnected type NodeChildrenChanged
   [junit4]   2> 368143 T1024 oascc.ZkStateReader$2.process A cluster state change: WatchedEvent state:SyncConnected type:NodeDataChanged path:/clusterstate.json, has occurred - updating... (live nodes size: 5)
   [junit4]   2> 368144 T1023 oascc.ZkStateReader$2.process A cluster state change: WatchedEvent state:SyncConnected type:NodeDataChanged path:/clusterstate.json, has occurred - updating... (live nodes size: 5)
   [junit4]   2> 368144 T1053 oascc.ZkStateReader$2.process A cluster state change: WatchedEvent state:SyncConnected type:NodeDataChanged path:/clusterstate.json, has occurred - updating... (live nodes size: 5)
   [junit4]   2> 368143 T1083 oascc.ZkStateReader$2.process A cluster state change: WatchedEvent state:SyncConnected type:NodeDataChanged path:/clusterstate.json, has occurred - updating... (live nodes size: 5)
   [junit4]   2> 368143 T1068 oascc.ZkStateReader$2.process A cluster state change: WatchedEvent state:SyncConnected type:NodeDataChanged path:/clusterstate.json, has occurred - updating... (live nodes size: 5)
   [junit4]   2> 368143 T1038 oascc.ZkStateReader$2.process A cluster state change: WatchedEvent state:SyncConnected type:NodeDataChanged path:/clusterstate.json, has occurred - updating... (live nodes size: 5)
   [junit4]   2> 369128 T1077 oasc.ZkController.waitForShardId waiting to find shard id in clusterstate for solrj_collection_shard1_replica1
   [junit4]   2> 369129 T1077 oasc.ZkController.createCollectionZkNode Check for collection zkNode:solrj_collection
   [junit4]   2> 369129 T1077 oasc.ZkController.createCollectionZkNode Collection zkNode exists
   [junit4]   2> 369129 T1077 oascc.ZkStateReader.readConfigName Load collection config from:/collections/solrj_collection
   [junit4]   2> 369130 T1045 oasc.ZkController.waitForShardId waiting to find shard id in clusterstate for solrj_collection_shard1_replica2
   [junit4]   2> 369130 T1077 oascc.ZkStateReader.readConfigName path=/collections/solrj_collection configName=conf1 specified config exists in ZooKeeper
   [junit4]   2> 369130 T1063 oasc.ZkController.waitForShardId waiting to find shard id in clusterstate for solrj_collection_shard2_replica2
   [junit4]   2> 369130 T1045 oasc.ZkController.createCollectionZkNode Check for collection zkNode:solrj_collection
   [junit4]   2> 369130 T1063 oasc.ZkController.createCollectionZkNode Check for collection zkNode:solrj_collection
   [junit4]   2> 369130 T1008 oasc.ZkController.waitForShardId waiting to find shard id in clusterstate for solrj_collection_shard2_replica1
   [junit4]   2> 369130 T1077 oasc.SolrResourceLoader.<init> new SolrResourceLoader for directory: '../../../../../../../../../../mnt/ssd/jenkins/workspace/Lucene-Solr-trunk-Linux/solr/build/solr-core/test/J1/temp/solr.cloud.CollectionsAPIDistributedZkTest-3C8147AC723F39AB-001/tempDir-006/solrj_collection_shard1_replica1/'
   [junit4]   2> 369131 T1063 oasc.ZkController.createCollectionZkNode Collection zkNode exists
   [junit4]   2> 369131 T1008 oasc.ZkController.createCollectionZkNode Check for collection zkNode:solrj_collection
   [junit4]   2> 369131 T1045 oasc.ZkController.createCollectionZkNode Collection zkNode exists
   [junit4]   2> 369132 T1045 oascc.ZkStateReader.readConfigName Load collection config from:/collections/solrj_collection
   [junit4]   2> 369131 T1063 oascc.ZkStateReader.readConfigName Load collection config from:/collections/solrj_collection
   [junit4]   2> 369132 T1008 oasc.ZkController.createCollectionZkNode Collection zkNode exists
   [junit4]   2> 369133 T1008 oascc.ZkStateReader.readConfigName Load collection config from:/collections/solrj_collection
   [junit4]   2> 369133 T1045 oascc.ZkStateReader.readConfigName path=/collections/solrj_collection configName=conf1 specified config exists in ZooKeeper
   [junit4]   2> 369133 T1045 oasc.SolrResourceLoader.<init> new SolrResourceLoader for directory: '../../../../../../../../../../mnt/ssd/jenkins/workspace/Lucene-Solr-trunk-Linux/solr/build/solr-core/test/J1/temp/solr.cloud.CollectionsAPIDistributedZkTest-3C8147AC723F39AB-001/tempDir-004/solrj_collection_shard1_replica2/'
   [junit4]   2> 369135 T1063 oascc.ZkStateReader.readConfigName path=/collections/solrj_collection configName=conf1 specified config exists in ZooKeeper
   [junit4]   2> 369135 T1063 oasc.SolrResourceLoader.<init> new SolrResourceLoader for directory: '../../../../../../../../../../mnt/ssd/jenkins/workspace/Lucene-Solr-trunk-Linux/solr/build/solr-core/test/J1/temp/solr.cloud.CollectionsAPIDistributedZkTest-3C8147AC723F39AB-001/tempDir-005/solrj_collection_shard2_replica2/'
   [junit4]   2> 369146 T1008 oascc.ZkStateReader.readConfigName path=/collections/solrj_collection configName=conf1 specified config exists in ZooKeeper
   [junit4]   2> 369146 T1008 oasc.SolrResourceLoader.<init> new SolrResourceLoader for directory: '/mnt/ssd/jenkins/workspace/Lucene-Solr-trunk-Linux/solr/build/solr-core/test/J1/temp/solr.cloud.CollectionsAPIDistributedZkTest-3C8147AC723F39AB-001/tempDir-002/solrj_collection_shard2_replica1/'
   [junit4]   2> 369167 T1077 oasc.SolrConfig.<init> Using Lucene MatchVersion: 6.0.0
   [junit4]   2> 369178 T1077 oasc.SolrConfig.<init> Loaded SolrConfig: solrconfig.xml
   [junit4]   2> 369184 T1063 oasc.SolrConfig.<init> Using Lucene MatchVersion: 6.0.0
   [junit4]   2> 369188 T1077 oass.IndexSchema.readSchema Reading Solr Schema from schema.xml
   [junit4]   2> 369193 T1008 oasc.SolrConfig.<init> Using Lucene MatchVersion: 6.0.0
   [junit4]   2> 369203 T1063 oasc.SolrConfig.<init> Loaded SolrConfig: solrconfig.xml
   [junit4]   2> 369206 T1077 oass.IndexSchema.readSchema [solrj_collection_shard1_replica1] Schema name=test
   [junit4]   2> 369213 T1008 oasc.SolrConfig.<init> Loaded SolrConfig: solrconfig.xml
   [junit4]   2> 369211 T1063 oass.IndexSchema.readSchema Reading Solr Schema from schema.xml
   [junit4]   2> 369207 T1045 oasc.SolrConfig.<init> Using Lucene MatchVersion: 6.0.0
   [junit4]   2> 369220 T1008 oass.IndexSchema.readSchema Reading Solr Schema from schema.xml
   [junit4]   2> 369232 T1008 oass.IndexSchema.readSchema [solrj_collection_shard2_replica1] Schema name=test
   [junit4]   2> 369250 T1063 oass.IndexSchema.readSchema [solrj_collection_shard2_replica2] Schema name=test
   [junit4]   2> 369254 T1045 oasc.SolrConfig.<init> Loaded SolrConfig: solrconfig.xml
   [junit4]   2> 369296 T1045 oass.IndexSchema.readSchema Reading Solr Schema from schema.xml
   [junit4]   2> 369316 T1045 oass.IndexSchema.readSchema [solrj_collection_shard1_replica2] Schema name=test
   [junit4]   2> 369464 T1077 oass.OpenExchangeRatesOrgProvider.init Initialized with rates=open-exchange-rates.json, refreshInterval=1440.
   [junit4]   2> 369501 T1077 oass.IndexSchema.readSchema default search field in schema is text
   [junit4]   2> 369503 T1077 oass.IndexSchema.readSchema unique key field: id
   [junit4]   2> 369548 T1077 oass.FileExchangeRateProvider.reload Reloading exchange rates from file currency.xml
   [junit4]   2> 369564 T1077 oass.FileExchangeRateProvider.reload Reloading exchange rates from file currency.xml
   [junit4]   2> 369569 T1063 oass.OpenExchangeRatesOrgProvider.init Initialized with rates=open-exchange-rates.json, refreshInterval=1440.
   [junit4]   2> 369580 T1008 oass.OpenExchangeRatesOrgProvider.init Initialized with rates=open-exchange-rates.json, refreshInterval=1440.
   [junit4]   2> 369585 T1008 oass.IndexSchema.readSchema default search field in schema is text
   [junit4]   2> 369587 T1008 oass.IndexSchema.readSchema unique key field: id
   [junit4]   2> 369587 T1077 oass.OpenExchangeRatesOrgProvider.reload Reloading exchange rates from open-exchange-rates.json
   [junit4]   2> 369588 T1077 oass.OpenExchangeRatesOrgProvider$OpenExchangeRates.<init> WARN Unknown key IMPORTANT NOTE
   [junit4]   2> 369601 T1077 oass.OpenExchangeRatesOrgProvider$OpenExchangeRates.<init> WARN Expected key, got STRING
   [junit4]   2> 369602 T1077 oass.OpenExchangeRatesOrgProvider.reload Reloading exchange rates from open-exchange-rates.json
   [junit4]   2> 369603 T1077 oass.OpenExchangeRatesOrgProvider$OpenExchangeRates.<init> WARN Unknown key IMPORTANT NOTE
   [junit4]   2> 369603 T1063 oass.IndexSchema.readSchema default search field in schema is text
   [junit4]   2> 369605 T1063 oass.IndexSchema.readSchema unique key field: id
   [junit4]   2> 369603 T1077 oass.OpenExchangeRatesOrgProvider$OpenExchangeRates.<init> WARN Expected key, got STRING
   [junit4]   2> 369609 T1077 oasc.CoreContainer.create Creating SolrCore 'solrj_collection_shard1_replica1' using configuration from collection solrj_collection
   [junit4]   2> 369610 T1077 oasc.SolrCore.initDirectoryFactory org.apache.solr.core.MockDirectoryFactory
   [junit4]   2> 369610 T1077 oasc.SolrCore.<init> [solrj_collection_shard1_replica1] Opening new SolrCore at ../../../../../../../../../../mnt/ssd/jenkins/workspace/Lucene-Solr-trunk-Linux/solr/build/solr-core/test/J1/temp/solr.cloud.CollectionsAPIDistributedZkTest-3C8147AC723F39AB-001/tempDir-006/solrj_collection_shard1_replica1/, dataDir=/mnt/ssd/jenkins/workspace/Lucene-Solr-trunk-Linux/solr/build/solr-core/test/J1/../../../../../../../../../../mnt/ssd/jenkins/workspace/Lucene-Solr-trunk-Linux/solr/build/solr-core/test/J1/temp/solr.cloud.CollectionsAPIDistributedZkTest-3C8147AC723F39AB-001/tempDir-006/solrj_collection_shard1_replica1/data/
   [junit4]   2> 369611 T1077 oasc.JmxMonitoredMap.<init> JMX monitoring is enabled. Adding Solr mbeans to JMX Server: com.sun.jmx.mbeanserver.JmxMBeanServer@3421287a
   [junit4]   2> 369611 T1008 oass.FileExchangeRateProvider.reload Reloading exchange rates from file currency.xml
   [junit4]   2> 369612 T1077 oasc.CachingDirectoryFactory.get return new directory for /mnt/ssd/jenkins/workspace/Lucene-Solr-trunk-Linux/solr/build/solr-core/test/J1/../../../../../../../../../../mnt/ssd/jenkins/workspace/Lucene-Solr-trunk-Linux/solr/build/solr-core/test/J1/temp/solr.cloud.CollectionsAPIDistributedZkTest-3C8147AC723F39AB-001/tempDir-006/solrj_collection_shard1_replica1/data
   [junit4]   2> 369612 T1077 oasc.SolrCore.getNewIndexDir New index directory detected: old=null new=/mnt/ssd/jenkins/workspace/Lucene-Solr-trunk-Linux/solr/build/solr-core/test/J1/../../../../../../../../../../mnt/ssd/jenkins/workspace/Lucene-Solr-trunk-Linux/solr/build/solr-core/test/J1/temp/solr.cloud.CollectionsAPIDistributedZkTest-3C8147AC723F39AB-001/tempDir-006/solrj_collection_shard1_replica1/data/index/
   [junit4]   2> 369612 T1077 oasc.SolrCore.initIndex WARN [solrj_collection_shard1_replica1] Solr index directory '/mnt/ssd/jenkins/workspace/Lucene-Solr-trunk-Linux/solr/build/solr-core/test/J1/../../../../../../../../../../mnt/ssd/jenkins/workspace/Lucene-Solr-trunk-Linux/solr/build/solr-core/test/J1/temp/solr.cloud.CollectionsAPIDistributedZkTest-3C8147AC723F39AB-001/tempDir-006/solrj_collection_shard1_replica1/data/index' doesn't exist. Creating new index...
   [junit4]   2> 369613 T1077 oasc.CachingDirectoryFactory.get return new directory for /mnt/ssd/jenkins/workspace/Lucene-Solr-trunk-Linux/solr/build/solr-core/test/J1/../../../../../../../../../../mnt/ssd/jenkins/workspace/Lucene-Solr-trunk-Linux/solr/build/solr-core/test/J1/temp/solr.cloud.CollectionsAPIDistributedZkTest-3C8147AC723F39AB-001/tempDir-006/solrj_collection_shard1_replica1/data/index
   [junit4]   2> 369614 T1077 oasu.RandomMergePolicy.<init> RandomMergePolicy wrapping class org.apache.lucene.index.AlcoholicMergePolicy: [AlcoholicMergePolicy: minMergeSize=0, mergeFactor=10, maxMergeSize=887995768, maxMergeSizeForForcedMerge=9223372036854775807, calibrateSizeByDeletes=true, maxMergeDocs=2147483647, maxCFSSegmentSizeMB=8.796093022207999E12, noCFSRatio=0.1]
   [junit4]   2> 369615 T1063 oass.FileExchangeRateProvider.reload Reloading exchange rates from file currency.xml
   [junit4]   2> 369616 T1008 oass.FileExchangeRateProvider.reload Reloading exchange rates from file currency.xml
   [junit4]   2> 369617 T1045 oass.OpenExchangeRatesOrgProvider.init Initialized with rates=open-exchange-rates.json, refreshInterval=1440.
   [junit4]   2> 369618 T1063 oass.FileExchangeRateProvider.reload Reloading exchange rates from file currency.xml
   [junit4]   2> 369622 T1008 oass.OpenExchangeRatesOrgProvider.reload Reloading exchange rates from open-exchange-rates.json
   [junit4]   2> 369622 T1045 oass.IndexSchema.readSchema default search field in schema is text
   [junit4]   2> 369623 T1063 oass.OpenExchangeRatesOrgProvider.reload Reloading exchange rates from open-exchange-rates.json
   [junit4]   2> 369624 T1045 oass.IndexSchema.readSchema unique key field: id
   [junit4]   2> 369625 T1008 oass.OpenExchangeRatesOrgProvider$OpenExchangeRates.<init> WARN Unknown key IMPORTANT NOTE
   [junit4]   2> 369625 T1008 oass.OpenExchangeRatesOrgProvider$OpenExchangeRates.<init> WARN Expected key, got STRING
   [junit4]   2> 369625 T1008 oass.OpenExchangeRatesOrgProvider.reload Reloading exchange rates from open-exchange-rates.json
   [junit4]   2> 369625 T1063 oass.OpenExchangeRatesOrgProvider$OpenExchangeRates.<init> WARN Unknown key IMPORTANT NOTE
   [junit4]   2> 369625 T1063 oass.OpenExchangeRatesOrgProvider$OpenExchangeRates.<init> WARN Expected key, got STRING
   [junit4]   2> 369626 T1063 oass.OpenExchangeRatesOrgProvider.reload Reloading exchange rates from open-exchange-rates.json
   [junit4]   2> 369627 T1008 oass.OpenExchangeRatesOrgProvider$OpenExchangeRates.<init> WARN Unknown key IMPORTANT NOTE
   [junit4]   2> 369627 T1008 oass.OpenExchangeRatesOrgProvider$OpenExchangeRates.<init> WARN Expected key, got STRING
   [junit4]   2> 369627 T1008 oasc.CoreContainer.create Creating SolrCore 'solrj_collection_shard2_replica1' using configuration from collection solrj_collection
   [junit4]   2> 369627 T1008 oasc.SolrCore.initDirectoryFactory org.apache.solr.core.MockDirectoryFactory
   [junit4]   2> 369628 T1063 oass.OpenExchangeRatesOrgProvider$OpenExchangeRates.<init> WARN Unknown key IMPORTANT NOTE
   [junit4]   2> 369628 T1063 oass.OpenExchangeRatesOrgProvider$OpenExchangeRates.<init> WARN Expected key, got STRING
   [junit4]   2> 369628 T1008 oasc.SolrCore.<init> [solrj_collection_shard2_replica1] Opening new SolrCore at /mnt/ssd/jenkins/workspace/Lucene-Solr-trunk-Linux/solr/build/solr-core/test/J1/temp/solr.cloud.CollectionsAPIDistributedZkTest-3C8147AC723F39AB-001/tempDir-002/solrj_collection_shard2_replica1/, dataDir=/mnt/ssd/jenkins/workspace/Lucene-Solr-trunk-Linux/solr/build/solr-core/test/J1/temp/solr.cloud.CollectionsAPIDistributedZkTest-3C8147AC723F39AB-001/tempDir-002/solrj_collection_shard2_replica1/data/
   [junit4]   2> 369629 T1008 oasc.JmxMonitoredMap.<init> JMX monitoring is enabled. Adding Solr mbeans to JMX Server: com.sun.jmx.mbeanserver.JmxMBeanServer@3421287a
   [junit4]   2> 369630 T1008 oasc.CachingDirectoryFactory.get return new directory for /mnt/ssd/jenkins/workspace/Lucene-Solr-trunk-Linux/solr/build/solr-core/test/J1/temp/solr.cloud.CollectionsAPIDistributedZkTest-3C8147AC723F39AB-001/tempDir-002/solrj_collection_shard2_replica1/data
   [junit4]   2> 369630 T1008 oasc.SolrCore.getNewIndexDir New index directory detected: old=null new=/mnt/ssd/jenkins/workspace/Lucene-Solr-trunk-Linux/solr/build/solr-core/test/J1/temp/solr.cloud.CollectionsAPIDistributedZkTest-3C8147AC723F39AB-001/tempDir-002/solrj_collection_shard2_replica1/data/index/
   [junit4]   2> 369630 T1008 oasc.SolrCore.initIndex WARN [solrj_collection_shard2_replica1] Solr index directory '/mnt/ssd/jenkins/workspace/Lucene-Solr-trunk-Linux/solr/build/solr-core/test/J1/temp/solr.cloud.CollectionsAPIDistributedZkTest-3C8147AC723F39AB-001/tempDir-002/solrj_collection_shard2_replica1/data/index' doesn't exist. Creating new index...
   [junit4]   2> 369631 T1008 oasc.CachingDirectoryFactory.get return new directory for /mnt/ssd/jenkins/workspace/Lucene-Solr-trunk-Linux/solr/build/solr-core/test/J1/temp/solr.cloud.CollectionsAPIDistributedZkTest-3C8147AC723F39AB-001/tempDir-002/solrj_collection_shard2_replica1/data/index
   [junit4]   2> 369631 T1008 oasu.RandomMergePolicy.<init> RandomMergePolicy wrapping class org.apache.lucene.index.AlcoholicMergePolicy: [AlcoholicMergePolicy: minMergeSize=0, mergeFactor=10, maxMergeSize=887995768, maxMergeSizeForForcedMerge=9223372036854775807, calibrateSizeByDeletes=true, maxMergeDocs=2147483647, maxCFSSegmentSizeMB=8.796093022207999E12, noCFSRatio=0.1]
   [junit4]   2> 369632 T1008 oasc.SolrDeletionPolicy.onCommit SolrDeletionPolicy.onCommit: commits: num=1
   [junit4]   2> 		commit{dir=MockDirectoryWrapper(RAMDirectory(id=lucene-28e5b6e2)),segFN=segments_1,generation=1}
   [junit4]   2> 369632 T1008 oasc.SolrDeletionPolicy.updateCommits newest commit generation = 1
   [junit4]   2> 369634 T1008 oasup.UpdateRequestProcessorChain.init creating updateRequestProcessorChain "nodistrib"
   [junit4]   2> 369635 T1008 oasup.UpdateRequestProcessorChain.init creating updateRequestProcessorChain "dedupe"
   [junit4]   2> 369635 T1008 oasup.UpdateRequestProcessorChain.init inserting DistributedUpdateProcessorFactory into updateRequestProcessorChain "dedupe"
   [junit4]   2> 369635 T1008 oasup.UpdateRequestProcessorChain.init creating updateRequestProcessorChain "stored_sig"
   [junit4]   2> 369635 T1008 oasup.UpdateRequestProcessorChain.init inserting DistributedUpdateProcessorFactory into updateRequestProcessorChain "stored_sig"
   [junit4]   2> 369636 T1008 oasup.UpdateRequestProcessorChain.init creating updateRequestProcessorChain "distrib-dup-test-chain-explicit"
   [junit4]   2> 369636 T1008 oasup.UpdateRequestProcessorChain.init creating updateRequestProcessorChain "distrib-dup-test-chain-implicit"
   [junit4]   2> 369636 T1008 oasup.UpdateRequestProcessorChain.init inserting DistributedUpdateProcessorFactory into updateRequestProcessorChain "distrib-dup-test-chain-implicit"
   [junit4]   2> 369636 T1008 oasc.SolrCore.loadUpdateProcessorChains no updateRequestProcessorChain defined as default, creating implicit default
   [junit4]   2> 369637 T1008 oasc.RequestHandlers.initHandlersFromConfig created /update/csv: org.apache.solr.handler.UpdateRequestHandler
   [junit4]   2> 369637 T1008 oasc.RequestHandlers.initHandlersFromConfig created /update/json: org.apache.solr.handler.UpdateRequestHandler
   [junit4]   2> 369629 T1063 oasc.CoreContainer.create Creating SolrCore 'solrj_collection_shard2_replica2' using configuration from collection solrj_collection
   [junit4]   2> 369649 T1063 oasc.SolrCore.initDirectoryFactory org.apache.solr.core.MockDirectoryFactory
   [junit4]   2> 369649 T1063 oasc.SolrCore.<init> [solrj_collection_shard2_replica2] Opening new SolrCore at ../../../../../../../../../../mnt/ssd/jenkins/workspace/Lucene-Solr-trunk-Linux/solr/build/solr-core/test/J1/temp/solr.cloud.CollectionsAPIDistributedZkTest-3C8147AC723F39AB-001/tempDir-005/solrj_collection_shard2_replica2/, dataDir=/mnt/ssd/jenkins/workspace/Lucene-Solr-trunk-Linux/solr/build/solr-core/test/J1/../../../../../../../../../../mnt/ssd/jenkins/workspace/Lucene-Solr-trunk-Linux/solr/build/solr-core/test/J1/temp/solr.cloud.CollectionsAPIDistributedZkTest-3C8147AC723F39AB-001/tempDir-005/solrj_collection_shard2_replica2/data/
   [junit4]   2> 369650 T1063 oasc.JmxMonitoredMap.<init> JMX monitoring is enabled. Adding Solr mbeans to JMX Server: com.sun.jmx.mbeanserver.JmxMBeanServer@3421287a
   [junit4]   2> 369648 T1008 oasc.RequestHandlers.initHandlersFromConfig created /update/json/docs: org.apache.solr.handler.UpdateRequestHandler
   [junit4]   2> 369631 T1077 oasc.SolrDeletionPolicy.onCommit SolrDeletionPolicy.onCommit: commits: num=1
   [junit4]   2> 		commit{dir=MockDirectoryWrapper(RAMDirectory(id=lucene-16700613)),segFN=segments_1,generation=1}
   [junit4]   2> 369651 T1077 oasc.SolrDeletionPolicy.updateCommits newest commit generation = 1
   [junit4]   2> 369651 T1008 oasc.RequestHandlers.initHandlersFromConfig created standard: solr.StandardRequestHandler
   [junit4]   2> 369652 T1008 oasc.RequestHandlers.initHandlersFromConfig created /get: solr.RealTimeGetHandler
   [junit4]   2> 369652 T1008 oasc.RequestHandlers.initHandlersFromConfig adding lazy requestHandler: solr.ReplicationHandler
   [junit4]   2> 369653 T1008 oasc.RequestHandlers.initHandlersFromConfig created /replication: solr.ReplicationHandler
   [junit4]   2> 369653 T1008 oasc.RequestHandlers.initHandlersFromConfig created /update: solr.UpdateRequestHandler
   [junit4]   2> 369653 T1008 oasc.RequestHandlers.initHandlersFromConfig created /admin/: org.apache.solr.handler.admin.AdminHandlers
   [junit4]   2> 369654 T1008 oasc.RequestHandlers.initHandlersFromConfig created /admin/file: solr.admin.ShowFileRequestHandler
   [junit4]   2> 369654 T1008 oasc.RequestHandlers.initHandlersFromConfig created /admin/fileedit: solr.admin.EditFileRequestHandler
   [junit4]   2> 369657 T1008 oashl.XMLLoader.init xsltCacheLifetimeSeconds=60
   [junit4]   2> 369658 T1008 oashl.XMLLoader.init xsltCacheLifetimeSeconds=60
   [junit4]   2> 369651 T1063 oasc.CachingDirectoryFactory.get return new directory for /mnt/ssd/jenkins/workspace/Lucene-Solr-trunk-Linux/solr/build/solr-core/test/J1/../../../../../../../../../../mnt/ssd/jenkins/workspace/Lucene-Solr-trunk-Linux/solr/build/solr-core/test/J1/temp/solr.cloud.CollectionsAPIDistributedZkTest-3C8147AC723F39AB-001/tempDir-005/solrj_collection_shard2_replica2/data
   [junit4]   2> 369659 T1045 oass.FileExchangeRateProvider.reload Reloading exchange rates from file currency.xml
   [junit4]   2> 369662 T1077 oasup.UpdateRequestProcessorChain.init creating updateRequestProcessorChain "nodistrib"
   [junit4]   2> 369663 T1077 oasup.UpdateRequestProcessorChain.init creating updateRequestProcessorChain "dedupe"
   [junit4]   2> 369663 T1077 oasup.UpdateRequestProcessorChain.init inserting DistributedUpdateProcessorFactory into updateRequestProcessorChain "dedupe"
   [junit4]   2> 369664 T1077 oasup.UpdateRequestProcessorChain.init creating updateRequestProcessorChain "stored_sig"
   [junit4]   2> 369664 T1077 oasup.UpdateRequestProcessorChain.init inserting DistributedUpdateProcessorFactory into updateRequestProcessorChain "stored_sig"
   [junit4]   2> 369664 T1077 oasup.UpdateRequestProcessorChain.init creating updateRequestProcessorChain "distrib-dup-test-chain-explicit"
   [junit4]   2> 369665 T1077 oasup.UpdateRequestProcessorChain.init creating updateRequestProcessorChain "distrib-dup-test-chain-implicit"
   [junit4]   2> 369665 T1077 oasup.UpdateRequestProcessorChain.init inserting DistributedUpdateProcessorFactory into updateRequestProcessorChain "distrib-dup-test-chain-implicit"
   [junit4]   2> 369666 T1077 oasc.SolrCore.loadUpdateProcessorChains no updateRequestProcessorChain defined as default, creating implicit default
   [junit4]   2> 369666 T1077 oasc.RequestHandlers.initHandlersFromConfig created /update/csv: org.apache.solr.handler.UpdateRequestHandler
   [junit4]   2> 369667 T1077 oasc.RequestHandlers.initHandlersFromConfig created /update/json: org.apache.solr.handler.UpdateRequestHandler
   [junit4]   2> 369667 T1077 oasc.RequestHandlers.initHandlersFromConfig created /update/json/docs: org.apache.solr.handler.UpdateRequestHandler
   [junit4]   2> 369668 T1077 oasc.RequestHandlers.initHandlersFromConfig created standard: solr.StandardRequestHandler
   [junit4]   2> 369668 T1077 oasc.RequestHandlers.initHandlersFromConfig created /get: solr.RealTimeGetHandler
   [junit4]   2> 369668 T1077 oasc.RequestHandlers.initHandlersFromConfig adding lazy requestHandler: solr.ReplicationHandler
   [junit4]   2> 369669 T1077 oasc.RequestHandlers.initHandlersFromConfig created /replication: solr.ReplicationHandler
   [junit4]   2> 369669 T1077 oasc.RequestHandlers.initHandlersFromConfig created /update: solr.UpdateRequestHandler
   [junit4]   2> 369670 T1077 oasc.RequestHandlers.initHandlersFromConfig created /admin/: org.apache.solr.handler.admin.AdminHandlers
   [junit4]   2> 369670 T1077 oasc.RequestHandlers.initHandlersFromConfig created /admin/file: solr.admin.ShowFileRequestHandler
   [junit4]   2> 3696

[...truncated too long message...]

      at java.util.concurrent.ThreadPoolExecutor$Worker.run(ThreadPoolExecutor.java:617)
   [junit4]   2> 	        at java.lang.Thread.run(Thread.java:745)
   [junit4]   2> NOTE: test params are: codec=Asserting(Lucene50): {other_tl1=PostingsFormat(name=Direct), _version_=PostingsFormat(name=Direct), multiDefault=OrdsLucene41(blocksize=128), a_t=OrdsLucene41(blocksize=128), intDefault=PostingsFormat(name=Direct), a_i1=OrdsLucene41(blocksize=128), id=PostingsFormat(name=SimpleText), text=FSTOrd41, range_facet_l=OrdsLucene41(blocksize=128), timestamp=OrdsLucene41(blocksize=128)}, docValues:{timestamp=DocValuesFormat(name=Asserting)}, sim=RandomSimilarityProvider(queryNorm=true,coord=crazy): {}, locale=sr__#Latn, timezone=Pacific/Tarawa
   [junit4]   2> NOTE: Linux 3.13.0-37-generic amd64/Oracle Corporation 1.8.0_40-ea (64-bit)/cpus=8,threads=4,free=128000544,total=214708224
   [junit4]   2> NOTE: All tests run in this JVM: [PolyFieldTest, TestBinaryField, TestReloadAndDeleteDocs, TestCustomSort, TestSolrQueryParserResource, CurrencyFieldXmlFileTest, LeaderElectionIntegrationTest, TestSchemaVersionResource, TestUpdate, SOLR749Test, AnalyticsQueryTest, OverseerRolesTest, TestLFUCache, AsyncMigrateRouteKeyTest, TestDistributedGrouping, SynonymTokenizerTest, OutOfBoxZkACLAndCredentialsProvidersTest, DistributedExpandComponentTest, TestValueSourceCache, TestFiltering, ResourceLoaderTest, MultiTermTest, TestZkChroot, LoggingHandlerTest, TestFieldResource, TestRecoveryHdfs, TestCloudInspectUtil, CollectionsAPIDistributedZkTest]
   [junit4]   2> NOTE: reproduce with: ant test  -Dtestcase=CollectionsAPIDistributedZkTest -Dtests.seed=3C8147AC723F39AB -Dtests.multiplier=3 -Dtests.slow=true -Dtests.locale=sr__#Latn -Dtests.timezone=Pacific/Tarawa -Dtests.file.encoding=UTF-8
   [junit4] ERROR   0.00s J1 | CollectionsAPIDistributedZkTest (suite) <<<
   [junit4]    > Throwable #1: java.lang.AssertionError: ERROR: SolrZkClient opens=20 closes=19
   [junit4]    > 	at __randomizedtesting.SeedInfo.seed([3C8147AC723F39AB]:0)
   [junit4]    > 	at org.apache.solr.SolrTestCaseJ4.endTrackingZkClients(SolrTestCaseJ4.java:455)
   [junit4]    > 	at org.apache.solr.SolrTestCaseJ4.afterClass(SolrTestCaseJ4.java:188)
   [junit4]    > 	at java.lang.Thread.run(Thread.java:745)Throwable #2: com.carrotsearch.randomizedtesting.ThreadLeakError: 4 threads leaked from SUITE scope at org.apache.solr.cloud.CollectionsAPIDistributedZkTest: 
   [junit4]    >    1) Thread[id=1166, name=zkCallback-187-thread-1, state=TIMED_WAITING, group=TGRP-CollectionsAPIDistributedZkTest]
   [junit4]    >         at sun.misc.Unsafe.park(Native Method)
   [junit4]    >         at java.util.concurrent.locks.LockSupport.parkNanos(LockSupport.java:215)
   [junit4]    >         at java.util.concurrent.SynchronousQueue$TransferStack.awaitFulfill(SynchronousQueue.java:460)
   [junit4]    >         at java.util.concurrent.SynchronousQueue$TransferStack.transfer(SynchronousQueue.java:362)
   [junit4]    >         at java.util.concurrent.SynchronousQueue.poll(SynchronousQueue.java:941)
   [junit4]    >         at java.util.concurrent.ThreadPoolExecutor.getTask(ThreadPoolExecutor.java:1066)
   [junit4]    >         at java.util.concurrent.ThreadPoolExecutor.runWorker(ThreadPoolExecutor.java:1127)
   [junit4]    >         at java.util.concurrent.ThreadPoolExecutor$Worker.run(ThreadPoolExecutor.java:617)
   [junit4]    >         at java.lang.Thread.run(Thread.java:745)
   [junit4]    >    2) Thread[id=1163, name=TEST-CollectionsAPIDistributedZkTest.testDistribSearch-seed#[3C8147AC723F39AB]-EventThread, state=WAITING, group=TGRP-CollectionsAPIDistributedZkTest]
   [junit4]    >         at sun.misc.Unsafe.park(Native Method)
   [junit4]    >         at java.util.concurrent.locks.LockSupport.park(LockSupport.java:175)
   [junit4]    >         at java.util.concurrent.locks.AbstractQueuedSynchronizer$ConditionObject.await(AbstractQueuedSynchronizer.java:2039)
   [junit4]    >         at java.util.concurrent.LinkedBlockingQueue.take(LinkedBlockingQueue.java:442)
   [junit4]    >         at org.apache.zookeeper.ClientCnxn$EventThread.run(ClientCnxn.java:494)
   [junit4]    >    3) Thread[id=1162, name=TEST-CollectionsAPIDistributedZkTest.testDistribSearch-seed#[3C8147AC723F39AB]-SendThread(127.0.0.1:56209), state=TIMED_WAITING, group=TGRP-CollectionsAPIDistributedZkTest]
   [junit4]    >         at java.lang.Thread.sleep(Native Method)
   [junit4]    >         at org.apache.zookeeper.client.StaticHostProvider.next(StaticHostProvider.java:101)
   [junit4]    >         at org.apache.zookeeper.ClientCnxn$SendThread.startConnect(ClientCnxn.java:940)
   [junit4]    >         at org.apache.zookeeper.ClientCnxn$SendThread.run(ClientCnxn.java:1003)
   [junit4]    >    4) Thread[id=1235, name=zkCallback-187-thread-2, state=TIMED_WAITING, group=TGRP-CollectionsAPIDistributedZkTest]
   [junit4]    >         at sun.misc.Unsafe.park(Native Method)
   [junit4]    >         at java.util.concurrent.locks.LockSupport.parkNanos(LockSupport.java:215)
   [junit4]    >         at java.util.concurrent.SynchronousQueue$TransferStack.awaitFulfill(SynchronousQueue.java:460)
   [junit4]    >         at java.util.concurrent.SynchronousQueue$TransferStack.transfer(SynchronousQueue.java:362)
   [junit4]    >         at java.util.concurrent.SynchronousQueue.poll(SynchronousQueue.java:941)
   [junit4]    >         at java.util.concurrent.ThreadPoolExecutor.getTask(ThreadPoolExecutor.java:1066)
   [junit4]    >         at java.util.concurrent.ThreadPoolExecutor.runWorker(ThreadPoolExecutor.java:1127)
   [junit4]    >         at java.util.concurrent.ThreadPoolExecutor$Worker.run(ThreadPoolExecutor.java:617)
   [junit4]    >         at java.lang.Thread.run(Thread.java:745)
   [junit4]    > 	at __randomizedtesting.SeedInfo.seed([3C8147AC723F39AB]:0)Throwable #3: com.carrotsearch.randomizedtesting.ThreadLeakError: There are still zombie threads that couldn't be terminated:
   [junit4]    >    1) Thread[id=1166, name=zkCallback-187-thread-1, state=TIMED_WAITING, group=TGRP-CollectionsAPIDistributedZkTest]
   [junit4]    >         at sun.misc.Unsafe.park(Native Method)
   [junit4]    >         at java.util.concurrent.locks.LockSupport.parkNanos(LockSupport.java:215)
   [junit4]    >         at java.util.concurrent.SynchronousQueue$TransferStack.awaitFulfill(SynchronousQueue.java:460)
   [junit4]    >         at java.util.concurrent.SynchronousQueue$TransferStack.transfer(SynchronousQueue.java:362)
   [junit4]    >         at java.util.concurrent.SynchronousQueue.poll(SynchronousQueue.java:941)
   [junit4]    >         at java.util.concurrent.ThreadPoolExecutor.getTask(ThreadPoolExecutor.java:1066)
   [junit4]    >         at java.util.concurrent.ThreadPoolExecutor.runWorker(ThreadPoolExecutor.java:1127)
   [junit4]    >         at java.util.concurrent.ThreadPoolExecutor$Worker.run(ThreadPoolExecutor.java:617)
   [junit4]    >         at java.lang.Thread.run(Thread.java:745)
   [junit4]    >    2) Thread[id=1162, name=TEST-CollectionsAPIDistributedZkTest.testDistribSearch-seed#[3C8147AC723F39AB]-SendThread(127.0.0.1:56209), state=TIMED_WAITING, group=TGRP-CollectionsAPIDistributedZkTest]
   [junit4]    >         at java.lang.Thread.sleep(Native Method)
   [junit4]    >         at org.apache.zookeeper.ClientCnxn$SendThread.run(ClientCnxn.java:994)
   [junit4]    >    3) Thread[id=1235, name=zkCallback-187-thread-2, state=TIMED_WAITING, group=TGRP-CollectionsAPIDistributedZkTest]
   [junit4]    >         at sun.misc.Unsafe.park(Native Method)
   [junit4]    >         at java.util.concurrent.locks.LockSupport.parkNanos(LockSupport.java:215)
   [junit4]    >         at java.util.concurrent.SynchronousQueue$TransferStack.awaitFulfill(SynchronousQueue.java:460)
   [junit4]    >         at java.util.concurrent.SynchronousQueue$TransferStack.transfer(SynchronousQueue.java:362)
   [junit4]    >         at java.util.concurrent.SynchronousQueue.poll(SynchronousQueue.java:941)
   [junit4]    >         at java.util.concurrent.ThreadPoolExecutor.getTask(ThreadPoolExecutor.java:1066)
   [junit4]    >         at java.util.concurrent.ThreadPoolExecutor.runWorker(ThreadPoolExecutor.java:1127)
   [junit4]    >         at java.util.concurrent.ThreadPoolExecutor$Worker.run(ThreadPoolExecutor.java:617)
   [junit4]    >         at java.lang.Thread.run(Thread.java:745)
   [junit4]    > 	at __randomizedtesting.SeedInfo.seed([3C8147AC723F39AB]:0)
   [junit4] Completed on J1 in 141.21s, 1 test, 2 failures, 2 errors <<< FAILURES!

[...truncated 1148 lines...]
BUILD FAILED
/mnt/ssd/jenkins/workspace/Lucene-Solr-trunk-Linux/build.xml:524: The following error occurred while executing this line:
/mnt/ssd/jenkins/workspace/Lucene-Solr-trunk-Linux/build.xml:472: The following error occurred while executing this line:
/mnt/ssd/jenkins/workspace/Lucene-Solr-trunk-Linux/build.xml:61: The following error occurred while executing this line:
/mnt/ssd/jenkins/workspace/Lucene-Solr-trunk-Linux/extra-targets.xml:39: The following error occurred while executing this line:
/mnt/ssd/jenkins/workspace/Lucene-Solr-trunk-Linux/solr/build.xml:189: The following error occurred while executing this line:
/mnt/ssd/jenkins/workspace/Lucene-Solr-trunk-Linux/solr/common-build.xml:496: The following error occurred while executing this line:
/mnt/ssd/jenkins/workspace/Lucene-Solr-trunk-Linux/lucene/common-build.xml:1359: The following error occurred while executing this line:
/mnt/ssd/jenkins/workspace/Lucene-Solr-trunk-Linux/lucene/common-build.xml:961: There were test failures: 437 suites, 1794 tests, 3 suite-level errors, 1 failure, 1254 ignored (12 assumptions)

Total time: 73 minutes 42 seconds
Build step 'Invoke Ant' marked build as failure
[description-setter] Description set: Java: 64bit/jdk1.8.0_40-ea-b09 -XX:+UseCompressedOops -XX:+UseConcMarkSweepGC
Archiving artifacts
Recording test results
Email was triggered for: Failure - Any
Sending email for trigger: Failure - Any



Mime
View raw message