lucene-dev mailing list archives

Site index · List index
Message view « Date » · « Thread »
Top « Date » · « Thread »
From Apache Jenkins Server <jenk...@builds.apache.org>
Subject [JENKINS] Lucene-Solr-Tests-5.x-Java7 - Build # 2174 - Still Failing
Date Thu, 16 Oct 2014 15:17:22 GMT
Build: https://builds.apache.org/job/Lucene-Solr-Tests-5.x-Java7/2174/

2 tests failed.
REGRESSION:  org.apache.solr.cloud.CollectionsAPIDistributedZkTest.testDistribSearch

Error Message:
Error CREATEing SolrCore 'halfcollection_shard1_replica1': Unable to create core [halfcollection_shard1_replica1] Caused by: Could not get shard id for core: halfcollection_shard1_replica1

Stack Trace:
org.apache.solr.client.solrj.impl.HttpSolrServer$RemoteSolrException: Error CREATEing SolrCore 'halfcollection_shard1_replica1': Unable to create core [halfcollection_shard1_replica1] Caused by: Could not get shard id for core: halfcollection_shard1_replica1
	at __randomizedtesting.SeedInfo.seed([FBC77DCFA2A7FB9A:7A21F3D7D5F89BA6]:0)
	at org.apache.solr.client.solrj.impl.HttpSolrServer.executeMethod(HttpSolrServer.java:569)
	at org.apache.solr.client.solrj.impl.HttpSolrServer.request(HttpSolrServer.java:215)
	at org.apache.solr.client.solrj.impl.HttpSolrServer.request(HttpSolrServer.java:211)
	at org.apache.solr.cloud.CollectionsAPIDistributedZkTest.testErrorHandling(CollectionsAPIDistributedZkTest.java:583)
	at org.apache.solr.cloud.CollectionsAPIDistributedZkTest.doTest(CollectionsAPIDistributedZkTest.java:205)
	at org.apache.solr.BaseDistributedSearchTestCase.testDistribSearch(BaseDistributedSearchTestCase.java:869)
	at sun.reflect.NativeMethodAccessorImpl.invoke0(Native Method)
	at sun.reflect.NativeMethodAccessorImpl.invoke(NativeMethodAccessorImpl.java:57)
	at sun.reflect.DelegatingMethodAccessorImpl.invoke(DelegatingMethodAccessorImpl.java:43)
	at java.lang.reflect.Method.invoke(Method.java:606)
	at com.carrotsearch.randomizedtesting.RandomizedRunner.invoke(RandomizedRunner.java:1618)
	at com.carrotsearch.randomizedtesting.RandomizedRunner$6.evaluate(RandomizedRunner.java:827)
	at com.carrotsearch.randomizedtesting.RandomizedRunner$7.evaluate(RandomizedRunner.java:863)
	at com.carrotsearch.randomizedtesting.RandomizedRunner$8.evaluate(RandomizedRunner.java:877)
	at com.carrotsearch.randomizedtesting.rules.SystemPropertiesRestoreRule$1.evaluate(SystemPropertiesRestoreRule.java:53)
	at org.apache.lucene.util.TestRuleSetupTeardownChained$1.evaluate(TestRuleSetupTeardownChained.java:50)
	at org.apache.lucene.util.AbstractBeforeAfterRule$1.evaluate(AbstractBeforeAfterRule.java:46)
	at com.carrotsearch.randomizedtesting.rules.SystemPropertiesInvariantRule$1.evaluate(SystemPropertiesInvariantRule.java:55)
	at org.apache.lucene.util.TestRuleThreadAndTestName$1.evaluate(TestRuleThreadAndTestName.java:49)
	at org.apache.lucene.util.TestRuleIgnoreAfterMaxFailures$1.evaluate(TestRuleIgnoreAfterMaxFailures.java:65)
	at org.apache.lucene.util.TestRuleMarkFailure$1.evaluate(TestRuleMarkFailure.java:48)
	at com.carrotsearch.randomizedtesting.rules.StatementAdapter.evaluate(StatementAdapter.java:36)
	at com.carrotsearch.randomizedtesting.ThreadLeakControl$StatementRunner.run(ThreadLeakControl.java:365)
	at com.carrotsearch.randomizedtesting.ThreadLeakControl.forkTimeoutingTask(ThreadLeakControl.java:798)
	at com.carrotsearch.randomizedtesting.ThreadLeakControl$3.evaluate(ThreadLeakControl.java:458)
	at com.carrotsearch.randomizedtesting.RandomizedRunner.runSingleTest(RandomizedRunner.java:836)
	at com.carrotsearch.randomizedtesting.RandomizedRunner$3.evaluate(RandomizedRunner.java:738)
	at com.carrotsearch.randomizedtesting.RandomizedRunner$4.evaluate(RandomizedRunner.java:772)
	at com.carrotsearch.randomizedtesting.RandomizedRunner$5.evaluate(RandomizedRunner.java:783)
	at com.carrotsearch.randomizedtesting.rules.StatementAdapter.evaluate(StatementAdapter.java:36)
	at com.carrotsearch.randomizedtesting.rules.SystemPropertiesRestoreRule$1.evaluate(SystemPropertiesRestoreRule.java:53)
	at org.apache.lucene.util.AbstractBeforeAfterRule$1.evaluate(AbstractBeforeAfterRule.java:46)
	at org.apache.lucene.util.TestRuleStoreClassName$1.evaluate(TestRuleStoreClassName.java:42)
	at com.carrotsearch.randomizedtesting.rules.SystemPropertiesInvariantRule$1.evaluate(SystemPropertiesInvariantRule.java:55)
	at com.carrotsearch.randomizedtesting.rules.NoShadowingOrOverridesOnMethodsRule$1.evaluate(NoShadowingOrOverridesOnMethodsRule.java:39)
	at com.carrotsearch.randomizedtesting.rules.NoShadowingOrOverridesOnMethodsRule$1.evaluate(NoShadowingOrOverridesOnMethodsRule.java:39)
	at com.carrotsearch.randomizedtesting.rules.StatementAdapter.evaluate(StatementAdapter.java:36)
	at com.carrotsearch.randomizedtesting.rules.StatementAdapter.evaluate(StatementAdapter.java:36)
	at com.carrotsearch.randomizedtesting.rules.StatementAdapter.evaluate(StatementAdapter.java:36)
	at org.apache.lucene.util.TestRuleAssertionsRequired$1.evaluate(TestRuleAssertionsRequired.java:43)
	at org.apache.lucene.util.TestRuleMarkFailure$1.evaluate(TestRuleMarkFailure.java:48)
	at org.apache.lucene.util.TestRuleIgnoreAfterMaxFailures$1.evaluate(TestRuleIgnoreAfterMaxFailures.java:65)
	at org.apache.lucene.util.TestRuleIgnoreTestSuites$1.evaluate(TestRuleIgnoreTestSuites.java:55)
	at com.carrotsearch.randomizedtesting.rules.StatementAdapter.evaluate(StatementAdapter.java:36)
	at com.carrotsearch.randomizedtesting.ThreadLeakControl$StatementRunner.run(ThreadLeakControl.java:365)
	at java.lang.Thread.run(Thread.java:745)


FAILED:  org.apache.solr.cloud.DeleteReplicaTest.testDistribSearch

Error Message:
No live SolrServers available to handle this request:[https://127.0.0.1:21016/_/qo, https://127.0.0.1:21059/_/qo, https://127.0.0.1:21024/_/qo, https://127.0.0.1:21051/_/qo, https://127.0.0.1:21034/_/qo]

Stack Trace:
org.apache.solr.client.solrj.SolrServerException: No live SolrServers available to handle this request:[https://127.0.0.1:21016/_/qo, https://127.0.0.1:21059/_/qo, https://127.0.0.1:21024/_/qo, https://127.0.0.1:21051/_/qo, https://127.0.0.1:21034/_/qo]
	at __randomizedtesting.SeedInfo.seed([FBC77DCFA2A7FB9A:7A21F3D7D5F89BA6]:0)
	at org.apache.solr.client.solrj.impl.LBHttpSolrServer.request(LBHttpSolrServer.java:333)
	at org.apache.solr.client.solrj.impl.CloudSolrServer.sendRequest(CloudSolrServer.java:1015)
	at org.apache.solr.client.solrj.impl.CloudSolrServer.requestWithRetryOnStaleState(CloudSolrServer.java:793)
	at org.apache.solr.client.solrj.impl.CloudSolrServer.request(CloudSolrServer.java:736)
	at org.apache.solr.cloud.DeleteReplicaTest.removeAndWaitForReplicaGone(DeleteReplicaTest.java:172)
	at org.apache.solr.cloud.DeleteReplicaTest.deleteLiveReplicaTest(DeleteReplicaTest.java:145)
	at org.apache.solr.cloud.DeleteReplicaTest.doTest(DeleteReplicaTest.java:89)
	at org.apache.solr.BaseDistributedSearchTestCase.testDistribSearch(BaseDistributedSearchTestCase.java:869)
	at sun.reflect.NativeMethodAccessorImpl.invoke0(Native Method)
	at sun.reflect.NativeMethodAccessorImpl.invoke(NativeMethodAccessorImpl.java:57)
	at sun.reflect.DelegatingMethodAccessorImpl.invoke(DelegatingMethodAccessorImpl.java:43)
	at java.lang.reflect.Method.invoke(Method.java:606)
	at com.carrotsearch.randomizedtesting.RandomizedRunner.invoke(RandomizedRunner.java:1618)
	at com.carrotsearch.randomizedtesting.RandomizedRunner$6.evaluate(RandomizedRunner.java:827)
	at com.carrotsearch.randomizedtesting.RandomizedRunner$7.evaluate(RandomizedRunner.java:863)
	at com.carrotsearch.randomizedtesting.RandomizedRunner$8.evaluate(RandomizedRunner.java:877)
	at com.carrotsearch.randomizedtesting.rules.SystemPropertiesRestoreRule$1.evaluate(SystemPropertiesRestoreRule.java:53)
	at org.apache.lucene.util.TestRuleSetupTeardownChained$1.evaluate(TestRuleSetupTeardownChained.java:50)
	at org.apache.lucene.util.AbstractBeforeAfterRule$1.evaluate(AbstractBeforeAfterRule.java:46)
	at com.carrotsearch.randomizedtesting.rules.SystemPropertiesInvariantRule$1.evaluate(SystemPropertiesInvariantRule.java:55)
	at org.apache.lucene.util.TestRuleThreadAndTestName$1.evaluate(TestRuleThreadAndTestName.java:49)
	at org.apache.lucene.util.TestRuleIgnoreAfterMaxFailures$1.evaluate(TestRuleIgnoreAfterMaxFailures.java:65)
	at org.apache.lucene.util.TestRuleMarkFailure$1.evaluate(TestRuleMarkFailure.java:48)
	at com.carrotsearch.randomizedtesting.rules.StatementAdapter.evaluate(StatementAdapter.java:36)
	at com.carrotsearch.randomizedtesting.ThreadLeakControl$StatementRunner.run(ThreadLeakControl.java:365)
	at com.carrotsearch.randomizedtesting.ThreadLeakControl.forkTimeoutingTask(ThreadLeakControl.java:798)
	at com.carrotsearch.randomizedtesting.ThreadLeakControl$3.evaluate(ThreadLeakControl.java:458)
	at com.carrotsearch.randomizedtesting.RandomizedRunner.runSingleTest(RandomizedRunner.java:836)
	at com.carrotsearch.randomizedtesting.RandomizedRunner$3.evaluate(RandomizedRunner.java:738)
	at com.carrotsearch.randomizedtesting.RandomizedRunner$4.evaluate(RandomizedRunner.java:772)
	at com.carrotsearch.randomizedtesting.RandomizedRunner$5.evaluate(RandomizedRunner.java:783)
	at com.carrotsearch.randomizedtesting.rules.StatementAdapter.evaluate(StatementAdapter.java:36)
	at com.carrotsearch.randomizedtesting.rules.SystemPropertiesRestoreRule$1.evaluate(SystemPropertiesRestoreRule.java:53)
	at org.apache.lucene.util.AbstractBeforeAfterRule$1.evaluate(AbstractBeforeAfterRule.java:46)
	at org.apache.lucene.util.TestRuleStoreClassName$1.evaluate(TestRuleStoreClassName.java:42)
	at com.carrotsearch.randomizedtesting.rules.SystemPropertiesInvariantRule$1.evaluate(SystemPropertiesInvariantRule.java:55)
	at com.carrotsearch.randomizedtesting.rules.NoShadowingOrOverridesOnMethodsRule$1.evaluate(NoShadowingOrOverridesOnMethodsRule.java:39)
	at com.carrotsearch.randomizedtesting.rules.NoShadowingOrOverridesOnMethodsRule$1.evaluate(NoShadowingOrOverridesOnMethodsRule.java:39)
	at com.carrotsearch.randomizedtesting.rules.StatementAdapter.evaluate(StatementAdapter.java:36)
	at com.carrotsearch.randomizedtesting.rules.StatementAdapter.evaluate(StatementAdapter.java:36)
	at com.carrotsearch.randomizedtesting.rules.StatementAdapter.evaluate(StatementAdapter.java:36)
	at org.apache.lucene.util.TestRuleAssertionsRequired$1.evaluate(TestRuleAssertionsRequired.java:43)
	at org.apache.lucene.util.TestRuleMarkFailure$1.evaluate(TestRuleMarkFailure.java:48)
	at org.apache.lucene.util.TestRuleIgnoreAfterMaxFailures$1.evaluate(TestRuleIgnoreAfterMaxFailures.java:65)
	at org.apache.lucene.util.TestRuleIgnoreTestSuites$1.evaluate(TestRuleIgnoreTestSuites.java:55)
	at com.carrotsearch.randomizedtesting.rules.StatementAdapter.evaluate(StatementAdapter.java:36)
	at com.carrotsearch.randomizedtesting.ThreadLeakControl$StatementRunner.run(ThreadLeakControl.java:365)
	at java.lang.Thread.run(Thread.java:745)
Caused by: org.apache.solr.client.solrj.impl.HttpSolrServer$RemoteSolrException: Could not  remove replica : delLiveColl/shard1/core_node1
	at org.apache.solr.client.solrj.impl.HttpSolrServer.executeMethod(HttpSolrServer.java:569)
	at org.apache.solr.client.solrj.impl.HttpSolrServer.request(HttpSolrServer.java:215)
	at org.apache.solr.client.solrj.impl.HttpSolrServer.request(HttpSolrServer.java:211)
	at org.apache.solr.client.solrj.impl.LBHttpSolrServer.doRequest(LBHttpSolrServer.java:354)
	at org.apache.solr.client.solrj.impl.LBHttpSolrServer.request(LBHttpSolrServer.java:313)
	... 47 more




Build Log:
[...truncated 11145 lines...]
   [junit4] Suite: org.apache.solr.cloud.DeleteReplicaTest
   [junit4]   2> Creating dataDir: /usr/home/jenkins/jenkins-slave/workspace/Lucene-Solr-Tests-5.x-Java7/solr/build/solr-core/test/J0/temp/solr.cloud.DeleteReplicaTest-FBC77DCFA2A7FB9A-001/init-core-data-001
   [junit4]   2> 442698 T926 oas.SolrTestCaseJ4.buildSSLConfig Randomized ssl (true) and clientAuth (false)
   [junit4]   2> 442698 T926 oas.BaseDistributedSearchTestCase.initHostContext Setting hostContext system property: /_/qo
   [junit4]   2> 442705 T926 oas.SolrTestCaseJ4.setUp ###Starting testDistribSearch
   [junit4]   2> 442706 T926 oasc.ZkTestServer.run STARTING ZK TEST SERVER
   [junit4]   1> client port:0.0.0.0/0.0.0.0:0
   [junit4]   2> 442707 T927 oasc.ZkTestServer$ZKServerMain.runFromConfig Starting server
   [junit4]   2> 442807 T926 oasc.ZkTestServer.run start zk server on port:21012
   [junit4]   2> 442808 T926 oascc.SolrZkClient.createZkCredentialsToAddAutomatically Using default ZkCredentialsProvider
   [junit4]   2> 442809 T926 oascc.ConnectionManager.waitForConnected Waiting for client to connect to ZooKeeper
   [junit4]   2> 442812 T933 oascc.ConnectionManager.process Watcher org.apache.solr.common.cloud.ConnectionManager@d3da0c4 name:ZooKeeperConnection Watcher:127.0.0.1:21012 got event WatchedEvent state:SyncConnected type:None path:null path:null type:None
   [junit4]   2> 442813 T926 oascc.ConnectionManager.waitForConnected Client is connected to ZooKeeper
   [junit4]   2> 442813 T926 oascc.SolrZkClient.createZkACLProvider Using default ZkACLProvider
   [junit4]   2> 442813 T926 oascc.SolrZkClient.makePath makePath: /solr
   [junit4]   2> 442817 T926 oascc.SolrZkClient.createZkCredentialsToAddAutomatically Using default ZkCredentialsProvider
   [junit4]   2> 442817 T926 oascc.ConnectionManager.waitForConnected Waiting for client to connect to ZooKeeper
   [junit4]   2> 442819 T935 oascc.ConnectionManager.process Watcher org.apache.solr.common.cloud.ConnectionManager@6e45bc43 name:ZooKeeperConnection Watcher:127.0.0.1:21012/solr got event WatchedEvent state:SyncConnected type:None path:null path:null type:None
   [junit4]   2> 442819 T926 oascc.ConnectionManager.waitForConnected Client is connected to ZooKeeper
   [junit4]   2> 442819 T926 oascc.SolrZkClient.createZkACLProvider Using default ZkACLProvider
   [junit4]   2> 442819 T926 oascc.SolrZkClient.makePath makePath: /collections/collection1
   [junit4]   2> 442822 T926 oascc.SolrZkClient.makePath makePath: /collections/collection1/shards
   [junit4]   2> 442824 T926 oascc.SolrZkClient.makePath makePath: /collections/control_collection
   [junit4]   2> 442825 T926 oascc.SolrZkClient.makePath makePath: /collections/control_collection/shards
   [junit4]   2> 442830 T926 oasc.AbstractZkTestCase.putConfig put /usr/home/jenkins/jenkins-slave/workspace/Lucene-Solr-Tests-5.x-Java7/solr/core/src/test-files/solr/collection1/conf/solrconfig-tlog.xml to /configs/conf1/solrconfig.xml
   [junit4]   2> 442830 T926 oascc.SolrZkClient.makePath makePath: /configs/conf1/solrconfig.xml
   [junit4]   2> 442834 T926 oasc.AbstractZkTestCase.putConfig put /usr/home/jenkins/jenkins-slave/workspace/Lucene-Solr-Tests-5.x-Java7/solr/core/src/test-files/solr/collection1/conf/schema.xml to /configs/conf1/schema.xml
   [junit4]   2> 442834 T926 oascc.SolrZkClient.makePath makePath: /configs/conf1/schema.xml
   [junit4]   2> 442837 T926 oasc.AbstractZkTestCase.putConfig put /usr/home/jenkins/jenkins-slave/workspace/Lucene-Solr-Tests-5.x-Java7/solr/core/src/test-files/solr/collection1/conf/solrconfig.snippet.randomindexconfig.xml to /configs/conf1/solrconfig.snippet.randomindexconfig.xml
   [junit4]   2> 442838 T926 oascc.SolrZkClient.makePath makePath: /configs/conf1/solrconfig.snippet.randomindexconfig.xml
   [junit4]   2> 442840 T926 oasc.AbstractZkTestCase.putConfig put /usr/home/jenkins/jenkins-slave/workspace/Lucene-Solr-Tests-5.x-Java7/solr/core/src/test-files/solr/collection1/conf/stopwords.txt to /configs/conf1/stopwords.txt
   [junit4]   2> 442841 T926 oascc.SolrZkClient.makePath makePath: /configs/conf1/stopwords.txt
   [junit4]   2> 442843 T926 oasc.AbstractZkTestCase.putConfig put /usr/home/jenkins/jenkins-slave/workspace/Lucene-Solr-Tests-5.x-Java7/solr/core/src/test-files/solr/collection1/conf/protwords.txt to /configs/conf1/protwords.txt
   [junit4]   2> 442844 T926 oascc.SolrZkClient.makePath makePath: /configs/conf1/protwords.txt
   [junit4]   2> 442846 T926 oasc.AbstractZkTestCase.putConfig put /usr/home/jenkins/jenkins-slave/workspace/Lucene-Solr-Tests-5.x-Java7/solr/core/src/test-files/solr/collection1/conf/currency.xml to /configs/conf1/currency.xml
   [junit4]   2> 442847 T926 oascc.SolrZkClient.makePath makePath: /configs/conf1/currency.xml
   [junit4]   2> 442849 T926 oasc.AbstractZkTestCase.putConfig put /usr/home/jenkins/jenkins-slave/workspace/Lucene-Solr-Tests-5.x-Java7/solr/core/src/test-files/solr/collection1/conf/enumsConfig.xml to /configs/conf1/enumsConfig.xml
   [junit4]   2> 442850 T926 oascc.SolrZkClient.makePath makePath: /configs/conf1/enumsConfig.xml
   [junit4]   2> 442853 T926 oasc.AbstractZkTestCase.putConfig put /usr/home/jenkins/jenkins-slave/workspace/Lucene-Solr-Tests-5.x-Java7/solr/core/src/test-files/solr/collection1/conf/open-exchange-rates.json to /configs/conf1/open-exchange-rates.json
   [junit4]   2> 442854 T926 oascc.SolrZkClient.makePath makePath: /configs/conf1/open-exchange-rates.json
   [junit4]   2> 442856 T926 oasc.AbstractZkTestCase.putConfig put /usr/home/jenkins/jenkins-slave/workspace/Lucene-Solr-Tests-5.x-Java7/solr/core/src/test-files/solr/collection1/conf/mapping-ISOLatin1Accent.txt to /configs/conf1/mapping-ISOLatin1Accent.txt
   [junit4]   2> 442856 T926 oascc.SolrZkClient.makePath makePath: /configs/conf1/mapping-ISOLatin1Accent.txt
   [junit4]   2> 442859 T926 oasc.AbstractZkTestCase.putConfig put /usr/home/jenkins/jenkins-slave/workspace/Lucene-Solr-Tests-5.x-Java7/solr/core/src/test-files/solr/collection1/conf/old_synonyms.txt to /configs/conf1/old_synonyms.txt
   [junit4]   2> 442859 T926 oascc.SolrZkClient.makePath makePath: /configs/conf1/old_synonyms.txt
   [junit4]   2> 442862 T926 oasc.AbstractZkTestCase.putConfig put /usr/home/jenkins/jenkins-slave/workspace/Lucene-Solr-Tests-5.x-Java7/solr/core/src/test-files/solr/collection1/conf/synonyms.txt to /configs/conf1/synonyms.txt
   [junit4]   2> 442862 T926 oascc.SolrZkClient.makePath makePath: /configs/conf1/synonyms.txt
   [junit4]   2> 442865 T926 oascc.SolrZkClient.createZkCredentialsToAddAutomatically Using default ZkCredentialsProvider
   [junit4]   2> 442866 T926 oascc.ConnectionManager.waitForConnected Waiting for client to connect to ZooKeeper
   [junit4]   2> 442867 T937 oascc.ConnectionManager.process Watcher org.apache.solr.common.cloud.ConnectionManager@c3bb94c name:ZooKeeperConnection Watcher:127.0.0.1:21012/solr got event WatchedEvent state:SyncConnected type:None path:null path:null type:None
   [junit4]   2> 442868 T926 oascc.ConnectionManager.waitForConnected Client is connected to ZooKeeper
   [junit4]   2> 442868 T926 oascc.SolrZkClient.createZkACLProvider Using default ZkACLProvider
   [junit4]   2> 444588 T926 oejs.Server.doStart jetty-8.1.10.v20130312
   [junit4]   2> 444595 T926 oejus.SslContextFactory.doStart Enabled Protocols [SSLv2Hello, SSLv3, TLSv1, TLSv1.1, TLSv1.2] of [SSLv2Hello, SSLv3, TLSv1, TLSv1.1, TLSv1.2]
   [junit4]   2> 444600 T926 oejs.AbstractConnector.doStart Started SslSocketConnector@127.0.0.1:21016
   [junit4]   2> 444602 T926 oass.SolrDispatchFilter.init SolrDispatchFilter.init()
   [junit4]   2> 444603 T926 oasc.SolrResourceLoader.locateSolrHome JNDI not configured for solr (NoInitialContextEx)
   [junit4]   2> 444603 T926 oasc.SolrResourceLoader.locateSolrHome using system property solr.solr.home: /usr/home/jenkins/jenkins-slave/workspace/Lucene-Solr-Tests-5.x-Java7/solr/build/solr-core/test/J0/temp/solr.cloud.DeleteReplicaTest-FBC77DCFA2A7FB9A-001/tempDir-002
   [junit4]   2> 444604 T926 oasc.SolrResourceLoader.<init> new SolrResourceLoader for directory: '/usr/home/jenkins/jenkins-slave/workspace/Lucene-Solr-Tests-5.x-Java7/solr/build/solr-core/test/J0/temp/solr.cloud.DeleteReplicaTest-FBC77DCFA2A7FB9A-001/tempDir-002/'
   [junit4]   2> 444659 T926 oasc.ConfigSolr.fromFile Loading container configuration from /usr/home/jenkins/jenkins-slave/workspace/Lucene-Solr-Tests-5.x-Java7/solr/build/solr-core/test/J0/temp/solr.cloud.DeleteReplicaTest-FBC77DCFA2A7FB9A-001/tempDir-002/solr.xml
   [junit4]   2> 444778 T926 oasc.CorePropertiesLocator.<init> Config-defined core root directory: /usr/home/jenkins/jenkins-slave/workspace/Lucene-Solr-Tests-5.x-Java7/solr/build/solr-core/test/J0/temp/solr.cloud.DeleteReplicaTest-FBC77DCFA2A7FB9A-001/tempDir-002
   [junit4]   2> 444779 T926 oasc.CoreContainer.<init> New CoreContainer 1371529214
   [junit4]   2> 444780 T926 oasc.CoreContainer.load Loading cores into CoreContainer [instanceDir=/usr/home/jenkins/jenkins-slave/workspace/Lucene-Solr-Tests-5.x-Java7/solr/build/solr-core/test/J0/temp/solr.cloud.DeleteReplicaTest-FBC77DCFA2A7FB9A-001/tempDir-002/]
   [junit4]   2> 444781 T926 oashc.HttpShardHandlerFactory.getParameter Setting socketTimeout to: 90000
   [junit4]   2> 444781 T926 oashc.HttpShardHandlerFactory.getParameter Setting urlScheme to: 
   [junit4]   2> 444782 T926 oashc.HttpShardHandlerFactory.getParameter Setting connTimeout to: 15000
   [junit4]   2> 444782 T926 oashc.HttpShardHandlerFactory.getParameter Setting maxConnectionsPerHost to: 20
   [junit4]   2> 444782 T926 oashc.HttpShardHandlerFactory.getParameter Setting maxConnections to: 10000
   [junit4]   2> 444783 T926 oashc.HttpShardHandlerFactory.getParameter Setting corePoolSize to: 0
   [junit4]   2> 444783 T926 oashc.HttpShardHandlerFactory.getParameter Setting maximumPoolSize to: 2147483647
   [junit4]   2> 444783 T926 oashc.HttpShardHandlerFactory.getParameter Setting maxThreadIdleTime to: 5
   [junit4]   2> 444784 T926 oashc.HttpShardHandlerFactory.getParameter Setting sizeOfQueue to: -1
   [junit4]   2> 444784 T926 oashc.HttpShardHandlerFactory.getParameter Setting fairnessPolicy to: false
   [junit4]   2> 444787 T926 oasu.UpdateShardHandler.<init> Creating UpdateShardHandler HTTP client with params: socketTimeout=340000&connTimeout=45000&retry=false
   [junit4]   2> 444790 T926 oasl.LogWatcher.createWatcher SLF4J impl is org.slf4j.impl.Log4jLoggerFactory
   [junit4]   2> 444790 T926 oasl.LogWatcher.newRegisteredLogWatcher Registering Log Listener [Log4j (org.slf4j.impl.Log4jLoggerFactory)]
   [junit4]   2> 444791 T926 oasc.CoreContainer.load Host Name: 127.0.0.1
   [junit4]   2> 444791 T926 oasc.ZkContainer.initZooKeeper Zookeeper client=127.0.0.1:21012/solr
   [junit4]   2> 444791 T926 oasc.ZkController.checkChrootPath zkHost includes chroot
   [junit4]   2> 444792 T926 oascc.SolrZkClient.createZkCredentialsToAddAutomatically Using default ZkCredentialsProvider
   [junit4]   2> 444793 T926 oascc.ConnectionManager.waitForConnected Waiting for client to connect to ZooKeeper
   [junit4]   2> 444794 T948 oascc.ConnectionManager.process Watcher org.apache.solr.common.cloud.ConnectionManager@2fba00a2 name:ZooKeeperConnection Watcher:127.0.0.1:21012 got event WatchedEvent state:SyncConnected type:None path:null path:null type:None
   [junit4]   2> 444795 T926 oascc.ConnectionManager.waitForConnected Client is connected to ZooKeeper
   [junit4]   2> 444795 T926 oascc.SolrZkClient.createZkACLProvider Using default ZkACLProvider
   [junit4]   2> 444796 T926 oascc.ConnectionManager.waitForConnected Waiting for client to connect to ZooKeeper
   [junit4]   2> 444797 T950 oascc.ConnectionManager.process Watcher org.apache.solr.common.cloud.ConnectionManager@33badbc4 name:ZooKeeperConnection Watcher:127.0.0.1:21012/solr got event WatchedEvent state:SyncConnected type:None path:null path:null type:None
   [junit4]   2> 444797 T926 oascc.ConnectionManager.waitForConnected Client is connected to ZooKeeper
   [junit4]   2> 444798 T926 oascc.SolrZkClient.makePath makePath: /overseer/queue
   [junit4]   2> 444800 T926 oascc.SolrZkClient.makePath makePath: /overseer/collection-queue-work
   [junit4]   2> 444802 T926 oascc.SolrZkClient.makePath makePath: /overseer/collection-map-running
   [junit4]   2> 444804 T926 oascc.SolrZkClient.makePath makePath: /overseer/collection-map-completed
   [junit4]   2> 444805 T926 oascc.SolrZkClient.makePath makePath: /overseer/collection-map-failure
   [junit4]   2> 444807 T926 oascc.SolrZkClient.makePath makePath: /live_nodes
   [junit4]   2> 444808 T926 oasc.ZkController.createEphemeralLiveNode Register node as live in ZooKeeper:/live_nodes/127.0.0.1:21016__%2Fqo
   [junit4]   2> 444809 T926 oascc.SolrZkClient.makePath makePath: /live_nodes/127.0.0.1:21016__%2Fqo
   [junit4]   2> 444810 T926 oascc.SolrZkClient.makePath makePath: /overseer_elect
   [junit4]   2> 444812 T926 oascc.SolrZkClient.makePath makePath: /overseer_elect/election
   [junit4]   2> 444813 T926 oasc.Overseer.close Overseer (id=null) closing
   [junit4]   2> 444814 T926 oasc.OverseerElectionContext.runLeaderProcess I am going to be the leader 127.0.0.1:21016__%2Fqo
   [junit4]   2> 444814 T926 oascc.SolrZkClient.makePath makePath: /overseer_elect/leader
   [junit4]   2> 444815 T926 oasc.Overseer.start Overseer (id=92633054434426884-127.0.0.1:21016__%2Fqo-n_0000000000) starting
   [junit4]   2> 444817 T926 oascc.SolrZkClient.makePath makePath: /overseer/queue-work
   [junit4]   2> 444822 T926 oasc.OverseerAutoReplicaFailoverThread.<init> Starting OverseerAutoReplicaFailoverThread autoReplicaFailoverWorkLoopDelay=10000 autoReplicaFailoverWaitAfterExpiration=10000 autoReplicaFailoverBadNodeExpiration=60000
   [junit4]   2> 444823 T952 oasc.OverseerCollectionProcessor.run Process current queue of collection creations
   [junit4]   2> 444824 T926 oascc.SolrZkClient.makePath makePath: /clusterstate.json
   [junit4]   2> 444825 T926 oascc.SolrZkClient.makePath makePath: /aliases.json
   [junit4]   2> 444826 T926 oascc.ZkStateReader.createClusterStateWatchersAndUpdate Updating cluster state from ZooKeeper... 
   [junit4]   2> 444828 T951 oasc.Overseer$ClusterStateUpdater.run Starting to work on the main queue
   [junit4]   2> 444830 T926 oasc.CorePropertiesLocator.discover Looking for core definitions underneath /usr/home/jenkins/jenkins-slave/workspace/Lucene-Solr-Tests-5.x-Java7/solr/build/solr-core/test/J0/temp/solr.cloud.DeleteReplicaTest-FBC77DCFA2A7FB9A-001/tempDir-002
   [junit4]   2> 445907 T926 oasc.CorePropertiesLocator.discoverUnder Found core conf in /usr/home/jenkins/jenkins-slave/workspace/Lucene-Solr-Tests-5.x-Java7/solr/build/solr-core/test/J0/temp/solr.cloud.DeleteReplicaTest-FBC77DCFA2A7FB9A-001/tempDir-002/conf/
   [junit4]   2> 445920 T926 oasc.CorePropertiesLocator.discover Found 1 core definitions
   [junit4]   2> 445922 T926 oass.SolrDispatchFilter.init user.dir=/usr/home/jenkins/jenkins-slave/workspace/Lucene-Solr-Tests-5.x-Java7/solr/build/solr-core/test/J0
   [junit4]   2> 445922 T926 oass.SolrDispatchFilter.init SolrDispatchFilter.init() done
   [junit4]   2> 445926 T926 oascc.SolrZkClient.createZkCredentialsToAddAutomatically Using default ZkCredentialsProvider
   [junit4]   2> 445926 T926 oascc.ConnectionManager.waitForConnected Waiting for client to connect to ZooKeeper
   [junit4]   2> 445928 T956 oascc.ConnectionManager.process Watcher org.apache.solr.common.cloud.ConnectionManager@1471281e name:ZooKeeperConnection Watcher:127.0.0.1:21012/solr got event WatchedEvent state:SyncConnected type:None path:null path:null type:None
   [junit4]   2> 445928 T926 oascc.ConnectionManager.waitForConnected Client is connected to ZooKeeper
   [junit4]   2> 445928 T926 oascc.SolrZkClient.createZkACLProvider Using default ZkACLProvider
   [junit4]   2> 445930 T926 oascc.ZkStateReader.createClusterStateWatchersAndUpdate Updating cluster state from ZooKeeper... 
   [junit4]   2> 445932 T926 oasc.ChaosMonkey.monkeyLog monkey: init - expire sessions:false cause connection loss:false
   [junit4]   2> 445932 T926 oasc.AbstractFullDistribZkTestBase.createJettys Creating collection1 with stateFormat=2
   [junit4]   2> 445932 T926 oascc.SolrZkClient.createZkCredentialsToAddAutomatically Using default ZkCredentialsProvider
   [junit4]   2> 445933 T926 oascc.ConnectionManager.waitForConnected Waiting for client to connect to ZooKeeper
   [junit4]   2> 445934 T958 oascc.ConnectionManager.process Watcher org.apache.solr.common.cloud.ConnectionManager@32969ece name:ZooKeeperConnection Watcher:127.0.0.1:21012/solr got event WatchedEvent state:SyncConnected type:None path:null path:null type:None
   [junit4]   2> 445934 T926 oascc.ConnectionManager.waitForConnected Client is connected to ZooKeeper
   [junit4]   2> 445935 T926 oascc.SolrZkClient.createZkACLProvider Using default ZkACLProvider
   [junit4]   2> 445937 T959 oasc.DistributedQueue$LatchChildWatcher.process LatchChildWatcher fired on path: /overseer/queue state: SyncConnected type NodeChildrenChanged
   [junit4]   2> 445939 T951 oasc.Overseer$ClusterStateUpdater.buildCollection building a new collection: collection1
   [junit4]   2> 445939 T951 oasc.Overseer$ClusterStateUpdater.createCollection Create collection collection1 with shards [shard1, shard2]
   [junit4]   2> 445939 T951 oasc.Overseer$ClusterStateUpdater.createCollection state version collection1 2
   [junit4]   2> 445941 T951 oasc.Overseer$ClusterStateUpdater.updateZkStates going to create_collection /collections/collection1/state.json
   [junit4]   2> 445942 T959 oascc.ZkStateReader$2.process A cluster state change: WatchedEvent state:SyncConnected type:NodeDataChanged path:/clusterstate.json, has occurred - updating... (live nodes size: 1)
   [junit4]   2> 445942 T960 oascc.ZkStateReader$2.process A cluster state change: WatchedEvent state:SyncConnected type:NodeDataChanged path:/clusterstate.json, has occurred - updating... (live nodes size: 1)
   [junit4]   2> 447000 T926 oasc.AbstractFullDistribZkTestBase.createJettys create jetty 1
   [junit4]   2> 447001 T926 oejs.Server.doStart jetty-8.1.10.v20130312
   [junit4]   2> 447006 T926 oejus.SslContextFactory.doStart Enabled Protocols [SSLv2Hello, SSLv3, TLSv1, TLSv1.1, TLSv1.2] of [SSLv2Hello, SSLv3, TLSv1, TLSv1.1, TLSv1.2]
   [junit4]   2> 447008 T926 oejs.AbstractConnector.doStart Started SslSocketConnector@127.0.0.1:21024
   [junit4]   2> 447010 T926 oass.SolrDispatchFilter.init SolrDispatchFilter.init()
   [junit4]   2> 447010 T926 oasc.SolrResourceLoader.locateSolrHome JNDI not configured for solr (NoInitialContextEx)
   [junit4]   2> 447010 T926 oasc.SolrResourceLoader.locateSolrHome using system property solr.solr.home: ../../../../../../../../../../../usr/home/jenkins/jenkins-slave/workspace/Lucene-Solr-Tests-5.x-Java7/solr/build/solr-core/test/J0/temp/solr.cloud.DeleteReplicaTest-FBC77DCFA2A7FB9A-001/tempDir-003
   [junit4]   2> 447011 T926 oasc.SolrResourceLoader.<init> new SolrResourceLoader for directory: '../../../../../../../../../../../usr/home/jenkins/jenkins-slave/workspace/Lucene-Solr-Tests-5.x-Java7/solr/build/solr-core/test/J0/temp/solr.cloud.DeleteReplicaTest-FBC77DCFA2A7FB9A-001/tempDir-003/'
   [junit4]   2> 447044 T926 oasc.ConfigSolr.fromFile Loading container configuration from /usr/home/jenkins/jenkins-slave/workspace/Lucene-Solr-Tests-5.x-Java7/solr/build/solr-core/test/J0/../../../../../../../../../../../usr/home/jenkins/jenkins-slave/workspace/Lucene-Solr-Tests-5.x-Java7/solr/build/solr-core/test/J0/temp/solr.cloud.DeleteReplicaTest-FBC77DCFA2A7FB9A-001/tempDir-003/solr.xml
   [junit4]   2> 447093 T926 oasc.CorePropertiesLocator.<init> Config-defined core root directory: /usr/home/jenkins/jenkins-slave/workspace/Lucene-Solr-Tests-5.x-Java7/solr/build/solr-core/test/J0/../../../../../../../../../../../usr/home/jenkins/jenkins-slave/workspace/Lucene-Solr-Tests-5.x-Java7/solr/build/solr-core/test/J0/temp/solr.cloud.DeleteReplicaTest-FBC77DCFA2A7FB9A-001/tempDir-003
   [junit4]   2> 447094 T926 oasc.CoreContainer.<init> New CoreContainer 1961423448
   [junit4]   2> 447094 T926 oasc.CoreContainer.load Loading cores into CoreContainer [instanceDir=../../../../../../../../../../../usr/home/jenkins/jenkins-slave/workspace/Lucene-Solr-Tests-5.x-Java7/solr/build/solr-core/test/J0/temp/solr.cloud.DeleteReplicaTest-FBC77DCFA2A7FB9A-001/tempDir-003/]
   [junit4]   2> 447095 T926 oashc.HttpShardHandlerFactory.getParameter Setting socketTimeout to: 90000
   [junit4]   2> 447095 T926 oashc.HttpShardHandlerFactory.getParameter Setting urlScheme to: 
   [junit4]   2> 447095 T926 oashc.HttpShardHandlerFactory.getParameter Setting connTimeout to: 15000
   [junit4]   2> 447096 T926 oashc.HttpShardHandlerFactory.getParameter Setting maxConnectionsPerHost to: 20
   [junit4]   2> 447096 T926 oashc.HttpShardHandlerFactory.getParameter Setting maxConnections to: 10000
   [junit4]   2> 447096 T926 oashc.HttpShardHandlerFactory.getParameter Setting corePoolSize to: 0
   [junit4]   2> 447096 T926 oashc.HttpShardHandlerFactory.getParameter Setting maximumPoolSize to: 2147483647
   [junit4]   2> 447097 T926 oashc.HttpShardHandlerFactory.getParameter Setting maxThreadIdleTime to: 5
   [junit4]   2> 447097 T926 oashc.HttpShardHandlerFactory.getParameter Setting sizeOfQueue to: -1
   [junit4]   2> 447097 T926 oashc.HttpShardHandlerFactory.getParameter Setting fairnessPolicy to: false
   [junit4]   2> 447099 T926 oasu.UpdateShardHandler.<init> Creating UpdateShardHandler HTTP client with params: socketTimeout=340000&connTimeout=45000&retry=false
   [junit4]   2> 447101 T926 oasl.LogWatcher.createWatcher SLF4J impl is org.slf4j.impl.Log4jLoggerFactory
   [junit4]   2> 447101 T926 oasl.LogWatcher.newRegisteredLogWatcher Registering Log Listener [Log4j (org.slf4j.impl.Log4jLoggerFactory)]
   [junit4]   2> 447101 T926 oasc.CoreContainer.load Host Name: 127.0.0.1
   [junit4]   2> 447101 T926 oasc.ZkContainer.initZooKeeper Zookeeper client=127.0.0.1:21012/solr
   [junit4]   2> 447102 T926 oasc.ZkController.checkChrootPath zkHost includes chroot
   [junit4]   2> 447102 T926 oascc.SolrZkClient.createZkCredentialsToAddAutomatically Using default ZkCredentialsProvider
   [junit4]   2> 447103 T926 oascc.ConnectionManager.waitForConnected Waiting for client to connect to ZooKeeper
   [junit4]   2> 447104 T971 oascc.ConnectionManager.process Watcher org.apache.solr.common.cloud.ConnectionManager@64a92237 name:ZooKeeperConnection Watcher:127.0.0.1:21012 got event WatchedEvent state:SyncConnected type:None path:null path:null type:None
   [junit4]   2> 447104 T926 oascc.ConnectionManager.waitForConnected Client is connected to ZooKeeper
   [junit4]   2> 447105 T926 oascc.SolrZkClient.createZkACLProvider Using default ZkACLProvider
   [junit4]   2> 447106 T926 oascc.ConnectionManager.waitForConnected Waiting for client to connect to ZooKeeper
   [junit4]   2> 447107 T973 oascc.ConnectionManager.process Watcher org.apache.solr.common.cloud.ConnectionManager@7e2b216b name:ZooKeeperConnection Watcher:127.0.0.1:21012/solr got event WatchedEvent state:SyncConnected type:None path:null path:null type:None
   [junit4]   2> 447107 T926 oascc.ConnectionManager.waitForConnected Client is connected to ZooKeeper
   [junit4]   2> 447112 T926 oascc.ZkStateReader.createClusterStateWatchersAndUpdate Updating cluster state from ZooKeeper... 
   [junit4]   2> 448116 T926 oasc.ZkController.createEphemeralLiveNode Register node as live in ZooKeeper:/live_nodes/127.0.0.1:21024__%2Fqo
   [junit4]   2> 448117 T926 oascc.SolrZkClient.makePath makePath: /live_nodes/127.0.0.1:21024__%2Fqo
   [junit4]   2> 448120 T926 oasc.Overseer.close Overseer (id=null) closing
   [junit4]   2> 448126 T926 oasc.CorePropertiesLocator.discover Looking for core definitions underneath /usr/home/jenkins/jenkins-slave/workspace/Lucene-Solr-Tests-5.x-Java7/solr/build/solr-core/test/J0/../../../../../../../../../../../usr/home/jenkins/jenkins-slave/workspace/Lucene-Solr-Tests-5.x-Java7/solr/build/solr-core/test/J0/temp/solr.cloud.DeleteReplicaTest-FBC77DCFA2A7FB9A-001/tempDir-003
   [junit4]   2> 449667 T926 oasc.CorePropertiesLocator.discoverUnder Found core conf in /usr/home/jenkins/jenkins-slave/workspace/Lucene-Solr-Tests-5.x-Java7/solr/build/solr-core/test/J0/../../../../../../../../../../../usr/home/jenkins/jenkins-slave/workspace/Lucene-Solr-Tests-5.x-Java7/solr/build/solr-core/test/J0/temp/solr.cloud.DeleteReplicaTest-FBC77DCFA2A7FB9A-001/tempDir-003/conf/
   [junit4]   2> 449829 T926 oasc.CorePropertiesLocator.discover Found 1 core definitions
   [junit4]   2> 449830 T926 oass.SolrDispatchFilter.init user.dir=/usr/home/jenkins/jenkins-slave/workspace/Lucene-Solr-Tests-5.x-Java7/solr/build/solr-core/test/J0
   [junit4]   2> 449830 T926 oass.SolrDispatchFilter.init SolrDispatchFilter.init() done
   [junit4]   2> 450967 T926 oasc.AbstractFullDistribZkTestBase.createJettys create jetty 2
   [junit4]   2> 450968 T926 oejs.Server.doStart jetty-8.1.10.v20130312
   [junit4]   2> 450973 T926 oejus.SslContextFactory.doStart Enabled Protocols [SSLv2Hello, SSLv3, TLSv1, TLSv1.1, TLSv1.2] of [SSLv2Hello, SSLv3, TLSv1, TLSv1.1, TLSv1.2]
   [junit4]   2> 450974 T926 oejs.AbstractConnector.doStart Started SslSocketConnector@127.0.0.1:21034
   [junit4]   2> 450977 T926 oass.SolrDispatchFilter.init SolrDispatchFilter.init()
   [junit4]   2> 450977 T926 oasc.SolrResourceLoader.locateSolrHome JNDI not configured for solr (NoInitialContextEx)
   [junit4]   2> 450977 T926 oasc.SolrResourceLoader.locateSolrHome using system property solr.solr.home: ../../../../../../../../../../../usr/home/jenkins/jenkins-slave/workspace/Lucene-Solr-Tests-5.x-Java7/solr/build/solr-core/test/J0/temp/solr.cloud.DeleteReplicaTest-FBC77DCFA2A7FB9A-001/tempDir-004
   [junit4]   2> 450978 T926 oasc.SolrResourceLoader.<init> new SolrResourceLoader for directory: '../../../../../../../../../../../usr/home/jenkins/jenkins-slave/workspace/Lucene-Solr-Tests-5.x-Java7/solr/build/solr-core/test/J0/temp/solr.cloud.DeleteReplicaTest-FBC77DCFA2A7FB9A-001/tempDir-004/'
   [junit4]   2> 451015 T926 oasc.ConfigSolr.fromFile Loading container configuration from /usr/home/jenkins/jenkins-slave/workspace/Lucene-Solr-Tests-5.x-Java7/solr/build/solr-core/test/J0/../../../../../../../../../../../usr/home/jenkins/jenkins-slave/workspace/Lucene-Solr-Tests-5.x-Java7/solr/build/solr-core/test/J0/temp/solr.cloud.DeleteReplicaTest-FBC77DCFA2A7FB9A-001/tempDir-004/solr.xml
   [junit4]   2> 451067 T926 oasc.CorePropertiesLocator.<init> Config-defined core root directory: /usr/home/jenkins/jenkins-slave/workspace/Lucene-Solr-Tests-5.x-Java7/solr/build/solr-core/test/J0/../../../../../../../../../../../usr/home/jenkins/jenkins-slave/workspace/Lucene-Solr-Tests-5.x-Java7/solr/build/solr-core/test/J0/temp/solr.cloud.DeleteReplicaTest-FBC77DCFA2A7FB9A-001/tempDir-004
   [junit4]   2> 451068 T926 oasc.CoreContainer.<init> New CoreContainer 1788947099
   [junit4]   2> 451068 T926 oasc.CoreContainer.load Loading cores into CoreContainer [instanceDir=../../../../../../../../../../../usr/home/jenkins/jenkins-slave/workspace/Lucene-Solr-Tests-5.x-Java7/solr/build/solr-core/test/J0/temp/solr.cloud.DeleteReplicaTest-FBC77DCFA2A7FB9A-001/tempDir-004/]
   [junit4]   2> 451094 T926 oashc.HttpShardHandlerFactory.getParameter Setting socketTimeout to: 90000
   [junit4]   2> 451095 T926 oashc.HttpShardHandlerFactory.getParameter Setting urlScheme to: 
   [junit4]   2> 451095 T926 oashc.HttpShardHandlerFactory.getParameter Setting connTimeout to: 15000
   [junit4]   2> 451095 T926 oashc.HttpShardHandlerFactory.getParameter Setting maxConnectionsPerHost to: 20
   [junit4]   2> 451095 T926 oashc.HttpShardHandlerFactory.getParameter Setting maxConnections to: 10000
   [junit4]   2> 451096 T926 oashc.HttpShardHandlerFactory.getParameter Setting corePoolSize to: 0
   [junit4]   2> 451096 T926 oashc.HttpShardHandlerFactory.getParameter Setting maximumPoolSize to: 2147483647
   [junit4]   2> 451096 T926 oashc.HttpShardHandlerFactory.getParameter Setting maxThreadIdleTime to: 5
   [junit4]   2> 451096 T926 oashc.HttpShardHandlerFactory.getParameter Setting sizeOfQueue to: -1
   [junit4]   2> 451097 T926 oashc.HttpShardHandlerFactory.getParameter Setting fairnessPolicy to: false
   [junit4]   2> 451099 T926 oasu.UpdateShardHandler.<init> Creating UpdateShardHandler HTTP client with params: socketTimeout=340000&connTimeout=45000&retry=false
   [junit4]   2> 451101 T926 oasl.LogWatcher.createWatcher SLF4J impl is org.slf4j.impl.Log4jLoggerFactory
   [junit4]   2> 451101 T926 oasl.LogWatcher.newRegisteredLogWatcher Registering Log Listener [Log4j (org.slf4j.impl.Log4jLoggerFactory)]
   [junit4]   2> 451101 T926 oasc.CoreContainer.load Host Name: 127.0.0.1
   [junit4]   2> 451101 T926 oasc.ZkContainer.initZooKeeper Zookeeper client=127.0.0.1:21012/solr
   [junit4]   2> 451102 T926 oasc.ZkController.checkChrootPath zkHost includes chroot
   [junit4]   2> 451102 T926 oascc.SolrZkClient.createZkCredentialsToAddAutomatically Using default ZkCredentialsProvider
   [junit4]   2> 451103 T926 oascc.ConnectionManager.waitForConnected Waiting for client to connect to ZooKeeper
   [junit4]   2> 451104 T986 oascc.ConnectionManager.process Watcher org.apache.solr.common.cloud.ConnectionManager@6e8f3083 name:ZooKeeperConnection Watcher:127.0.0.1:21012 got event WatchedEvent state:SyncConnected type:None path:null path:null type:None
   [junit4]   2> 451104 T926 oascc.ConnectionManager.waitForConnected Client is connected to ZooKeeper
   [junit4]   2> 451105 T926 oascc.SolrZkClient.createZkACLProvider Using default ZkACLProvider
   [junit4]   2> 451106 T926 oascc.ConnectionManager.waitForConnected Waiting for client to connect to ZooKeeper
   [junit4]   2> 451107 T988 oascc.ConnectionManager.process Watcher org.apache.solr.common.cloud.ConnectionManager@1fff64e7 name:ZooKeeperConnection Watcher:127.0.0.1:21012/solr got event WatchedEvent state:SyncConnected type:None path:null path:null type:None
   [junit4]   2> 451107 T926 oascc.ConnectionManager.waitForConnected Client is connected to ZooKeeper
   [junit4]   2> 451112 T926 oascc.ZkStateReader.createClusterStateWatchersAndUpdate Updating cluster state from ZooKeeper... 
   [junit4]   2> 452117 T926 oasc.ZkController.createEphemeralLiveNode Register node as live in ZooKeeper:/live_nodes/127.0.0.1:21034__%2Fqo
   [junit4]   2> 452118 T926 oascc.SolrZkClient.makePath makePath: /live_nodes/127.0.0.1:21034__%2Fqo
   [junit4]   2> 452121 T926 oasc.Overseer.close Overseer (id=null) closing
   [junit4]   2> 452125 T926 oasc.CorePropertiesLocator.discover Looking for core definitions underneath /usr/home/jenkins/jenkins-slave/workspace/Lucene-Solr-Tests-5.x-Java7/solr/build/solr-core/test/J0/../../../../../../../../../../../usr/home/jenkins/jenkins-slave/workspace/Lucene-Solr-Tests-5.x-Java7/solr/build/solr-core/test/J0/temp/solr.cloud.DeleteReplicaTest-FBC77DCFA2A7FB9A-001/tempDir-004
   [junit4]   2> 452356 T926 oasc.CorePropertiesLocator.discoverUnder Found core conf in /usr/home/jenkins/jenkins-slave/workspace/Lucene-Solr-Tests-5.x-Java7/solr/build/solr-core/test/J0/../../../../../../../../../../../usr/home/jenkins/jenkins-slave/workspace/Lucene-Solr-Tests-5.x-Java7/solr/build/solr-core/test/J0/temp/solr.cloud.DeleteReplicaTest-FBC77DCFA2A7FB9A-001/tempDir-004/conf/
   [junit4]   2> 453794 T926 oasc.CorePropertiesLocator.discover Found 1 core definitions
   [junit4]   2> 453796 T926 oass.SolrDispatchFilter.init user.dir=/usr/home/jenkins/jenkins-slave/workspace/Lucene-Solr-Tests-5.x-Java7/solr/build/solr-core/test/J0
   [junit4]   2> 453797 T926 oass.SolrDispatchFilter.init SolrDispatchFilter.init() done
   [junit4]   2> 455107 T926 oasc.AbstractFullDistribZkTestBase.createJettys create jetty 3
   [junit4]   2> 455108 T926 oejs.Server.doStart jetty-8.1.10.v20130312
   [junit4]   2> 455115 T926 oejus.SslContextFactory.doStart Enabled Protocols [SSLv2Hello, SSLv3, TLSv1, TLSv1.1, TLSv1.2] of [SSLv2Hello, SSLv3, TLSv1, TLSv1.1, TLSv1.2]
   [junit4]   2> 455117 T926 oejs.AbstractConnector.doStart Started SslSocketConnector@127.0.0.1:21051
   [junit4]   2> 455121 T926 oass.SolrDispatchFilter.init SolrDispatchFilter.init()
   [junit4]   2> 455121 T926 oasc.SolrResourceLoader.locateSolrHome JNDI not configured for solr (NoInitialContextEx)
   [junit4]   2> 455121 T926 oasc.SolrResourceLoader.locateSolrHome using system property solr.solr.home: ../../../../../../../../../../../usr/home/jenkins/jenkins-slave/workspace/Lucene-Solr-Tests-5.x-Java7/solr/build/solr-core/test/J0/temp/solr.cloud.DeleteReplicaTest-FBC77DCFA2A7FB9A-001/tempDir-005
   [junit4]   2> 455122 T926 oasc.SolrResourceLoader.<init> new SolrResourceLoader for directory: '../../../../../../../../../../../usr/home/jenkins/jenkins-slave/workspace/Lucene-Solr-Tests-5.x-Java7/solr/build/solr-core/test/J0/temp/solr.cloud.DeleteReplicaTest-FBC77DCFA2A7FB9A-001/tempDir-005/'
   [junit4]   2> 455175 T926 oasc.ConfigSolr.fromFile Loading container configuration from /usr/home/jenkins/jenkins-slave/workspace/Lucene-Solr-Tests-5.x-Java7/solr/build/solr-core/test/J0/../../../../../../../../../../../usr/home/jenkins/jenkins-slave/workspace/Lucene-Solr-Tests-5.x-Java7/solr/build/solr-core/test/J0/temp/solr.cloud.DeleteReplicaTest-FBC77DCFA2A7FB9A-001/tempDir-005/solr.xml
   [junit4]   2> 455225 T926 oasc.CorePropertiesLocator.<init> Config-defined core root directory: /usr/home/jenkins/jenkins-slave/workspace/Lucene-Solr-Tests-5.x-Java7/solr/build/solr-core/test/J0/../../../../../../../../../../../usr/home/jenkins/jenkins-slave/workspace/Lucene-Solr-Tests-5.x-Java7/solr/build/solr-core/test/J0/temp/solr.cloud.DeleteReplicaTest-FBC77DCFA2A7FB9A-001/tempDir-005
   [junit4]   2> 455226 T926 oasc.CoreContainer.<init> New CoreContainer 936357613
   [junit4]   2> 455226 T926 oasc.CoreContainer.load Loading cores into CoreContainer [instanceDir=../../../../../../../../../../../usr/home/jenkins/jenkins-slave/workspace/Lucene-Solr-Tests-5.x-Java7/solr/build/solr-core/test/J0/temp/solr.cloud.DeleteReplicaTest-FBC77DCFA2A7FB9A-001/tempDir-005/]
   [junit4]   2> 455227 T926 oashc.HttpShardHandlerFactory.getParameter Setting socketTimeout to: 90000
   [junit4]   2> 455228 T926 oashc.HttpShardHandlerFactory.getParameter Setting urlScheme to: 
   [junit4]   2> 455228 T926 oashc.HttpShardHandlerFactory.getParameter Setting connTimeout to: 15000
   [junit4]   2> 455228 T926 oashc.HttpShardHandlerFactory.getParameter Setting maxConnectionsPerHost to: 20
   [junit4]   2> 455228 T926 oashc.HttpShardHandlerFactory.getParameter Setting maxConnections to: 10000
   [junit4]   2> 455228 T926 oashc.HttpShardHandlerFactory.getParameter Setting corePoolSize to: 0
   [junit4]   2> 455229 T926 oashc.HttpShardHandlerFactory.getParameter Setting maximumPoolSize to: 2147483647
   [junit4]   2> 455229 T926 oashc.HttpShardHandlerFactory.getParameter Setting maxThreadIdleTime to: 5
   [junit4]   2> 455229 T926 oashc.HttpShardHandlerFactory.getParameter Setting sizeOfQueue to: -1
   [junit4]   2> 455229 T926 oashc.HttpShardHandlerFactory.getParameter Setting fairnessPolicy to: false
   [junit4]   2> 455232 T926 oasu.UpdateShardHandler.<init> Creating UpdateShardHandler HTTP client with params: socketTimeout=340000&connTimeout=45000&retry=false
   [junit4]   2> 455233 T926 oasl.LogWatcher.createWatcher SLF4J impl is org.slf4j.impl.Log4jLoggerFactory
   [junit4]   2> 455234 T926 oasl.LogWatcher.newRegisteredLogWatcher Registering Log Listener [Log4j (org.slf4j.impl.Log4jLoggerFactory)]
   [junit4]   2> 455234 T926 oasc.CoreContainer.load Host Name: 127.0.0.1
   [junit4]   2> 455234 T926 oasc.ZkContainer.initZooKeeper Zookeeper client=127.0.0.1:21012/solr
   [junit4]   2> 455234 T926 oasc.ZkController.checkChrootPath zkHost includes chroot
   [junit4]   2> 455235 T926 oascc.SolrZkClient.createZkCredentialsToAddAutomatically Using default ZkCredentialsProvider
   [junit4]   2> 455235 T926 oascc.ConnectionManager.waitForConnected Waiting for client to connect to ZooKeeper
   [junit4]   2> 455237 T1001 oascc.ConnectionManager.process Watcher org.apache.solr.common.cloud.ConnectionManager@5a9b41cc name:ZooKeeperConnection Watcher:127.0.0.1:21012 got event WatchedEvent state:SyncConnected type:None path:null path:null type:None
   [junit4]   2> 455237 T926 oascc.ConnectionManager.waitForConnected Client is connected to ZooKeeper
   [junit4]   2> 455238 T926 oascc.SolrZkClient.createZkACLProvider Using default ZkACLProvider
   [junit4]   2> 455239 T926 oascc.ConnectionManager.waitForConnected Waiting for client to connect to ZooKeeper
   [junit4]   2> 455240 T1003 oascc.ConnectionManager.process Watcher org.apache.solr.common.cloud.ConnectionManager@7c380011 name:ZooKeeperConnection Watcher:127.0.0.1:21012/solr got event WatchedEvent state:SyncConnected type:None path:null path:null type:None
   [junit4]   2> 455241 T926 oascc.ConnectionManager.waitForConnected Client is connected to ZooKeeper
   [junit4]   2> 455245 T926 oascc.ZkStateReader.createClusterStateWatchersAndUpdate Updating cluster state from ZooKeeper... 
   [junit4]   2> 456250 T926 oasc.ZkController.createEphemeralLiveNode Register node as live in ZooKeeper:/live_nodes/127.0.0.1:21051__%2Fqo
   [junit4]   2> 456251 T926 oascc.SolrZkClient.makePath makePath: /live_nodes/127.0.0.1:21051__%2Fqo
   [junit4]   2> 456254 T926 oasc.Overseer.close Overseer (id=null) closing
   [junit4]   2> 456258 T926 oasc.CorePropertiesLocator.discover Looking for core definitions underneath /usr/home/jenkins/jenkins-slave/workspace/Lucene-Solr-Tests-5.x-Java7/solr/build/solr-core/test/J0/../../../../../../../../../../../usr/home/jenkins/jenkins-slave/workspace/Lucene-Solr-Tests-5.x-Java7/solr/build/solr-core/test/J0/temp/solr.cloud.DeleteReplicaTest-FBC77DCFA2A7FB9A-001/tempDir-005
   [junit4]   2> 457234 T926 oasc.CorePropertiesLocator.discoverUnder Found core conf in /usr/home/jenkins/jenkins-slave/workspace/Lucene-Solr-Tests-5.x-Java7/solr/build/solr-core/test/J0/../../../../../../../../../../../usr/home/jenkins/jenkins-slave/workspace/Lucene-Solr-Tests-5.x-Java7/solr/build/solr-core/test/J0/temp/solr.cloud.DeleteReplicaTest-FBC77DCFA2A7FB9A-001/tempDir-005/conf/
   [junit4]   2> 457292 T926 oasc.CorePropertiesLocator.discover Found 1 core definitions
   [junit4]   2> 457293 T926 oass.SolrDispatchFilter.init user.dir=/usr/home/jenkins/jenkins-slave/workspace/Lucene-Solr-Tests-5.x-Java7/solr/build/solr-core/test/J0
   [junit4]   2> 457293 T926 oass.SolrDispatchFilter.init SolrDispatchFilter.init() done
   [junit4]   2> 458384 T926 oasc.AbstractFullDistribZkTestBase.createJettys create jetty 4
   [junit4]   2> 458385 T926 oejs.Server.doStart jetty-8.1.10.v20130312
   [junit4]   2> 458389 T926 oejus.SslContextFactory.doStart Enabled Protocols [SSLv2Hello, SSLv3, TLSv1, TLSv1.1, TLSv1.2] of [SSLv2Hello, SSLv3, TLSv1, TLSv1.1, TLSv1.2]
   [junit4]   2> 458391 T926 oejs.AbstractConnector.doStart Started SslSocketConnector@127.0.0.1:21059
   [junit4]   2> 458394 T926 oass.SolrDispatchFilter.init SolrDispatchFilter.init()
   [junit4]   2> 458394 T926 oasc.SolrResourceLoader.locateSolrHome JNDI not configured for solr (NoInitialContextEx)
   [junit4]   2> 458394 T926 oasc.SolrResourceLoader.locateSolrHome using system property solr.solr.home: /usr/home/jenkins/jenkins-slave/workspace/Lucene-Solr-Tests-5.x-Java7/solr/build/solr-core/test/J0/temp/solr.cloud.DeleteReplicaTest-FBC77DCFA2A7FB9A-001/tempDir-006
   [junit4]   2> 458394 T926 oasc.SolrResourceLoader.<init> new SolrResourceLoader for directory: '/usr/home/jenkins/jenkins-slave/workspace/Lucene-Solr-Tests-5.x-Java7/solr/build/solr-core/test/J0/temp/solr.cloud.DeleteReplicaTest-FBC77DCFA2A7FB9A-001/tempDir-006/'
   [junit4]   2> 458425 T926 oasc.ConfigSolr.fromFile Loading container configuration from /usr/home/jenkins/jenkins-slave/workspace/Lucene-Solr-Tests-5.x-Java7/solr/build/solr-core/test/J0/temp/solr.cloud.DeleteReplicaTest-FBC77DCFA2A7FB9A-001/tempDir-006/solr.xml
   [junit4]   2> 458472 T926 oasc.CorePropertiesLocator.<init> Config-defined core root directory: /usr/home/jenkins/jenkins-slave/workspace/Lucene-Solr-Tests-5.x-Java7/solr/build/solr-core/test/J0/temp/solr.cloud.DeleteReplicaTest-FBC77DCFA2A7FB9A-001/tempDir-006
   [junit4]   2> 458473 T926 oasc.CoreContainer.<init> New CoreContainer 1991296925
   [junit4]   2> 458473 T926 oasc.CoreContainer.load Loading cores into CoreContainer [instanceDir=/usr/home/jenkins/jenkins-slave/workspace/Lucene-Solr-Tests-5.x-Java7/solr/build/solr-core/test/J0/temp/solr.cloud.DeleteReplicaTest-FBC77DCFA2A7FB9A-001/tempDir-006/]
   [junit4]   2> 458474 T926 oashc.HttpShardHandlerFactory.getParameter Setting socketTimeout to: 90000
   [junit4]   2> 458474 T926 oashc.HttpShardHandlerFactory.getParameter Setting urlScheme to: 
   [junit4]   2> 458474 T926 oashc.HttpShardHandlerFactory.getParameter Setting connTimeout to: 15000
   [junit4]   2> 458475 T926 oashc.HttpShardHandlerFactory.getParameter Setting maxConnectionsPerHost to: 20
   [junit4]   2> 458475 T926 oashc.HttpShardHandlerFactory.getParameter Setting maxConnections to: 10000
   [junit4]   2> 458475 T926 oashc.HttpShardHandlerFactory.getParameter Setting corePoolSize to: 0
   [junit4]   2> 458475 T926 oashc.HttpShardHandlerFactory.getParameter Setting maximumPoolSize to: 2147483647
   [junit4]   2> 458476 T926 oashc.HttpShardHandlerFactory.getParameter Setting maxThreadIdleTime to: 5
   [junit4]   2> 458476 T926 oashc.HttpShardHandlerFactory.getParameter Setting sizeOfQueue to: -1
   [junit4]   2> 458476 T926 oashc.HttpShardHandlerFactory.getParameter Setting fairnessPolicy to: false
   [junit4]   2> 458478 T926 oasu.UpdateShardHandler.<init> Creating UpdateShardHandler HTTP client with params: socketTimeout=340000&connTimeout=45000&retry=false
   [junit4]   2> 458480 T926 oasl.LogWatcher.createWatcher SLF4J impl is org.slf4j.impl.Log4jLoggerFactory
   [junit4]   2> 458480 T926 oasl.LogWatcher.newRegisteredLogWatcher Registering Log Listener [Log4j (org.slf4j.impl.Log4jLoggerFactory)]
   [junit4]   2> 458480 T926 oasc.CoreContainer.load Host Name: 127.0.0.1
   [junit4]   2> 458481 T926 oasc.ZkContainer.initZooKeeper Zookeeper client=127.0.0.1:21012/solr
   [junit4]   2> 458481 T926 oasc.ZkController.checkChrootPath zkHost includes chroot
   [junit4]   2> 458481 T926 oascc.SolrZkClient.createZkCredentialsToAddAutomatically Using default ZkCredentialsProvider
   [junit4]   2> 458482 T926 oascc.ConnectionManager.waitForConnected Waiting for client to connect to ZooKeeper
   [junit4]   2> 458483 T1016 oascc.ConnectionManager.process Watcher org.apache.solr.common.cloud.ConnectionManager@4cbf9c9b name:ZooKeeperConnection Watcher:127.0.0.1:21012 got event WatchedEvent state:SyncConnected type:None path:null path:null type:None
   [junit4]   2> 458484 T926 oascc.ConnectionManager.waitForConnected Client is connected to ZooKeeper
   [junit4]   2> 458484 T926 oascc.SolrZkClient.createZkACLProvider Using default ZkACLProvider
   [junit4]   2> 458485 T926 oascc.ConnectionManager.waitForConnected Waiting for client to connect to ZooKeeper
   [junit4]   2> 458486 T1018 oascc.ConnectionManager.process Watcher org.apache.solr.common.cloud.ConnectionManager@159013fc name:ZooKeeperConnection Watcher:127.0.0.1:21012/solr got event WatchedEvent state:SyncConnected type:None path:null path:null type:None
   [junit4]   2> 458486 T926 oascc.ConnectionManager.waitForConnected Client is connected to ZooKeeper
   [junit4]   2> 458491 T926 oascc.ZkStateReader.createClusterStateWatchersAndUpdate Updating cluster state from ZooKeeper... 
   [junit4]   2> 459495 T926 oasc.ZkController.createEphemeralLiveNode Register node as live in ZooKeeper:/live_nodes/127.0.0.1:21059__%2Fqo
   [junit4]   2> 459496 T926 oascc.SolrZkClient.makePath makePath: /live_nodes/127.0.0.1:21059__%2Fqo
   [junit4]   2> 459500 T926 oasc.Overseer.close Overseer (id=null) closing
   [junit4]   2> 459504 T926 oasc.CorePropertiesLocator.discover Looking for core definitions underneath /usr/home/jenkins/jenkins-slave/workspace/Lucene-Solr-Tests-5.x-Java7/solr/build/solr-core/test/J0/temp/solr.cloud.DeleteReplicaTest-FBC77DCFA2A7FB9A-001/tempDir-006
   [junit4]   2> 460119 T926 oasc.CorePropertiesLocator.discoverUnder Found core conf in /usr/home/jenkins/jenkins-slave/workspace/Lucene-Solr-Tests-5.x-Java7/solr/build/solr-core/test/J0/temp/solr.cloud.DeleteReplicaTest-FBC77DCFA2A7FB9A-001/tempDir-006/conf/
   [junit4]   2> 460236 T926 oasc.CorePropertiesLocator.discover Found 1 core definitions
   [junit4]   2> 460238 T926 oass.SolrDispatchFilter.init user.dir=/usr/home/jenkins/jenkins-slave/workspace/Lucene-Solr-Tests-5.x-Java7/solr/build/solr-core/test/J0
   [junit4]   2> 460238 T926 oass.SolrDispatchFilter.init SolrDispatchFilter.init() done
   [junit4]   2> 460245 T926 oascc.SolrZkClient.createZkCredentialsToAddAutomatically Using default ZkCredentialsProvider
   [junit4]   2> 460245 T926 oascc.ConnectionManager.waitForConnected Waiting for client to connect to ZooKeeper
   [junit4]   2> 460246 T1022 oascc.ConnectionManager.process Watcher org.apache.solr.common.cloud.ConnectionManager@602aa3e4 name:ZooKeeperConnection Watcher:127.0.0.1:21012/solr got event WatchedEvent state:SyncConnected type:None path:null path:null type:None
   [junit4]   2> 460247 T926 oascc.ConnectionManager.waitForConnected Client is connected to ZooKeeper
   [junit4]   2> 460247 T926 oascc.SolrZkClient.createZkACLProvider Using default ZkACLProvider
   [junit4]   2> 460248 T926 oascc.ZkStateReader.createClusterStateWatchersAndUpdate Updating cluster state from ZooKeeper... 
   [junit4]   2> 460251 T926 oasc.AbstractFullDistribZkTestBase.createCollection Creating collection with stateFormat=2: delLiveColl
   [junit4]   2> 460251 T926 oascc.SolrZkClient.createZkCredentialsToAddAutomatically Using default ZkCredentialsProvider
   [junit4]   2> 460252 T926 oascc.ConnectionManager.waitForConnected Waiting for client to connect to ZooKeeper
   [junit4]   2> 460253 T1024 oascc.ConnectionManager.process Watcher org.apache.solr.common.cloud.ConnectionManager@48f52dd8 name:ZooKeeperConnection Watcher:127.0.0.1:21012/solr got event WatchedEvent state:SyncConnected type:None path:null path:null type:None
   [junit4]   2> 460253 T926 oascc.ConnectionManager.waitForConnected Client is connected to ZooKeeper
   [junit4]   2> 460253 T926 oascc.SolrZkClient.createZkACLProvider Using default ZkACLProvider
   [junit4]   2> 460254 T926 oascc.ZkStateReader.createClusterStateWatchersAndUpdate Updating cluster state from ZooKeeper... 
   [junit4]   2> 460386 T1008 oasha.CollectionsHandler.handleCreateAction Creating Collection : wt=javabin&numShards=2&version=2&name=delLiveColl&replicationFactor=2&action=CREATE&stateFormat=2&maxShardsPerNode=2
   [junit4]   2> 460388 T959 oasc.DistributedQueue$LatchChildWatcher.process LatchChildWatcher fired on path: /overseer/collection-queue-work state: SyncConnected type NodeChildrenChanged
   [junit4]   2> 460389 T952 oasc.OverseerCollectionProcessor.run Overseer Collection Processor: Get the message id:/overseer/collection-queue-work/qn-0000000000 message:{
   [junit4]   2> 	  "operation":"create",
   [junit4]   2> 	  "fromApi":"true",
   [junit4]   2> 	  "name":"delLiveColl",
   [junit4]   2> 	  "replicationFactor":"2",
   [junit4]   2> 	  "numShards":"2",
   [junit4]   2> 	  "maxShardsPerNode":"2",
   [junit4]   2> 	  "stateFormat":"2"}
   [junit4]   2> 460394 T1026 oasc.OverseerCollectionProcessor.processMessage WARN OverseerCollectionProcessor.processMessage : create , {
   [junit4]   2> 	  "operation":"create",
   [junit4]   2> 	  "fromApi":"true",
   [junit4]   2> 	  "name":"delLiveColl",
   [junit4]   2> 	  "replicationFactor":"2",
   [junit4]   2> 	  "numShards":"2",
   [junit4]   2> 	  "maxShardsPerNode":"2",
   [junit4]   2> 	  "stateFormat":"2"}
   [junit4]   2> 460400 T1026 oasc.OverseerCollectionProcessor.createConfNode Only one config set found in zk - using it:conf1
   [junit4]   2> 460400 T1026 oasc.OverseerCollectionProcessor.createConfNode creating collections conf node /collections/delLiveColl 
   [junit4]   2> 460401 T1026 oascc.SolrZkClient.makePath makePath: /collections/delLiveColl
   [junit4]   2> 460403 T959 oasc.DistributedQueue$LatchChildWatcher.process LatchChildWatcher fired on path: /overseer/queue state: SyncConnected type NodeChildrenChanged
   [junit4]   2> 460406 T951 oasc.Overseer$ClusterStateUpdater.buildCollection building a new collection: delLiveColl
   [junit4]   2> 460406 T951 oasc.Overseer$ClusterStateUpdater.createCollection Create collection delLiveColl with shards [shard1, shard2]
   [junit4]   2> 460406 T951 oasc.Overseer$ClusterStateUpdater.createCollection state version delLiveColl 2
   [junit4]   2> 460409 T951 oasc.Overseer$ClusterStateUpdater.updateZkStates going to create_collection /collections/delLiveColl/state.json
   [junit4]   2> 460410 T959 oascc.ZkStateReader$2.process A cluster state change: WatchedEvent state:SyncConnected type:NodeDataChanged path:/clusterstate.json, has occurred - updating... (live nodes size: 5)
   [junit4]   2> 460410 T1004 oascc.ZkStateReader$2.process A cluster state change: WatchedEvent state:SyncConnected type:NodeDataChanged path:/clusterstate.json, has occurred - updating... (live nodes size: 5)
   [junit4]   2> 460410 T974 oascc.ZkStateReader$2.process A cluster state change: WatchedEvent state:SyncConnected type:NodeDataChanged path:/clusterstate.json, has occurred - updating... (live nodes size: 5)
   [junit4]   2> 460410 T989 oascc.ZkStateReader$2.process A cluster state change: WatchedEvent state:SyncConnected type:NodeDataChanged path:/clusterstate.json, has occurred - updating... (live nodes size: 5)
   [junit4]   2> 460410 T960 oascc.ZkStateReader$2.process A cluster state change: WatchedEvent state:SyncConnected type:NodeDataChanged path:/clusterstate.json, has occurred - updating... (live nodes size: 5)
   [junit4]   2> 460410 T1028 oascc.ZkStateReader$2.process A cluster state change: WatchedEvent state:SyncConnected type:NodeDataChanged path:/clusterstate.json, has occurred - updating... (live nodes size: 5)
   [junit4]   2> 460410 T1019 oascc.ZkStateReader$2.process A cluster state change: WatchedEvent state:SyncConnected type:NodeDataChanged path:/clusterstate.json, has occurred - updating... (live nodes size: 5)
   [junit4]   2> 460410 T1027 oascc.ZkStateReader$2.process A cluster state change: WatchedEvent state:SyncConnected type:NodeDataChanged path:/clusterstate.json, has occurred - updating... (live nodes size: 5)
   [junit4]   2> 460504 T1026 oasc.OverseerCollectionProcessor.createCollection Creating SolrCores for new collection delLiveColl, shardNames [shard1, shard2] , replicationFactor : 2
   [junit4]   2> 460505 T1026 oasc.OverseerCollectionProcessor.createCollection Creating shard delLiveColl_shard1_replica1 as part of slice shard1 of collection delLiveColl on 127.0.0.1:21059__%2Fqo
   [junit4]   2> 460506 T1026 oasc.OverseerCollectionProcessor.createCollection Creating shard delLiveColl_shard1_replica2 as part of slice shard1 of collection delLiveColl on 127.0.0.1:21016__%2Fqo
   [junit4]   2> 460508 T1026 oasc.OverseerCollectionProcessor.createCollection Creating shard delLiveColl_shard2_replica1 as part of slice shard2 of collection delLiveColl on 127.0.0.1:21024__%2Fqo
   [junit4]   2> 460509 T1026 oasc.OverseerCollectionProcessor.createCollection Creating shard delLiveColl_shard2_replica2 as part of slice shard2 of collection delLiveColl on 127.0.0.1:21034__%2Fqo
   [junit4]   2> 460635 T963 oasha.CoreAdminHandler.handleCreateAction core create command wt=javabin&numShards=2&collection=delLiveColl&version=2&qt=/admin/cores&name=delLiveColl_shard2_replica1&action=CREATE&shard=shard2&collection.configName=conf1
   [junit4]   2> 460635 T943 oasha.CoreAdminHandler.handleCreateAction core create command wt=javabin&numShards=2&collection=delLiveColl&version=2&qt=/admin/cores&name=delLiveColl_shard1_replica2&action=CREATE&shard=shard1&collection.configName=conf1
   [junit4]   2> 460648 T943 oasc.ZkController.publish publishing core=delLiveColl_shard1_replica2 state=down collection=delLiveColl
   [junit4]   2> 460649 T963 oasc.ZkController.publish publishing core=delLiveColl_shard2_replica1 state=down collection=delLiveColl
   [junit4]   2> 460649 T1009 oasha.CoreAdminHandler.handleCreateAction core create command wt=javabin&numShards=2&collection=delLiveColl&version=2&qt=/admin/cores&name=delLiveColl_shard1_replica1&action=CREATE&shard=shard1&collection.configName=conf1
   [junit4]   2> 460649 T978 oasha.CoreAdminHandler.handleCreateAction core create command wt=javabin&numShards=2&collection=delLiveColl&version=2&qt=/admin/cores&name=delLiveColl_shard2_replica2&action=CREATE&shard=shard2&collection.configName=conf1
   [junit4]   2> 460651 T959 oasc.DistributedQueue$LatchChildWatcher.process LatchChildWatcher fired on path: /overseer/queue state: SyncConnected type NodeChildrenChanged
   [junit4]   2> 460652 T943 oasc.ZkController.preRegister Registering watch for external collection delLiveColl
   [junit4]   2> 460654 T1009 oasc.ZkController.publish publishing core=delLiveColl_shard1_replica1 state=down collection=delLiveColl
   [junit4]   2> 460654 T951 oasc.Overseer$ClusterStateUpdater.updateState Update state numShards=2 message={
   [junit4]   2> 	  "numShards":"2",
   [junit4]   2> 	  "node_name":"127.0.0.1:21016__%2Fqo",
   [junit4]   2> 	  "collection":"delLiveColl",
   [junit4]   2> 	  "operation":"state",
   [junit4]   2> 	  "roles":null,
   [junit4]   2> 	  "state":"down",
   [junit4]   2> 	  "base_url":"https://127.0.0.1:21016/_/qo",
   [junit4]   2> 	  "core":"delLiveColl_shard1_replica2",
   [junit4]   2> 	  "shard":"shard1"}
   [junit4]   2> 460654 T978 oasc.ZkController.publish publishing core=delLiveColl_shard2_replica2 state=down collection=delLiveColl
   [junit4]   2> 460656 T1009 oasc.ZkController.preRegister Registering watch for external collection delLiveColl
   [junit4]   2> 460657 T1009 oascc.ZkStateReader.addZkWatch addZkWatch delLiveColl
   [junit4]   2> 460657 T1009 oascc.ZkStateReader.addZkWatch Updating collection state at /collections/delLiveColl/state.json from ZooKeeper... 
   [junit4]   2> 460657 T978 oasc.ZkController.preRegister Registering watch for external collection delLiveColl
   [junit4]   2> 460658 T978 oascc.ZkStateReader.addZkWatch addZkWatch delLiveColl
   [junit4]   2> 460659 T978 oascc.ZkStateReader.addZkWatch Updating collection state at /collections/delLiveColl/state.json from ZooKeeper... 
   [junit4]   2> 460659 T1009 oascc.ZkStateReader.updateWatchedCollection Updating data for delLiveColl to ver 0 
   [junit4]   2> 460659 T1009 oasc.ZkController.waitForCoreNodeName look for our core node name
   [junit4]   2> 460660 T978 oascc.ZkStateReader.updateWatchedCollection Updating data for delLiveColl to ver 0 
   [junit4]   2> 460661 T978 oasc.ZkController.waitForCoreNodeName look for our core node name
   [junit4]   2> 460661 T951 oasc.Overseer$ClusterStateUpdater.updateZkStates going to update_collection /collections/delLiveColl/state.json
   [junit4]   2> 460662 T989 oascc.ZkStateReader$7.process A cluster state change: WatchedEvent state:SyncConnected type:NodeDataChanged path:/collections/delLiveColl/state.json, has occurred - updating... 
   [junit4]   2> 460662 T1019 oascc.ZkStateReader$7.process A cluster state change: WatchedEvent state:SyncConnected type:NodeDataChanged path:/collections/delLiveColl/state.json, has occurred - updating... 
   [junit4]   2> 460663 T989 oascc.ZkStateReader.updateWatchedCollection Updating data for delLiveColl to ver 1 
   [junit4]   2> 460663 T1019 oascc.ZkStateReader.updateWatchedCollection Updating data for delLiveColl to ver 1 
   [junit4]   2> 460664 T943 oascc.ZkStateReader.addZkWatch addZkWatch delLiveColl
   [junit4]   2> 460664 T943 oascc.ZkStateReader.addZkWatch Updating collection state at /collections/delLiveColl/state.json from ZooKeeper... 
   [junit4]   2> 460665 T943 oascc.ZkStateReader.updateWatchedCollection Updating data for delLiveColl to ver 1 
   [junit4]   2> 460666 T943 oasc.ZkController.waitForCoreNodeName look for our core node name
   [junit4]   2> 460666 T943 oasc.ZkController.waitForShardId waiting to find shard id in clusterstate for delLiveColl_shard1_replica2
   [junit4]   2> 460666 T943 oasc.ZkController.createCollectionZkNode Check for collection zkNode:delLiveColl
   [junit4]   2> 460667 T943 oasc.ZkController.createCollectionZkNode Collection zkNode exists
   [junit4]   2> 460667 T943 oascc.ZkStateReader.readConfigName Load collection config from:/collections/delLiveColl
   [junit4]   2> 460668 T943 oascc.ZkStateReader.readConfigName path=/collections/delLiveColl configName=conf1 specified config exists in ZooKeeper
   [junit4]   2> 460668 T951 oascc.ZkStateReader.updateWatchedCollection Updating data for delLiveColl to ver 1 
   [junit4]   2> 460668 T943 oasc.SolrResourceLoader.<init> new SolrResourceLoader for directory: '/usr/home/jenkins/jenkins-slave/workspace/Lucene-Solr-Tests-5.x-Java7/solr/build/solr-core/test/J0/temp/solr.cloud.DeleteReplicaTest-FBC77DCFA2A7FB9A-001/tempDir-002/delLiveColl_shard1_replica2/'
   [junit4]   2> 460669 T951 oasc.Overseer$ClusterStateUpdater.updateState Update state numShards=2 message={
   [junit4]   2> 	  "numShards":"2",
   [junit4]   2> 	  "node_name":"127.0.0.1:21024__%2Fqo",
   [junit4]   2> 	  "collection":"delLiveColl",
   [junit4]   2> 	  "operation":"state",
   [junit4]   2> 	  "roles":null,
   [junit4]   2> 	  "state":"down",
   [junit4]   2> 	  "base_url":"https://127.0.0.1:21024/_/qo",
   [junit4]   2> 	  "core":"delLiveColl_shard2_replica1",
   [junit4]   2> 	  "shard":"shard2"}
   [junit4]   2> 460671 T959 oasc.DistributedQueue$LatchChildWatcher.process LatchChildWatcher fired on path: /overseer/queue state: SyncConnected type NodeChildrenChanged
   [junit4]   2> 460672 T951 oasc.Overseer$ClusterStateUpdater.updateZkStates going to update_collection /collections/delLiveColl/state.json
   [junit4]   2> 460672 T959 oascc.ZkStateReader$7.process A cluster state change: WatchedEvent state:SyncConnected type:NodeDataChanged path:/collections/delLiveColl/state.json, has occurred - updating... 
   [junit4]   2> 460673 T989 oascc.ZkStateReader$7.process A cluster state change: WatchedEvent state:SyncConnected type:NodeDataChanged path:/collections/delLiveColl/state.json, has occurred - updating... 
   [junit4]   2> 460673 T1019 oascc.ZkStateReader$7.process A cluster state change: WatchedEvent state:SyncConnected type:NodeDataChanged path:/collections/delLiveColl/state.json, has occurred - updating... 
   [junit4]   2> 460674 T989 oascc.ZkStateReader.updateWatchedCollection Updating data for delLiveColl to ver 2 
   [junit4]   2> 460674 T1019 oascc.ZkStateReader.updateWatchedCollection Updating data for delLiveColl to ver 2 
   [junit4]   2> 460675 T959 oascc.ZkStateReader.updateWatchedCollection Updating data for delLiveColl to ver 2 
   [junit4]   2> 460678 T963 oasc.ZkController.preRegister Registering watch for external collection delLiveColl
   [junit4]   2> 460679 T963 oascc.ZkStateReader.addZkWatch addZkWatch delLiveColl
   [junit4]   2> 460679 T951 oascc.ZkStateReader.updateWatchedCollection Updating data for delLiveColl to ver 2 
   [junit4]   2> 460679 T963 oascc.ZkStateReader.addZkWatch Updating collection state at /collections/delLiveColl/state.json from ZooKeeper... 
   [junit4]   2> 460679 T951 oasc.Overseer$ClusterStateUpdater.updateState Update state numShards=2 message={
   [junit4]   2> 	  "numShards":"2",
   [junit4]   2> 	  "node_name":"127.0.0.1:21059__%2Fqo",
   [junit4]   2> 	  "collection":"delLiveColl",
   [junit4]   2> 	  "operation":"state",
   [junit4]   2> 	  "roles":null,
   [junit4]   2> 	  "state":"down",
   [junit4]   2> 	  "base_url":"https://127.0.0.1:21059/_/qo",
   [junit4]   2> 	  "core":"delLiveColl_shard1_replica1",
   [junit4]   2> 	  "shard":"shard1"}
   [junit4]   2> 460681 T963 oascc.ZkStateReader.updateWatchedCollection Updating data for delLiveColl to ver 2 
   [junit4]   2> 460681 T963 oasc.ZkController.waitForCoreNodeName look for our core node name
   [junit4]   2> 460682 T963 oasc.ZkController.waitForShardId waiting to find shard id in clusterstate for delLiveColl_shard2_replica1
   [junit4]   2> 460682 T963 oasc.ZkController.createCollectionZkNode Check for collection zkNode:delLiveColl
   [junit4]   2> 460682 T959 oasc.DistributedQueue$LatchChildWatcher.process LatchChildWatcher fired on path: /overseer/queue state: SyncConnected type NodeChildrenChanged
   [junit4]   2> 460683 T963 oasc.ZkController.createCollectionZkNode Collection zkNode exists
   [junit4]   2> 460683 T951 oasc.Overseer$ClusterStateUpdater.updateZkStates going to update_collection /collections/delLiveColl/state.json
   [junit4]   2> 460683 T963 oascc.ZkStateReader.readConfigName Load collection config from:/collections/delLiveColl
   [junit4]   2> 460684 T959 oascc.ZkStateReader$7.process A cluster state change: WatchedEvent state:SyncConnected type:NodeDataChanged path:/collections/delLiveColl/state.json, has occurred - updating... 
   [junit4]   2> 460684 T974 oascc.ZkStateReader$7.process A cluster state change: WatchedEvent state:SyncConnected type:NodeDataChanged path:/collections/delLiveColl/state.json, has occurred - updating... 
   [junit4]   2> 460685 T963 oascc.ZkStateReader.readConfigName path=/collections/delLiveColl configName=conf1 specified config exists in ZooKeeper
   [junit4]   2> 460684 T1019 oascc.ZkStateReader$7.process A cluster state change: WatchedEvent state:SyncConnected type:NodeDataChanged path:/collections/delLiveColl/state.json, has occurred - updating... 
   [junit4]   2> 460684 T989 oascc.ZkStateReader$7.process A cluster state change: WatchedEvent state:SyncConnected type:NodeDataChanged path:/collections/delLiveColl/state.json, has occurred - updating... 
   [junit4]   2> 460685 T974 oascc.ZkStateReader.updateWatchedCollection Updating data for delLiveColl to ver 3 
   [junit4]   2> 460685 T963 oasc.SolrResourceLoader.<init> new SolrResourceLoader for directory: '../../../../../../../../../../../usr/home/jenkins/jenkins-slave/workspace/Lucene-Solr-Tests-5.x-Java7/solr/build/solr-core/test/J0/temp/solr.cloud.DeleteReplicaTest-FBC77DCFA2A7FB9A-001/tempDir-003/delLiveColl_shard2_replica1/'
   [junit4]   2> 460686 T1019 oascc.ZkStateReader.updateWatchedCollection Updating data for delLiveColl to ver 3 
   [junit4]   2> 460686 T989 oascc.ZkStateReader.updateWatchedCollection Updating data for delLiveColl to ver 3 
   [junit4]   2> 460686 T959 oascc.ZkStateReader.updateWatchedCollection Updating data for delLiveColl to ver 3 
   [junit4]   2> 460690 T951 oascc.ZkStateReader.updateWatchedCollection Updating data for delLiveColl to ver 3 
   [junit4]   2> 460691 T951 oasc.Overseer$ClusterStateUpdater.updateState Update state numShards=2 message={
   [junit4]   2> 	  "numShards":"2",
   [junit4]   2> 	  "node_name":"127.0.0.1:21034__%2Fqo",
   [junit4]   2> 	  "collection":"delLiveColl",
   [junit4]   2> 	  "operation":"state",
   [junit4]   2> 	  "roles":null,
   [junit4]   2> 	  "state":"down",
   [junit4]   2> 	  "base_url":"https://127.0.0.1:21034/_/qo",
   [junit4]   2> 	  "core":"delLiveColl_shard2_replica2",
   [junit4]   2> 	  "shard":"shard2"}
   [junit4]   2> 460694 T959 oasc.DistributedQueue$LatchChildWatcher.process LatchChildWatcher fired on path: /overseer/queue state: SyncConnected type NodeChildrenChanged
   [junit4]   2> 460694 T951 oasc.Overseer$ClusterStateUpdater.updateZkStates going to update_collection /collections/delLiveColl/state.json
   [junit4]   2> 460695 T959 oascc.ZkStateReader$7.process A cluster state change: WatchedEvent state:SyncConnected type:NodeDataChanged path:/collections/delLiveColl/state.json, has occurred - updating... 
   [junit4]   2> 460695 T1019 oascc.ZkStateReader$7.process A cluster state change: WatchedEvent state:SyncConnected type:NodeDataChanged path:/collections/delLiveColl/state.json, has occurred - updating... 
   [junit4]   2> 460695 T989 oascc.ZkStateReader$7.process A cluster state change: WatchedEvent state:SyncConnected type:NodeDataChanged path:/collections/delLiveColl/state.json, has occurred - updating... 
   [junit4]   2> 460695 T974 oascc.ZkStateReader$7.process A cluster state change: WatchedEvent state:SyncConnected type:NodeDataChanged path:/collections/delLiveColl/state.json, has occurred - updating... 
   [junit4]   2> 460696 T1019 oascc.ZkStateReader.updateWatchedCollection Updating data for delLiveColl to ver 4 
   [junit4]   2> 460697 T989 oascc.ZkStateReader.updateWatchedCollection Updating data for delLiveColl to ver 4 
   [junit4]   2> 460697 T974 oascc.ZkStateReader.updateWatchedCollection Updating data for delLiveColl to ver 4 
   [junit4]   2> 460698 T959 oascc.ZkStateReader.updateWatchedCollection Updating data for delLiveColl to ver 4 
   [junit4]   2> 460777 T963 oasc.SolrConfig.<init> Using Lucene MatchVersion: 5.0.0
   [junit4]   2> 460778 T943 oasc.SolrConfig.<init> Using Lucene MatchVersion: 5.0.0
   [junit4]   2> 460896 T943 oasc.SolrConfig.<init> Loaded SolrConfig: solrconfig.xml
   [junit4]   2> 460898 T943 oass.IndexSchema.readSchema Reading Solr Schema from schema.xml
   [junit4]   2> 460899 T963 oasc.SolrConfig.<init> Loaded SolrConfig: solrconfig.xml
   [junit4]   2> 460900 T963 oass.IndexSchema.readSchema Reading Solr Schema from schema.xml
   [junit4]   2> 460910 T943 oass.IndexSchema.readSchema [delLiveColl_shard1_replica2] Schema name=test
   [junit4]   2> 460915 T963 oass.IndexSchema.readSchema [delLiveColl_shard2_replica1] Schema name=test
   [junit4]   2> 461450 T943 oass.OpenExchangeRatesOrgProvider.init Initialized with rates=open-exchange-rates.json, refreshInterval=1440.
   [junit4]   2> 461461 T943 oass.IndexSchema.readSchema default search field in schema is text
   [junit4]   2> 461464 T943 oass.IndexSchema.readSchema unique key field: id
   [junit4]   2> 461482 T943 oass.FileExchangeRateProvider.reload Reloading exchange rates from file currency.xml
   [junit4]   2> 461488 T943 oass.FileExchangeRateProvider.reload Reloading exchange rates from file currency.xml
   [junit4]   2> 461493 T943 oass.OpenExchangeRatesOrgProvider.reload Reloading exchange rates from open-exchange-rates.json
   [junit4]   2> 461495 T943 oass.OpenExchangeRatesOrgProvider$OpenExchangeRates.<init> WARN Unknown key IMPORTANT NOTE
   [junit4]   2> 461497 T943 oass.OpenExchangeRatesOrgProvider$OpenExchangeRates.<init> WARN Expected key, got STRING
   [junit4]   2> 461498 T943 oass.OpenExchangeRatesOrgProvider.reload Reloading exchange rates from open-exchange-rates.json
   [junit4]   2> 461499 T943 oass.OpenExchangeRatesOrgProvider$OpenExchangeRates.<init> WARN Unknown key IMPORTANT NOTE
   [junit4]   2> 461499 T943 oass.OpenExchangeRatesOrgProvider$OpenExchangeRates.<init> WARN Expected key, got STRING
   [junit4]   2> 461500 T943 oasc.CoreContainer.create Creating SolrCore 'delLiveColl_shard1_replica2' using configuration from collection delLiveColl
   [junit4]   2> 461500 T943 oasc.SolrCore.initDirectoryFactory org.apache.solr.core.MockDirectoryFactory
   [junit4]   2> 461501 T943 oasc.SolrCore.<init> [delLiveColl_shard1_replica2] Opening new SolrCore at /usr/home/jenkins/jenkins-slave/workspace/Lucene-Solr-Tests-5.x-Java7/solr/build/solr-core/test/J0/temp/solr.cloud.DeleteReplicaTest-FBC77DCFA2A7FB9A-001/tempDir-002/delLiveColl_shard1_replica2/, dataDir=/usr/home/jenkins/jenkins-slave/workspace/Lucene-Solr-Tests-5.x-Java7/solr/build/solr-core/test/J0/temp/solr.cloud.DeleteReplicaTest-FBC77DCFA2A7FB9A-001/tempDir-002/delLiveColl_shard1_replica2/data/
   [junit4]   2> 461502 T943 oasc.JmxMonitoredMap.<init> JMX monitoring is enabled. Adding Solr mbeans to JMX Server: com.sun.jmx.mbeanserver.JmxMBeanServer@1b894d73
   [junit4]   2> 461504 T943 oasc.CachingDirectoryFactory.get return new directory for /usr/home/jenkins/jenkins-slave/workspace/Lucene-Solr-Tests-5.x-Java7/solr/build/solr-core/test/J0/temp/solr.cloud.DeleteReplicaTest-FBC77DCFA2A7FB9A-001/tempDir-002/delLiveColl_shard1_replica2/data
   [junit4]   2> 461504 T943 oasc.SolrCore.getNewIndexDir New index directory detected: old=null new=/usr/home/jenkins/jenkins-slave/workspace/Lucene-Solr-Tests-5.x-Java7/solr/build/solr-core/test/J0/temp/solr.cloud.DeleteReplicaTest-FBC77DCFA2A7FB9A-001/tempDir-002/delLiveColl_shard1_replica2/data/index/
   [junit4]   2> 461505 T943 oasc.SolrCore.initIndex WARN [delLiveColl_shard1_replica2] Solr index directory '/usr/home/jenkins/jenkins-slave/workspace/Lucene-Solr-Tests-5.x-Java7/solr/build/solr-core/test/J0/temp/solr.cloud.DeleteReplicaTest-FBC77DCFA2A7FB9A-001/tempDir-002/delLiveColl_shard1_replica2/data/index' doesn't exist. Creating new index...
   [junit4]   2> 461505 T943 oasc.CachingDirectoryFactory.get return new directory for /usr/home/jenkins/jenkins-slave/workspace/Lucene-Solr-Tests-5.x-Java7/solr/build/solr-core/test/J0/temp/solr.cloud.DeleteReplicaTest-FBC77DCFA2A7FB9A-001/tempDir-002/delLiveColl_shard1_replica2/data/index
   [junit4]   2> 461506 T943 oasu.RandomMergePolicy.<init> RandomMergePolicy wrapping class org.apache.lucene.index.TieredMergePolicy: [TieredMergePolicy: maxMergeAtOnce=21, maxMergeAtOnceExplicit=44, maxMergedSegmentMB=17.6513671875, floorSegmentMB=0.22265625, forceMergeDeletesPctAllowed=24.646059185358865, segmentsPerTier=44.0, maxCFSSegmentSizeMB=8.796093022207999E12, noCFSRatio=0.838524524519939
   [junit4]   2> 461507 T943 oasc.SolrDeletionPolicy.onCommit SolrDeletionPolicy.onCommit: commits: num=1
   [junit4]   2> 		commit{dir=MockDirectoryWrapper(RAMDirectory(id=lucene-526b638c)),segFN=segments_1,generation=1}
   [junit4]   2> 461507 T943 oasc.SolrDeletionPolicy.updateCommits newest commit generation = 1
   [junit4]   2> 461509 T963 oass.OpenExchangeRatesOrgProvider.init Initialized with rates=open-exchange-rates.json, refreshInterval=1440.
   [junit4]   2> 461513 T943 oasup.UpdateRequestProcessorChain.init creating updateRequestProcessorChain "nodistrib"
   [junit4]   2> 461513 T943 oasup.UpdateRequestProcessorChain.init creating updateRequestProcessorChain "dedupe"
   [junit4]   2> 461514 T943 oasup.UpdateRequestProcessorChain.init inserting DistributedUpdateProcessorFactory into updateRequestProcessorChain "dedupe"
   [junit4]   2> 461514 T943 oasup.UpdateRequestProcessorChain.init creating updateRequestProcessorChain "stored_sig"
   [junit4]   2> 461514 T943 oasup.UpdateRequestProcessorChain.init inserting DistributedUpdateProcessorFactory into updateRequestProcessorChain "stored_sig"
   [junit4]   2> 461515 T943 oasup.UpdateRequestProcessorChain.init creating updateRequestProcessorChain "distrib-dup-test-chain-explicit"
   [junit4]   2> 461515 T943 oasup.UpdateRequestProcessorChain.init creating updateRequestProcessorChain "distrib-dup-test-chain-implicit"
   [junit4]   2> 461516 T943 oasup.UpdateRequestProcessorChain.init inserting DistributedUpdateProcessorFactory into updateRequestProcessorChain "distrib-dup-test-chain-implicit"
   [junit4]   2> 461516 T943 oasc.SolrCore.loadUpdateProcessorChains no updateRequestProcessorChain defined as default, creating implicit default
   [junit4]   2> 461517 T943 oasc.RequestHandlers.initHandlersFromConfig created /update/json/docs: org.apache.solr.handler.UpdateRequestHandler
   [junit4]   2> 461518 T943 oasc.RequestHandlers.initHandlersFromConfig created /update/json: org.apache.solr.handler.UpdateRequestHandler
   [junit4]   2> 461518 T963 oass.IndexSchema.readSchema default search field in schema is text
   [junit4]   2> 461518 T943 oasc.RequestHandlers.initHandlersFromConfig created /update/csv: org.apache.solr.handler.UpdateRequestHandler
   [junit4]   2> 461519 T943 oasc.RequestHandlers.initHandlersFromConfig created standard: solr.StandardRequestHandler
   [junit4]   2> 461520 T943 oasc.RequestHandlers.initHandlersFromConfig created /get: solr.RealTimeGetHandler
   [junit4]   2> 461520 T943 oasc.RequestHandlers.initHandlersFromConfig adding lazy requestHandler: solr.ReplicationHandler
   [junit4]   2> 461520 T943 oasc.RequestHandlers.initHandlersFromConfig created /replication: solr.ReplicationHandler
   [junit4]   2> 461521 T943 oasc.RequestHandlers.initHandlersFromConfig created /update: solr.UpdateRequestHandler
   [junit4]   2> 461521 T943 oasc.RequestHandlers.initHandlersFromConfig created /admin/: org.apache.solr.handler.admin.AdminHandlers
   [junit4]   2> 461522 T943 oasc.RequestHandlers.initHandlersFromConfig created /admin/file: solr.admin.ShowFileRequestHandler
   [junit4]   2> 461522 T943 oasc.RequestHandlers.initHandlersFromConfig created /admin/fileedit: solr.admin.EditFileRequestHandler
   [junit4]   2> 461522 T963 oass.IndexSchema.readSchema unique key field: id
   [junit4]   2> 461543 T963 oass.FileExchangeRateProvider.reload Reloading exchange rates from file currency.xml
   [junit4]   2> 461546 T943 oashl.XMLLoader.init xsltCacheLifetimeSeconds=60
   [junit4]   2> 461548 T943 oashl.XMLLoader.init xsltCacheLifetimeSeconds=60
   [junit4]   2> 461549 T963 oass.FileExchangeRateProvider.reload Reloading exchange rates from file currency.xml
   [junit4]   2> 461550 T943 oashl.XMLLoader.init xsltCacheLifetimeSeconds=60
   [junit4]   2> 461553 T943 oashl.XMLLoader.init xsltCacheLifetimeSeconds=60
   [junit4]   2> 461554 T963 oass.OpenExchangeRatesOrgProvider.reload Reloading exchange rates from open-exchange-rates.json
   [junit4]   2> 461555 T963 oass.OpenExchangeRatesOrgProvider$OpenExchangeRates.<init> WARN Unknown key IMPORTANT NOTE
   [junit4]   2> 461556 T963 oass.OpenExchangeRatesOrgProvider$OpenExchangeRates.<init> WARN Expected key, got STRING
   [junit4]   2> 461557 T963 oass.OpenExchangeRatesOrgProvider.reload Reloading exchange rates from open-exchange-rates.json
   [junit4]   2> 461558 T963 oass.OpenExchangeRatesOrgProvider$OpenExchangeRates.<init> WARN Unknown key IMPORTANT NOTE
   [junit4]   2> 461558 T963 oass.OpenExchangeRatesOrgProvider$OpenExchangeRates.<init> WARN Expected key, got STRING
   [junit4]   2> 461558 T943 oasu.CommitTracker.<init> Hard AutoCommit: disabled
   [junit4]   2> 461558 T963 oasc.CoreContainer.create Creating SolrCore 'delLiveColl_shard2_replica1' using configuration from collection delLiveColl
   [junit4]   2> 461559 T943 oasu.CommitTracker.<init> Soft AutoCommit: disabled
   [junit4]   2> 461559 T963 oasc.SolrCore.initDirectoryFactory org.apache.solr.core.MockDirectoryFactory
   [junit4]   2> 461560 T963 oasc.SolrCore.<init> [delLiveColl_shard2_replica1] Opening new SolrCore at ../../../../../../../../../../../usr/home/jenkins/jenkins-slave/workspace/Lucene-Solr-Tests-5.x-Java7/solr/build/solr-core/test/J0/temp/solr.cloud.DeleteReplicaTest-FBC77DCFA2A7FB9A-001/tempDir-003/delLiveColl_shard2_replica1/, dataDir=/usr/home/jenkins/jenkins-slave/workspace/Lucene-Solr-Tests-5.x-Java7/solr/build/solr-core/test/J0/../../../../../../../../../../../usr/home/jenkins/jenkins-slave/workspace/Lucene-Solr-Tests-5.x-Java7/solr/build/solr-core/test/J0/temp/solr.cloud.DeleteReplicaTest-FBC77DCFA2A7FB9A-001/tempDir-003/delLiveColl_shard2_replica1/data/
   [junit4]   2> 461561 T943 oasu.RandomMergePolicy.<init> RandomMergePolicy wrapping class org.apache.lucene.index.AlcoholicMergePolicy: [AlcoholicMergePolicy: minMergeSize=0, mergeFactor=10, maxMergeSize=1917053743, maxMergeSizeForForcedMerge=9223372036854775807, calibrateSizeByDeletes=true, maxMergeDocs=2147483647, maxCFSSegmentSizeMB=8.796093022207999E12, noCFSRatio=0.1]
   [junit4]   2> 461561 T963 oasc.JmxMonitoredMap.<init> JMX monitoring is enabled. Adding Solr mbeans to JMX Server: com.sun.jmx.mbeanserver.JmxMBeanServer@1b894d73
   [junit4]   2> 461562 T943 oasc.SolrDeletionPolicy.onInit SolrDeletionPolicy.onInit: commits: num=1
   [junit4]   2> 		commit{dir=MockDirectoryWrapper(RAMDirectory(id=lucene-526b638c)),segFN=segments_1,generation=1}
   [junit4]   2> 461562 T943 oasc.SolrDeletionPolicy.updateCommits newest commit generation = 1
   [junit4]   2> 461562 T963 oasc.CachingDirectoryFactory.get return new directory for /usr/home/jenkins/jenkins-slave/workspace/Lucene-Solr-Tests-5.x-Java7/solr/build/solr-core/test/J0/../../../../../../../../../../../usr/home/jenkins/jenkins-slave/workspace/Lucene-Solr-Tests-5.x-Java7/solr/build/solr-core/test/J0/temp/solr.cloud.DeleteReplicaTest-FBC77DCFA2A7FB9A-001/tempDir-003/delLiveColl_shard2_replica1/data
   [junit4]   2> 461562 T943 oass.SolrIndexSearcher.<init> Opening Searcher@6164871[delLiveColl_shard1_replica2] main
   [junit4]   2> 461562 T963 oasc.SolrCore.getNewIndexDir New index directory detected: old=null new=/usr/home/jenkins/jenkins-slave/workspace/Lucene-Solr-Tests-5.x-Java7/solr/build/solr-core/test/J0/../../../../../../../../../../../usr/home/jenkins/jenkins-slave/workspace/Lucene-Solr-Tests-5.x-Java7/solr/build/solr-core/test/J0/temp/solr.cloud.DeleteReplicaTest-FBC77DCFA2A7FB9A-001/tempDir-003/delLiveColl_shard2_replica1/data/index/
   [junit4]   2> 461563 T943 oascc.ZkStateReader.readConfigName Load collection config from:/collections/delLiveColl
   [junit4]   2> 461563 T963 oasc.SolrCore.initIndex WARN [delLiveColl_shard2_replica1] Solr index directory '/usr/home/jenkins/jenkins-slave/workspace/Lucene-Solr-Tests-5.x-Java7/solr/build/solr-core/test/J0/../../../../../../../../../../../usr/home/jenkins/jenkins-slave/workspace/Lucene-Solr-Tests-5.x-Java7/solr/build/solr-core/test/J0/temp/solr.cloud.DeleteReplicaTest-FBC77DCFA2A7FB9A-001/tempDir-003/delLiveColl_shard2_replica1/data/index' doesn't exist. Creating new index...
   [junit4]   2> 461564 T963 oasc.CachingDirectoryFactory.get return new directory for /usr/home/jenkins/jenkins-slave/workspace/Lucene-Solr-Tests-5.x-Java7/solr/build/solr-core/test/J0/../../../../../../../../../../../usr/home/jenkins/jenkins-slave/workspace/Lucene-Solr-Tests-5.x-Java7/solr/build/solr-core/test/J0/temp/solr.cloud.DeleteReplicaTest-FBC77DCFA2A7FB9A-001/tempDir-003/delLiveColl_shard2_replica1/data/index
   [junit4]   2> 461564 T943 oascc.ZkStateReader.readConfigName path=/collections/delLiveColl configName=conf1 specified config exists in ZooKeeper
   [junit4]   2> 461565 T963 oasu.RandomMergePolicy.<init> RandomMergePolicy wrapping class org.apache.lucene.index.TieredMergePolicy: [TieredMergePolicy: maxMergeAtOnce=21, maxMergeAtOnceExplicit=44, maxMergedSegmentMB=17.6513671875, floorSegmentMB=0.22265625, forceMergeDeletesPctAllowed=24.646059185358865, segmentsPerTier=44.0, maxCFSSegmentSizeMB=8.796093022207999E12, noCFSRatio=0.838524524519939
   [junit4]   2> 461565 T943 oasr.ManagedResourceStorage.newStorageIO Setting up ZooKeeper-based storage for the Rest

[...truncated too long message...]

ildWatcher.process LatchChildWatcher fired on path: /overseer/queue state: SyncConnected type NodeChildrenChanged
   [junit4]   2> 2094723 T5347 oasc.SolrCore.close [nodes_used_collection_shard2_replica1]  CLOSING SolrCore org.apache.solr.core.SolrCore@2a118704
   [junit4]   2> 2094725 T5903 oasc.Overseer$ClusterStateUpdater.updateState Update state numShards=2 message={
   [junit4]   2> 	  "collection":"nodes_used_collection",
   [junit4]   2> 	  "shard":"shard2",
   [junit4]   2> 	  "node_name":"127.0.0.1:45996_tt_zqh%2Fy",
   [junit4]   2> 	  "roles":null,
   [junit4]   2> 	  "core":"nodes_used_collection_shard2_replica1",
   [junit4]   2> 	  "base_url":"http://127.0.0.1:45996/tt_zqh/y",
   [junit4]   2> 	  "operation":"state",
   [junit4]   2> 	  "numShards":"2",
   [junit4]   2> 	  "core_node_name":"core_node3",
   [junit4]   2> 	  "state":"down"}
   [junit4]   2> 2094728 T5347 oasu.DirectUpdateHandler2.close closing DirectUpdateHandler2{commits=1,autocommits=0,soft autocommits=0,optimizes=0,rollbacks=0,expungeDeletes=0,docsPending=0,adds=0,deletesById=0,deletesByQuery=0,errors=0,cumulative_adds=0,cumulative_deletesById=0,cumulative_deletesByQuery=0,cumulative_errors=0,transaction_logs_total_size=0,transaction_logs_total_number=0}
   [junit4]   2> 2094729 T5347 oasu.SolrCoreState.decrefSolrCoreState Closing SolrCoreState
   [junit4]   2> 2094729 T5347 oasu.DefaultSolrCoreState.closeIndexWriter SolrCoreState ref count has reached 0 - closing IndexWriter
   [junit4]   2> 2094729 T5347 oasu.DefaultSolrCoreState.closeIndexWriter closing IndexWriter with IndexWriterCloser
   [junit4]   2> 2094730 T5347 oasc.SolrCore.closeSearcher [nodes_used_collection_shard2_replica1] Closing main searcher on request.
   [junit4]   2> 2094730 T5347 oasc.CachingDirectoryFactory.close Closing MockDirectoryFactory - 2 directories currently being tracked
   [junit4]   2> 2094730 T5347 oasc.CachingDirectoryFactory.closeCacheValue looking to close /usr/home/jenkins/jenkins-slave/workspace/Lucene-Solr-Tests-5.x-Java7/solr/build/solr-core/test/J1/temp/solr.cloud.CollectionsAPIDistributedZkTest-FBC77DCFA2A7FB9A-001/tempDir-006/nodes_used_collection_shard2_replica1/data [CachedDir<<refCount=0;path=/usr/home/jenkins/jenkins-slave/workspace/Lucene-Solr-Tests-5.x-Java7/solr/build/solr-core/test/J1/temp/solr.cloud.CollectionsAPIDistributedZkTest-FBC77DCFA2A7FB9A-001/tempDir-006/nodes_used_collection_shard2_replica1/data;done=false>>]
   [junit4]   2> 2094730 T5347 oasc.CachingDirectoryFactory.close Closing directory: /usr/home/jenkins/jenkins-slave/workspace/Lucene-Solr-Tests-5.x-Java7/solr/build/solr-core/test/J1/temp/solr.cloud.CollectionsAPIDistributedZkTest-FBC77DCFA2A7FB9A-001/tempDir-006/nodes_used_collection_shard2_replica1/data
   [junit4]   2> 2094731 T5347 oasc.CachingDirectoryFactory.closeCacheValue looking to close /usr/home/jenkins/jenkins-slave/workspace/Lucene-Solr-Tests-5.x-Java7/solr/build/solr-core/test/J1/temp/solr.cloud.CollectionsAPIDistributedZkTest-FBC77DCFA2A7FB9A-001/tempDir-006/nodes_used_collection_shard2_replica1/data/index [CachedDir<<refCount=0;path=/usr/home/jenkins/jenkins-slave/workspace/Lucene-Solr-Tests-5.x-Java7/solr/build/solr-core/test/J1/temp/solr.cloud.CollectionsAPIDistributedZkTest-FBC77DCFA2A7FB9A-001/tempDir-006/nodes_used_collection_shard2_replica1/data/index;done=false>>]
   [junit4]   2> 2094731 T5347 oasc.CachingDirectoryFactory.close Closing directory: /usr/home/jenkins/jenkins-slave/workspace/Lucene-Solr-Tests-5.x-Java7/solr/build/solr-core/test/J1/temp/solr.cloud.CollectionsAPIDistributedZkTest-FBC77DCFA2A7FB9A-001/tempDir-006/nodes_used_collection_shard2_replica1/data/index
   [junit4]   2> 2094731 T5347 oasc.Overseer.close Overseer (id=92633115207204879-127.0.0.1:45996_tt_zqh%2Fy-n_0000000004) closing
   [junit4]   2> 2094732 T5903 oasc.Overseer$ClusterStateUpdater.run Overseer Loop exiting : 127.0.0.1:45996_tt_zqh%2Fy
   [junit4]   2> 2094744 T5881 oascc.ZkStateReader$3.process WARN ZooKeeper watch triggered, but Solr cannot talk to ZK
   [junit4]   2> 2094746 T5347 oejsh.ContextHandler.doStop stopped o.e.j.s.ServletContextHandler{/tt_zqh/y,null}
   [junit4]   2> 2099721 T5347 oas.SolrTestCaseJ4.tearDown ###Ending testDistribSearch
   [junit4]   2> 2099724 T5347 oasc.ZkTestServer.send4LetterWord connecting to 127.0.0.1:33687 33687
   [junit4]   2> 2101790 T5548 oasc.ZkTestServer.send4LetterWord connecting to 127.0.0.1:33687 33687
   [junit4]   2> NOTE: reproduce with: ant test  -Dtestcase=CollectionsAPIDistributedZkTest -Dtests.method=testDistribSearch -Dtests.seed=FBC77DCFA2A7FB9A -Dtests.multiplier=2 -Dtests.slow=true -Dtests.locale=fr_BE -Dtests.timezone=UTC -Dtests.file.encoding=US-ASCII
   [junit4] ERROR    732s J1 | CollectionsAPIDistributedZkTest.testDistribSearch <<<
   [junit4]    > Throwable #1: org.apache.solr.client.solrj.impl.HttpSolrServer$RemoteSolrException: Error CREATEing SolrCore 'halfcollection_shard1_replica1': Unable to create core [halfcollection_shard1_replica1] Caused by: Could not get shard id for core: halfcollection_shard1_replica1
   [junit4]    > 	at __randomizedtesting.SeedInfo.seed([FBC77DCFA2A7FB9A:7A21F3D7D5F89BA6]:0)
   [junit4]    > 	at org.apache.solr.client.solrj.impl.HttpSolrServer.executeMethod(HttpSolrServer.java:569)
   [junit4]    > 	at org.apache.solr.client.solrj.impl.HttpSolrServer.request(HttpSolrServer.java:215)
   [junit4]    > 	at org.apache.solr.client.solrj.impl.HttpSolrServer.request(HttpSolrServer.java:211)
   [junit4]    > 	at org.apache.solr.cloud.CollectionsAPIDistributedZkTest.testErrorHandling(CollectionsAPIDistributedZkTest.java:583)
   [junit4]    > 	at org.apache.solr.cloud.CollectionsAPIDistributedZkTest.doTest(CollectionsAPIDistributedZkTest.java:205)
   [junit4]    > 	at org.apache.solr.BaseDistributedSearchTestCase.testDistribSearch(BaseDistributedSearchTestCase.java:869)
   [junit4]    > 	at java.lang.Thread.run(Thread.java:745)
   [junit4]   2> 2101814 T5347 oas.SolrTestCaseJ4.deleteCore ###deleteCore
   [junit4]   2> NOTE: leaving temporary files on disk at: /usr/home/jenkins/jenkins-slave/workspace/Lucene-Solr-Tests-5.x-Java7/solr/build/solr-core/test/J1/temp/solr.cloud.CollectionsAPIDistributedZkTest-FBC77DCFA2A7FB9A-001
   [junit4]   2> NOTE: test params are: codec=Asserting(Lucene50): {timestamp=PostingsFormat(name=MockRandom), _version_=PostingsFormat(name=MockRandom), range_facet_l=PostingsFormat(name=MockRandom), other_tl1=PostingsFormat(name=MockRandom), multiDefault=PostingsFormat(name=MockRandom), a_t=PostingsFormat(name=SimpleText), a_i1=PostingsFormat(name=SimpleText), intDefault=PostingsFormat(name=MockRandom), text=PostingsFormat(name=Memory doPackFST= true), id=TestBloomFilteredLucenePostings(BloomFilteringPostingsFormat(Lucene41(blocksize=128)))}, docValues:{timestamp=DocValuesFormat(name=Lucene410)}, sim=DefaultSimilarity, locale=fr_BE, timezone=UTC
   [junit4]   2> NOTE: FreeBSD 9.1-RELEASE-p3 amd64/Oracle Corporation 1.7.0_65 (64-bit)/cpus=16,threads=1,free=147620296,total=373817344
   [junit4]   2> NOTE: All tests run in this JVM: [WordBreakSolrSpellCheckerTest, SolrCmdDistributorTest, ChaosMonkeySafeLeaderTest, ResourceLoaderTest, LoggingHandlerTest, TestManagedSchemaFieldResource, TestManagedSchema, TestExtendedDismaxParser, TestSolrXmlPersistence, TestBinaryField, TestReplicaProperties, BadIndexSchemaTest, TestAnalyzedSuggestions, TestCoreContainer, TestBulkSchemaAPI, PrimitiveFieldTypeTest, TestReload, DirectSolrConnectionTest, ScriptEngineTest, TestSchemaVersionResource, CircularListTest, TestFiltering, MultiThreadedOCPTest, LegacyHTMLStripCharFilterTest, SpellCheckCollatorTest, TestSolrXml, TestCustomSort, TestBulkSchemaConcurrent, ShardSplitTest, TestInfoStreamLogging, DistributedQueryElevationComponentTest, TestDistributedMissingSort, TestPhraseSuggestions, HighlighterConfigTest, SuggesterFSTTest, ReturnFieldsTest, HdfsSyncSliceTest, DistributedQueryComponentOptimizationTest, TestExceedMaxTermLength, DocValuesTest, MultiTermTest, QueryParsingTest, PeerSyncTest, TestXIncludeConfig, DocumentBuilderTest, TestWriterPerf, TestCharFilters, EnumFieldTest, TestManagedSchemaDynamicFieldResource, RequestHandlersTest, RankQueryTest, SOLR749Test, TestRTGBase, SynonymTokenizerTest, SyncSliceTest, CollectionsAPIDistributedZkTest]
   [junit4] Completed on J1 in 731.75s, 1 test, 1 error <<< FAILURES!

[...truncated 632 lines...]
BUILD FAILED
/usr/home/jenkins/jenkins-slave/workspace/Lucene-Solr-Tests-5.x-Java7/build.xml:524: The following error occurred while executing this line:
/usr/home/jenkins/jenkins-slave/workspace/Lucene-Solr-Tests-5.x-Java7/build.xml:472: The following error occurred while executing this line:
/usr/home/jenkins/jenkins-slave/workspace/Lucene-Solr-Tests-5.x-Java7/build.xml:61: The following error occurred while executing this line:
/usr/home/jenkins/jenkins-slave/workspace/Lucene-Solr-Tests-5.x-Java7/extra-targets.xml:39: The following error occurred while executing this line:
/usr/home/jenkins/jenkins-slave/workspace/Lucene-Solr-Tests-5.x-Java7/solr/build.xml:189: The following error occurred while executing this line:
/usr/home/jenkins/jenkins-slave/workspace/Lucene-Solr-Tests-5.x-Java7/solr/common-build.xml:496: The following error occurred while executing this line:
/usr/home/jenkins/jenkins-slave/workspace/Lucene-Solr-Tests-5.x-Java7/lucene/common-build.xml:1360: The following error occurred while executing this line:
/usr/home/jenkins/jenkins-slave/workspace/Lucene-Solr-Tests-5.x-Java7/lucene/common-build.xml:962: There were test failures: 437 suites, 1795 tests, 2 errors, 58 ignored (22 assumptions)

Total time: 90 minutes 15 seconds
Build step 'Invoke Ant' marked build as failure
Archiving artifacts
Sending artifact delta relative to Lucene-Solr-Tests-5.x-Java7 #2171
Archived 5 artifacts
Archive block size is 32768
Received 0 blocks and 170823750 bytes
Compression is 0.0%
Took 30 sec
Recording test results
Email was triggered for: Failure
Sending email for trigger: Failure



Mime
View raw message