lucene-dev mailing list archives

Site index · List index
Message view « Date » · « Thread »
Top « Date » · « Thread »
From Policeman Jenkins Server <jenk...@thetaphi.de>
Subject [JENKINS] Lucene-Solr-5.x-Linux (32bit/jdk1.9.0-ea-b28) - Build # 11233 - Still Failing!
Date Sat, 04 Oct 2014 23:38:47 GMT
Build: http://jenkins.thetaphi.de/job/Lucene-Solr-5.x-Linux/11233/
Java: 32bit/jdk1.9.0-ea-b28 -server -XX:+UseG1GC

5 tests failed.
FAILED:  org.apache.solr.client.solrj.SolrExampleBinaryTest.testExampleConfig

Error Message:
Expected mime type application/octet-stream but got text/html. <html> <head> <meta http-equiv="Content-Type" content="text/html;charset=ISO-8859-1"/> <title>Error 404 Can not find: /solr/admin/info/system</title> </head> <body> <h2>HTTP ERROR: 404</h2> <p>Problem accessing /solr/admin/info/system. Reason: <pre>    Can not find: /solr/admin/info/system</pre></p> <hr /><i><small>Powered by Jetty://</small></i>                                                                                                                                                                                                                                                                                                                                                                                                                                                                                                                                                                                                                                                                                                                                                                                                                                                                                                                                                                                                                     </body> </html> 

Stack Trace:
org.apache.solr.client.solrj.impl.HttpSolrServer$RemoteSolrException: Expected mime type application/octet-stream but got text/html. <html>
<head>
<meta http-equiv="Content-Type" content="text/html;charset=ISO-8859-1"/>
<title>Error 404 Can not find: /solr/admin/info/system</title>
</head>
<body>
<h2>HTTP ERROR: 404</h2>
<p>Problem accessing /solr/admin/info/system. Reason:
<pre>    Can not find: /solr/admin/info/system</pre></p>
<hr /><i><small>Powered by Jetty://</small></i>
                                                
                                                
                                                
                                                
                                                
                                                
                                                
                                                
                                                
                                                
                                                
                                                
                                                
                                                
                                                
                                                
                                                
                                                
                                                
                                                
</body>
</html>

	at __randomizedtesting.SeedInfo.seed([1B12087177D4DD82:AC3F1CE9B0D33B5B]:0)
	at org.apache.solr.client.solrj.impl.HttpSolrServer.executeMethod(HttpSolrServer.java:530)
	at org.apache.solr.client.solrj.impl.HttpSolrServer.request(HttpSolrServer.java:215)
	at org.apache.solr.client.solrj.impl.HttpSolrServer.request(HttpSolrServer.java:211)
	at org.apache.solr.client.solrj.request.QueryRequest.process(QueryRequest.java:91)
	at org.apache.solr.client.solrj.SolrServer.query(SolrServer.java:301)
	at org.apache.solr.client.solrj.SolrExampleTests.testExampleConfig(SolrExampleTests.java:220)
	at sun.reflect.NativeMethodAccessorImpl.invoke0(Native Method)
	at sun.reflect.NativeMethodAccessorImpl.invoke(NativeMethodAccessorImpl.java:62)
	at sun.reflect.DelegatingMethodAccessorImpl.invoke(DelegatingMethodAccessorImpl.java:43)
	at java.lang.reflect.Method.invoke(Method.java:484)
	at com.carrotsearch.randomizedtesting.RandomizedRunner.invoke(RandomizedRunner.java:1618)
	at com.carrotsearch.randomizedtesting.RandomizedRunner$6.evaluate(RandomizedRunner.java:827)
	at com.carrotsearch.randomizedtesting.RandomizedRunner$7.evaluate(RandomizedRunner.java:863)
	at com.carrotsearch.randomizedtesting.RandomizedRunner$8.evaluate(RandomizedRunner.java:877)
	at com.carrotsearch.randomizedtesting.rules.SystemPropertiesRestoreRule$1.evaluate(SystemPropertiesRestoreRule.java:53)
	at org.apache.lucene.util.TestRuleSetupTeardownChained$1.evaluate(TestRuleSetupTeardownChained.java:50)
	at org.apache.lucene.util.AbstractBeforeAfterRule$1.evaluate(AbstractBeforeAfterRule.java:46)
	at com.carrotsearch.randomizedtesting.rules.SystemPropertiesInvariantRule$1.evaluate(SystemPropertiesInvariantRule.java:55)
	at org.apache.lucene.util.TestRuleThreadAndTestName$1.evaluate(TestRuleThreadAndTestName.java:49)
	at org.apache.lucene.util.TestRuleIgnoreAfterMaxFailures$1.evaluate(TestRuleIgnoreAfterMaxFailures.java:65)
	at org.apache.lucene.util.TestRuleMarkFailure$1.evaluate(TestRuleMarkFailure.java:48)
	at com.carrotsearch.randomizedtesting.rules.StatementAdapter.evaluate(StatementAdapter.java:36)
	at com.carrotsearch.randomizedtesting.ThreadLeakControl$StatementRunner.run(ThreadLeakControl.java:365)
	at com.carrotsearch.randomizedtesting.ThreadLeakControl.forkTimeoutingTask(ThreadLeakControl.java:798)
	at com.carrotsearch.randomizedtesting.ThreadLeakControl$3.evaluate(ThreadLeakControl.java:458)
	at com.carrotsearch.randomizedtesting.RandomizedRunner.runSingleTest(RandomizedRunner.java:836)
	at com.carrotsearch.randomizedtesting.RandomizedRunner$3.evaluate(RandomizedRunner.java:738)
	at com.carrotsearch.randomizedtesting.RandomizedRunner$4.evaluate(RandomizedRunner.java:772)
	at com.carrotsearch.randomizedtesting.RandomizedRunner$5.evaluate(RandomizedRunner.java:783)
	at com.carrotsearch.randomizedtesting.rules.StatementAdapter.evaluate(StatementAdapter.java:36)
	at com.carrotsearch.randomizedtesting.rules.SystemPropertiesRestoreRule$1.evaluate(SystemPropertiesRestoreRule.java:53)
	at org.apache.lucene.util.AbstractBeforeAfterRule$1.evaluate(AbstractBeforeAfterRule.java:46)
	at org.apache.lucene.util.TestRuleStoreClassName$1.evaluate(TestRuleStoreClassName.java:42)
	at com.carrotsearch.randomizedtesting.rules.SystemPropertiesInvariantRule$1.evaluate(SystemPropertiesInvariantRule.java:55)
	at com.carrotsearch.randomizedtesting.rules.NoShadowingOrOverridesOnMethodsRule$1.evaluate(NoShadowingOrOverridesOnMethodsRule.java:39)
	at com.carrotsearch.randomizedtesting.rules.NoShadowingOrOverridesOnMethodsRule$1.evaluate(NoShadowingOrOverridesOnMethodsRule.java:39)
	at com.carrotsearch.randomizedtesting.rules.StatementAdapter.evaluate(StatementAdapter.java:36)
	at com.carrotsearch.randomizedtesting.rules.StatementAdapter.evaluate(StatementAdapter.java:36)
	at com.carrotsearch.randomizedtesting.rules.StatementAdapter.evaluate(StatementAdapter.java:36)
	at org.apache.lucene.util.TestRuleAssertionsRequired$1.evaluate(TestRuleAssertionsRequired.java:43)
	at org.apache.lucene.util.TestRuleMarkFailure$1.evaluate(TestRuleMarkFailure.java:48)
	at org.apache.lucene.util.TestRuleIgnoreAfterMaxFailures$1.evaluate(TestRuleIgnoreAfterMaxFailures.java:65)
	at org.apache.lucene.util.TestRuleIgnoreTestSuites$1.evaluate(TestRuleIgnoreTestSuites.java:55)
	at com.carrotsearch.randomizedtesting.rules.StatementAdapter.evaluate(StatementAdapter.java:36)
	at com.carrotsearch.randomizedtesting.ThreadLeakControl$StatementRunner.run(ThreadLeakControl.java:365)
	at java.lang.Thread.run(Thread.java:745)


FAILED:  org.apache.solr.client.solrj.SolrExampleXMLTest.testExampleConfig

Error Message:
Expected mime type application/octet-stream but got text/html. <html> <head> <meta http-equiv="Content-Type" content="text/html;charset=ISO-8859-1"/> <title>Error 404 Can not find: /solr/admin/info/system</title> </head> <body> <h2>HTTP ERROR: 404</h2> <p>Problem accessing /solr/admin/info/system. Reason: <pre>    Can not find: /solr/admin/info/system</pre></p> <hr /><i><small>Powered by Jetty://</small></i>                                                                                                                                                                                                                                                                                                                                                                                                                                                                                                                                                                                                                                                                                                                                                                                                                                                                                                                                                                                                                     </body> </html> 

Stack Trace:
org.apache.solr.client.solrj.impl.HttpSolrServer$RemoteSolrException: Expected mime type application/octet-stream but got text/html. <html>
<head>
<meta http-equiv="Content-Type" content="text/html;charset=ISO-8859-1"/>
<title>Error 404 Can not find: /solr/admin/info/system</title>
</head>
<body>
<h2>HTTP ERROR: 404</h2>
<p>Problem accessing /solr/admin/info/system. Reason:
<pre>    Can not find: /solr/admin/info/system</pre></p>
<hr /><i><small>Powered by Jetty://</small></i>
                                                
                                                
                                                
                                                
                                                
                                                
                                                
                                                
                                                
                                                
                                                
                                                
                                                
                                                
                                                
                                                
                                                
                                                
                                                
                                                
</body>
</html>

	at __randomizedtesting.SeedInfo.seed([1B12087177D4DD82:AC3F1CE9B0D33B5B]:0)
	at org.apache.solr.client.solrj.impl.HttpSolrServer.executeMethod(HttpSolrServer.java:530)
	at org.apache.solr.client.solrj.impl.HttpSolrServer.request(HttpSolrServer.java:215)
	at org.apache.solr.client.solrj.impl.HttpSolrServer.request(HttpSolrServer.java:211)
	at org.apache.solr.client.solrj.request.QueryRequest.process(QueryRequest.java:91)
	at org.apache.solr.client.solrj.SolrServer.query(SolrServer.java:301)
	at org.apache.solr.client.solrj.SolrExampleTests.testExampleConfig(SolrExampleTests.java:220)
	at sun.reflect.NativeMethodAccessorImpl.invoke0(Native Method)
	at sun.reflect.NativeMethodAccessorImpl.invoke(NativeMethodAccessorImpl.java:62)
	at sun.reflect.DelegatingMethodAccessorImpl.invoke(DelegatingMethodAccessorImpl.java:43)
	at java.lang.reflect.Method.invoke(Method.java:484)
	at com.carrotsearch.randomizedtesting.RandomizedRunner.invoke(RandomizedRunner.java:1618)
	at com.carrotsearch.randomizedtesting.RandomizedRunner$6.evaluate(RandomizedRunner.java:827)
	at com.carrotsearch.randomizedtesting.RandomizedRunner$7.evaluate(RandomizedRunner.java:863)
	at com.carrotsearch.randomizedtesting.RandomizedRunner$8.evaluate(RandomizedRunner.java:877)
	at com.carrotsearch.randomizedtesting.rules.SystemPropertiesRestoreRule$1.evaluate(SystemPropertiesRestoreRule.java:53)
	at org.apache.lucene.util.TestRuleSetupTeardownChained$1.evaluate(TestRuleSetupTeardownChained.java:50)
	at org.apache.lucene.util.AbstractBeforeAfterRule$1.evaluate(AbstractBeforeAfterRule.java:46)
	at com.carrotsearch.randomizedtesting.rules.SystemPropertiesInvariantRule$1.evaluate(SystemPropertiesInvariantRule.java:55)
	at org.apache.lucene.util.TestRuleThreadAndTestName$1.evaluate(TestRuleThreadAndTestName.java:49)
	at org.apache.lucene.util.TestRuleIgnoreAfterMaxFailures$1.evaluate(TestRuleIgnoreAfterMaxFailures.java:65)
	at org.apache.lucene.util.TestRuleMarkFailure$1.evaluate(TestRuleMarkFailure.java:48)
	at com.carrotsearch.randomizedtesting.rules.StatementAdapter.evaluate(StatementAdapter.java:36)
	at com.carrotsearch.randomizedtesting.ThreadLeakControl$StatementRunner.run(ThreadLeakControl.java:365)
	at com.carrotsearch.randomizedtesting.ThreadLeakControl.forkTimeoutingTask(ThreadLeakControl.java:798)
	at com.carrotsearch.randomizedtesting.ThreadLeakControl$3.evaluate(ThreadLeakControl.java:458)
	at com.carrotsearch.randomizedtesting.RandomizedRunner.runSingleTest(RandomizedRunner.java:836)
	at com.carrotsearch.randomizedtesting.RandomizedRunner$3.evaluate(RandomizedRunner.java:738)
	at com.carrotsearch.randomizedtesting.RandomizedRunner$4.evaluate(RandomizedRunner.java:772)
	at com.carrotsearch.randomizedtesting.RandomizedRunner$5.evaluate(RandomizedRunner.java:783)
	at com.carrotsearch.randomizedtesting.rules.StatementAdapter.evaluate(StatementAdapter.java:36)
	at com.carrotsearch.randomizedtesting.rules.SystemPropertiesRestoreRule$1.evaluate(SystemPropertiesRestoreRule.java:53)
	at org.apache.lucene.util.AbstractBeforeAfterRule$1.evaluate(AbstractBeforeAfterRule.java:46)
	at org.apache.lucene.util.TestRuleStoreClassName$1.evaluate(TestRuleStoreClassName.java:42)
	at com.carrotsearch.randomizedtesting.rules.SystemPropertiesInvariantRule$1.evaluate(SystemPropertiesInvariantRule.java:55)
	at com.carrotsearch.randomizedtesting.rules.NoShadowingOrOverridesOnMethodsRule$1.evaluate(NoShadowingOrOverridesOnMethodsRule.java:39)
	at com.carrotsearch.randomizedtesting.rules.NoShadowingOrOverridesOnMethodsRule$1.evaluate(NoShadowingOrOverridesOnMethodsRule.java:39)
	at com.carrotsearch.randomizedtesting.rules.StatementAdapter.evaluate(StatementAdapter.java:36)
	at com.carrotsearch.randomizedtesting.rules.StatementAdapter.evaluate(StatementAdapter.java:36)
	at com.carrotsearch.randomizedtesting.rules.StatementAdapter.evaluate(StatementAdapter.java:36)
	at org.apache.lucene.util.TestRuleAssertionsRequired$1.evaluate(TestRuleAssertionsRequired.java:43)
	at org.apache.lucene.util.TestRuleMarkFailure$1.evaluate(TestRuleMarkFailure.java:48)
	at org.apache.lucene.util.TestRuleIgnoreAfterMaxFailures$1.evaluate(TestRuleIgnoreAfterMaxFailures.java:65)
	at org.apache.lucene.util.TestRuleIgnoreTestSuites$1.evaluate(TestRuleIgnoreTestSuites.java:55)
	at com.carrotsearch.randomizedtesting.rules.StatementAdapter.evaluate(StatementAdapter.java:36)
	at com.carrotsearch.randomizedtesting.ThreadLeakControl$StatementRunner.run(ThreadLeakControl.java:365)
	at java.lang.Thread.run(Thread.java:745)


FAILED:  org.apache.solr.client.solrj.embedded.SolrExampleJettyTest.testExampleConfig

Error Message:
Expected mime type application/octet-stream but got text/html. <html> <head> <meta http-equiv="Content-Type" content="text/html;charset=ISO-8859-1"/> <title>Error 404 Can not find: /solr/admin/info/system</title> </head> <body> <h2>HTTP ERROR: 404</h2> <p>Problem accessing /solr/admin/info/system. Reason: <pre>    Can not find: /solr/admin/info/system</pre></p> <hr /><i><small>Powered by Jetty://</small></i>                                                                                                                                                                                                                                                                                                                                                                                                                                                                                                                                                                                                                                                                                                                                                                                                                                                                                                                                                                                                                     </body> </html> 

Stack Trace:
org.apache.solr.client.solrj.impl.HttpSolrServer$RemoteSolrException: Expected mime type application/octet-stream but got text/html. <html>
<head>
<meta http-equiv="Content-Type" content="text/html;charset=ISO-8859-1"/>
<title>Error 404 Can not find: /solr/admin/info/system</title>
</head>
<body>
<h2>HTTP ERROR: 404</h2>
<p>Problem accessing /solr/admin/info/system. Reason:
<pre>    Can not find: /solr/admin/info/system</pre></p>
<hr /><i><small>Powered by Jetty://</small></i>
                                                
                                                
                                                
                                                
                                                
                                                
                                                
                                                
                                                
                                                
                                                
                                                
                                                
                                                
                                                
                                                
                                                
                                                
                                                
                                                
</body>
</html>

	at __randomizedtesting.SeedInfo.seed([1B12087177D4DD82:AC3F1CE9B0D33B5B]:0)
	at org.apache.solr.client.solrj.impl.HttpSolrServer.executeMethod(HttpSolrServer.java:530)
	at org.apache.solr.client.solrj.impl.HttpSolrServer.request(HttpSolrServer.java:215)
	at org.apache.solr.client.solrj.impl.HttpSolrServer.request(HttpSolrServer.java:211)
	at org.apache.solr.client.solrj.request.QueryRequest.process(QueryRequest.java:91)
	at org.apache.solr.client.solrj.SolrServer.query(SolrServer.java:301)
	at org.apache.solr.client.solrj.SolrExampleTests.testExampleConfig(SolrExampleTests.java:220)
	at sun.reflect.NativeMethodAccessorImpl.invoke0(Native Method)
	at sun.reflect.NativeMethodAccessorImpl.invoke(NativeMethodAccessorImpl.java:62)
	at sun.reflect.DelegatingMethodAccessorImpl.invoke(DelegatingMethodAccessorImpl.java:43)
	at java.lang.reflect.Method.invoke(Method.java:484)
	at com.carrotsearch.randomizedtesting.RandomizedRunner.invoke(RandomizedRunner.java:1618)
	at com.carrotsearch.randomizedtesting.RandomizedRunner$6.evaluate(RandomizedRunner.java:827)
	at com.carrotsearch.randomizedtesting.RandomizedRunner$7.evaluate(RandomizedRunner.java:863)
	at com.carrotsearch.randomizedtesting.RandomizedRunner$8.evaluate(RandomizedRunner.java:877)
	at com.carrotsearch.randomizedtesting.rules.SystemPropertiesRestoreRule$1.evaluate(SystemPropertiesRestoreRule.java:53)
	at org.apache.lucene.util.TestRuleSetupTeardownChained$1.evaluate(TestRuleSetupTeardownChained.java:50)
	at org.apache.lucene.util.AbstractBeforeAfterRule$1.evaluate(AbstractBeforeAfterRule.java:46)
	at com.carrotsearch.randomizedtesting.rules.SystemPropertiesInvariantRule$1.evaluate(SystemPropertiesInvariantRule.java:55)
	at org.apache.lucene.util.TestRuleThreadAndTestName$1.evaluate(TestRuleThreadAndTestName.java:49)
	at org.apache.lucene.util.TestRuleIgnoreAfterMaxFailures$1.evaluate(TestRuleIgnoreAfterMaxFailures.java:65)
	at org.apache.lucene.util.TestRuleMarkFailure$1.evaluate(TestRuleMarkFailure.java:48)
	at com.carrotsearch.randomizedtesting.rules.StatementAdapter.evaluate(StatementAdapter.java:36)
	at com.carrotsearch.randomizedtesting.ThreadLeakControl$StatementRunner.run(ThreadLeakControl.java:365)
	at com.carrotsearch.randomizedtesting.ThreadLeakControl.forkTimeoutingTask(ThreadLeakControl.java:798)
	at com.carrotsearch.randomizedtesting.ThreadLeakControl$3.evaluate(ThreadLeakControl.java:458)
	at com.carrotsearch.randomizedtesting.RandomizedRunner.runSingleTest(RandomizedRunner.java:836)
	at com.carrotsearch.randomizedtesting.RandomizedRunner$3.evaluate(RandomizedRunner.java:738)
	at com.carrotsearch.randomizedtesting.RandomizedRunner$4.evaluate(RandomizedRunner.java:772)
	at com.carrotsearch.randomizedtesting.RandomizedRunner$5.evaluate(RandomizedRunner.java:783)
	at com.carrotsearch.randomizedtesting.rules.StatementAdapter.evaluate(StatementAdapter.java:36)
	at com.carrotsearch.randomizedtesting.rules.SystemPropertiesRestoreRule$1.evaluate(SystemPropertiesRestoreRule.java:53)
	at org.apache.lucene.util.AbstractBeforeAfterRule$1.evaluate(AbstractBeforeAfterRule.java:46)
	at org.apache.lucene.util.TestRuleStoreClassName$1.evaluate(TestRuleStoreClassName.java:42)
	at com.carrotsearch.randomizedtesting.rules.SystemPropertiesInvariantRule$1.evaluate(SystemPropertiesInvariantRule.java:55)
	at com.carrotsearch.randomizedtesting.rules.NoShadowingOrOverridesOnMethodsRule$1.evaluate(NoShadowingOrOverridesOnMethodsRule.java:39)
	at com.carrotsearch.randomizedtesting.rules.NoShadowingOrOverridesOnMethodsRule$1.evaluate(NoShadowingOrOverridesOnMethodsRule.java:39)
	at com.carrotsearch.randomizedtesting.rules.StatementAdapter.evaluate(StatementAdapter.java:36)
	at com.carrotsearch.randomizedtesting.rules.StatementAdapter.evaluate(StatementAdapter.java:36)
	at com.carrotsearch.randomizedtesting.rules.StatementAdapter.evaluate(StatementAdapter.java:36)
	at org.apache.lucene.util.TestRuleAssertionsRequired$1.evaluate(TestRuleAssertionsRequired.java:43)
	at org.apache.lucene.util.TestRuleMarkFailure$1.evaluate(TestRuleMarkFailure.java:48)
	at org.apache.lucene.util.TestRuleIgnoreAfterMaxFailures$1.evaluate(TestRuleIgnoreAfterMaxFailures.java:65)
	at org.apache.lucene.util.TestRuleIgnoreTestSuites$1.evaluate(TestRuleIgnoreTestSuites.java:55)
	at com.carrotsearch.randomizedtesting.rules.StatementAdapter.evaluate(StatementAdapter.java:36)
	at com.carrotsearch.randomizedtesting.ThreadLeakControl$StatementRunner.run(ThreadLeakControl.java:365)
	at java.lang.Thread.run(Thread.java:745)


FAILED:  org.apache.solr.client.solrj.embedded.SolrExampleStreamingBinaryTest.testExampleConfig

Error Message:
Expected mime type application/octet-stream but got text/html. <html> <head> <meta http-equiv="Content-Type" content="text/html;charset=ISO-8859-1"/> <title>Error 404 Can not find: /solr/admin/info/system</title> </head> <body> <h2>HTTP ERROR: 404</h2> <p>Problem accessing /solr/admin/info/system. Reason: <pre>    Can not find: /solr/admin/info/system</pre></p> <hr /><i><small>Powered by Jetty://</small></i>                                                                                                                                                                                                                                                                                                                                                                                                                                                                                                                                                                                                                                                                                                                                                                                                                                                                                                                                                                                                                     </body> </html> 

Stack Trace:
org.apache.solr.client.solrj.impl.HttpSolrServer$RemoteSolrException: Expected mime type application/octet-stream but got text/html. <html>
<head>
<meta http-equiv="Content-Type" content="text/html;charset=ISO-8859-1"/>
<title>Error 404 Can not find: /solr/admin/info/system</title>
</head>
<body>
<h2>HTTP ERROR: 404</h2>
<p>Problem accessing /solr/admin/info/system. Reason:
<pre>    Can not find: /solr/admin/info/system</pre></p>
<hr /><i><small>Powered by Jetty://</small></i>
                                                
                                                
                                                
                                                
                                                
                                                
                                                
                                                
                                                
                                                
                                                
                                                
                                                
                                                
                                                
                                                
                                                
                                                
                                                
                                                
</body>
</html>

	at __randomizedtesting.SeedInfo.seed([1B12087177D4DD82:AC3F1CE9B0D33B5B]:0)
	at org.apache.solr.client.solrj.impl.HttpSolrServer.executeMethod(HttpSolrServer.java:530)
	at org.apache.solr.client.solrj.impl.HttpSolrServer.request(HttpSolrServer.java:215)
	at org.apache.solr.client.solrj.impl.HttpSolrServer.request(HttpSolrServer.java:211)
	at org.apache.solr.client.solrj.request.QueryRequest.process(QueryRequest.java:91)
	at org.apache.solr.client.solrj.SolrServer.query(SolrServer.java:301)
	at org.apache.solr.client.solrj.SolrExampleTests.testExampleConfig(SolrExampleTests.java:220)
	at sun.reflect.NativeMethodAccessorImpl.invoke0(Native Method)
	at sun.reflect.NativeMethodAccessorImpl.invoke(NativeMethodAccessorImpl.java:62)
	at sun.reflect.DelegatingMethodAccessorImpl.invoke(DelegatingMethodAccessorImpl.java:43)
	at java.lang.reflect.Method.invoke(Method.java:484)
	at com.carrotsearch.randomizedtesting.RandomizedRunner.invoke(RandomizedRunner.java:1618)
	at com.carrotsearch.randomizedtesting.RandomizedRunner$6.evaluate(RandomizedRunner.java:827)
	at com.carrotsearch.randomizedtesting.RandomizedRunner$7.evaluate(RandomizedRunner.java:863)
	at com.carrotsearch.randomizedtesting.RandomizedRunner$8.evaluate(RandomizedRunner.java:877)
	at com.carrotsearch.randomizedtesting.rules.SystemPropertiesRestoreRule$1.evaluate(SystemPropertiesRestoreRule.java:53)
	at org.apache.lucene.util.TestRuleSetupTeardownChained$1.evaluate(TestRuleSetupTeardownChained.java:50)
	at org.apache.lucene.util.AbstractBeforeAfterRule$1.evaluate(AbstractBeforeAfterRule.java:46)
	at com.carrotsearch.randomizedtesting.rules.SystemPropertiesInvariantRule$1.evaluate(SystemPropertiesInvariantRule.java:55)
	at org.apache.lucene.util.TestRuleThreadAndTestName$1.evaluate(TestRuleThreadAndTestName.java:49)
	at org.apache.lucene.util.TestRuleIgnoreAfterMaxFailures$1.evaluate(TestRuleIgnoreAfterMaxFailures.java:65)
	at org.apache.lucene.util.TestRuleMarkFailure$1.evaluate(TestRuleMarkFailure.java:48)
	at com.carrotsearch.randomizedtesting.rules.StatementAdapter.evaluate(StatementAdapter.java:36)
	at com.carrotsearch.randomizedtesting.ThreadLeakControl$StatementRunner.run(ThreadLeakControl.java:365)
	at com.carrotsearch.randomizedtesting.ThreadLeakControl.forkTimeoutingTask(ThreadLeakControl.java:798)
	at com.carrotsearch.randomizedtesting.ThreadLeakControl$3.evaluate(ThreadLeakControl.java:458)
	at com.carrotsearch.randomizedtesting.RandomizedRunner.runSingleTest(RandomizedRunner.java:836)
	at com.carrotsearch.randomizedtesting.RandomizedRunner$3.evaluate(RandomizedRunner.java:738)
	at com.carrotsearch.randomizedtesting.RandomizedRunner$4.evaluate(RandomizedRunner.java:772)
	at com.carrotsearch.randomizedtesting.RandomizedRunner$5.evaluate(RandomizedRunner.java:783)
	at com.carrotsearch.randomizedtesting.rules.StatementAdapter.evaluate(StatementAdapter.java:36)
	at com.carrotsearch.randomizedtesting.rules.SystemPropertiesRestoreRule$1.evaluate(SystemPropertiesRestoreRule.java:53)
	at org.apache.lucene.util.AbstractBeforeAfterRule$1.evaluate(AbstractBeforeAfterRule.java:46)
	at org.apache.lucene.util.TestRuleStoreClassName$1.evaluate(TestRuleStoreClassName.java:42)
	at com.carrotsearch.randomizedtesting.rules.SystemPropertiesInvariantRule$1.evaluate(SystemPropertiesInvariantRule.java:55)
	at com.carrotsearch.randomizedtesting.rules.NoShadowingOrOverridesOnMethodsRule$1.evaluate(NoShadowingOrOverridesOnMethodsRule.java:39)
	at com.carrotsearch.randomizedtesting.rules.NoShadowingOrOverridesOnMethodsRule$1.evaluate(NoShadowingOrOverridesOnMethodsRule.java:39)
	at com.carrotsearch.randomizedtesting.rules.StatementAdapter.evaluate(StatementAdapter.java:36)
	at com.carrotsearch.randomizedtesting.rules.StatementAdapter.evaluate(StatementAdapter.java:36)
	at com.carrotsearch.randomizedtesting.rules.StatementAdapter.evaluate(StatementAdapter.java:36)
	at org.apache.lucene.util.TestRuleAssertionsRequired$1.evaluate(TestRuleAssertionsRequired.java:43)
	at org.apache.lucene.util.TestRuleMarkFailure$1.evaluate(TestRuleMarkFailure.java:48)
	at org.apache.lucene.util.TestRuleIgnoreAfterMaxFailures$1.evaluate(TestRuleIgnoreAfterMaxFailures.java:65)
	at org.apache.lucene.util.TestRuleIgnoreTestSuites$1.evaluate(TestRuleIgnoreTestSuites.java:55)
	at com.carrotsearch.randomizedtesting.rules.StatementAdapter.evaluate(StatementAdapter.java:36)
	at com.carrotsearch.randomizedtesting.ThreadLeakControl$StatementRunner.run(ThreadLeakControl.java:365)
	at java.lang.Thread.run(Thread.java:745)


FAILED:  org.apache.solr.client.solrj.embedded.SolrExampleStreamingTest.testExampleConfig

Error Message:
Expected mime type application/octet-stream but got text/html. <html> <head> <meta http-equiv="Content-Type" content="text/html;charset=ISO-8859-1"/> <title>Error 404 Can not find: /solr/admin/info/system</title> </head> <body> <h2>HTTP ERROR: 404</h2> <p>Problem accessing /solr/admin/info/system. Reason: <pre>    Can not find: /solr/admin/info/system</pre></p> <hr /><i><small>Powered by Jetty://</small></i>                                                                                                                                                                                                                                                                                                                                                                                                                                                                                                                                                                                                                                                                                                                                                                                                                                                                                                                                                                                                                     </body> </html> 

Stack Trace:
org.apache.solr.client.solrj.impl.HttpSolrServer$RemoteSolrException: Expected mime type application/octet-stream but got text/html. <html>
<head>
<meta http-equiv="Content-Type" content="text/html;charset=ISO-8859-1"/>
<title>Error 404 Can not find: /solr/admin/info/system</title>
</head>
<body>
<h2>HTTP ERROR: 404</h2>
<p>Problem accessing /solr/admin/info/system. Reason:
<pre>    Can not find: /solr/admin/info/system</pre></p>
<hr /><i><small>Powered by Jetty://</small></i>
                                                
                                                
                                                
                                                
                                                
                                                
                                                
                                                
                                                
                                                
                                                
                                                
                                                
                                                
                                                
                                                
                                                
                                                
                                                
                                                
</body>
</html>

	at __randomizedtesting.SeedInfo.seed([1B12087177D4DD82:AC3F1CE9B0D33B5B]:0)
	at org.apache.solr.client.solrj.impl.HttpSolrServer.executeMethod(HttpSolrServer.java:530)
	at org.apache.solr.client.solrj.impl.HttpSolrServer.request(HttpSolrServer.java:215)
	at org.apache.solr.client.solrj.impl.HttpSolrServer.request(HttpSolrServer.java:211)
	at org.apache.solr.client.solrj.request.QueryRequest.process(QueryRequest.java:91)
	at org.apache.solr.client.solrj.SolrServer.query(SolrServer.java:301)
	at org.apache.solr.client.solrj.SolrExampleTests.testExampleConfig(SolrExampleTests.java:220)
	at sun.reflect.NativeMethodAccessorImpl.invoke0(Native Method)
	at sun.reflect.NativeMethodAccessorImpl.invoke(NativeMethodAccessorImpl.java:62)
	at sun.reflect.DelegatingMethodAccessorImpl.invoke(DelegatingMethodAccessorImpl.java:43)
	at java.lang.reflect.Method.invoke(Method.java:484)
	at com.carrotsearch.randomizedtesting.RandomizedRunner.invoke(RandomizedRunner.java:1618)
	at com.carrotsearch.randomizedtesting.RandomizedRunner$6.evaluate(RandomizedRunner.java:827)
	at com.carrotsearch.randomizedtesting.RandomizedRunner$7.evaluate(RandomizedRunner.java:863)
	at com.carrotsearch.randomizedtesting.RandomizedRunner$8.evaluate(RandomizedRunner.java:877)
	at com.carrotsearch.randomizedtesting.rules.SystemPropertiesRestoreRule$1.evaluate(SystemPropertiesRestoreRule.java:53)
	at org.apache.lucene.util.TestRuleSetupTeardownChained$1.evaluate(TestRuleSetupTeardownChained.java:50)
	at org.apache.lucene.util.AbstractBeforeAfterRule$1.evaluate(AbstractBeforeAfterRule.java:46)
	at com.carrotsearch.randomizedtesting.rules.SystemPropertiesInvariantRule$1.evaluate(SystemPropertiesInvariantRule.java:55)
	at org.apache.lucene.util.TestRuleThreadAndTestName$1.evaluate(TestRuleThreadAndTestName.java:49)
	at org.apache.lucene.util.TestRuleIgnoreAfterMaxFailures$1.evaluate(TestRuleIgnoreAfterMaxFailures.java:65)
	at org.apache.lucene.util.TestRuleMarkFailure$1.evaluate(TestRuleMarkFailure.java:48)
	at com.carrotsearch.randomizedtesting.rules.StatementAdapter.evaluate(StatementAdapter.java:36)
	at com.carrotsearch.randomizedtesting.ThreadLeakControl$StatementRunner.run(ThreadLeakControl.java:365)
	at com.carrotsearch.randomizedtesting.ThreadLeakControl.forkTimeoutingTask(ThreadLeakControl.java:798)
	at com.carrotsearch.randomizedtesting.ThreadLeakControl$3.evaluate(ThreadLeakControl.java:458)
	at com.carrotsearch.randomizedtesting.RandomizedRunner.runSingleTest(RandomizedRunner.java:836)
	at com.carrotsearch.randomizedtesting.RandomizedRunner$3.evaluate(RandomizedRunner.java:738)
	at com.carrotsearch.randomizedtesting.RandomizedRunner$4.evaluate(RandomizedRunner.java:772)
	at com.carrotsearch.randomizedtesting.RandomizedRunner$5.evaluate(RandomizedRunner.java:783)
	at com.carrotsearch.randomizedtesting.rules.StatementAdapter.evaluate(StatementAdapter.java:36)
	at com.carrotsearch.randomizedtesting.rules.SystemPropertiesRestoreRule$1.evaluate(SystemPropertiesRestoreRule.java:53)
	at org.apache.lucene.util.AbstractBeforeAfterRule$1.evaluate(AbstractBeforeAfterRule.java:46)
	at org.apache.lucene.util.TestRuleStoreClassName$1.evaluate(TestRuleStoreClassName.java:42)
	at com.carrotsearch.randomizedtesting.rules.SystemPropertiesInvariantRule$1.evaluate(SystemPropertiesInvariantRule.java:55)
	at com.carrotsearch.randomizedtesting.rules.NoShadowingOrOverridesOnMethodsRule$1.evaluate(NoShadowingOrOverridesOnMethodsRule.java:39)
	at com.carrotsearch.randomizedtesting.rules.NoShadowingOrOverridesOnMethodsRule$1.evaluate(NoShadowingOrOverridesOnMethodsRule.java:39)
	at com.carrotsearch.randomizedtesting.rules.StatementAdapter.evaluate(StatementAdapter.java:36)
	at com.carrotsearch.randomizedtesting.rules.StatementAdapter.evaluate(StatementAdapter.java:36)
	at com.carrotsearch.randomizedtesting.rules.StatementAdapter.evaluate(StatementAdapter.java:36)
	at org.apache.lucene.util.TestRuleAssertionsRequired$1.evaluate(TestRuleAssertionsRequired.java:43)
	at org.apache.lucene.util.TestRuleMarkFailure$1.evaluate(TestRuleMarkFailure.java:48)
	at org.apache.lucene.util.TestRuleIgnoreAfterMaxFailures$1.evaluate(TestRuleIgnoreAfterMaxFailures.java:65)
	at org.apache.lucene.util.TestRuleIgnoreTestSuites$1.evaluate(TestRuleIgnoreTestSuites.java:55)
	at com.carrotsearch.randomizedtesting.rules.StatementAdapter.evaluate(StatementAdapter.java:36)
	at com.carrotsearch.randomizedtesting.ThreadLeakControl$StatementRunner.run(ThreadLeakControl.java:365)
	at java.lang.Thread.run(Thread.java:745)




Build Log:
[...truncated 12434 lines...]
   [junit4] Suite: org.apache.solr.client.solrj.embedded.SolrExampleJettyTest
   [junit4]   2> Creating dataDir: /mnt/ssd/jenkins/workspace/Lucene-Solr-5.x-Linux/solr/build/solr-solrj/test/J1/temp/solr.client.solrj.embedded.SolrExampleJettyTest-1B12087177D4DD82-001/init-core-data-001
   [junit4]   2> 98123 T167 oas.SolrTestCaseJ4.initCore ####initCore
   [junit4]   2> 98124 T167 oas.SolrTestCaseJ4.initCore ####initCore end
   [junit4]   2> 98124 T167 oejs.Server.doStart jetty-8.1.10.v20130312
   [junit4]   2> 98128 T167 oejs.AbstractConnector.doStart Started SelectChannelConnector@127.0.0.1:37861
   [junit4]   2> 98129 T167 oass.SolrDispatchFilter.init SolrDispatchFilter.init()
   [junit4]   2> 98129 T167 oasc.SolrResourceLoader.locateSolrHome JNDI not configured for solr (NoInitialContextEx)
   [junit4]   2> 98130 T167 oasc.SolrResourceLoader.locateSolrHome using system property solr.solr.home: /mnt/ssd/jenkins/workspace/Lucene-Solr-5.x-Linux/solr/example/solr
   [junit4]   2> 98130 T167 oasc.SolrResourceLoader.<init> new SolrResourceLoader for directory: '/mnt/ssd/jenkins/workspace/Lucene-Solr-5.x-Linux/solr/example/solr/'
   [junit4]   2> 98144 T167 oasc.ConfigSolr.fromFile Loading container configuration from /mnt/ssd/jenkins/workspace/Lucene-Solr-5.x-Linux/solr/example/solr/solr.xml
   [junit4]   2> 98167 T167 oasc.CorePropertiesLocator.<init> Config-defined core root directory: /mnt/ssd/jenkins/workspace/Lucene-Solr-5.x-Linux/solr/example/solr
   [junit4]   2> 98167 T167 oasc.CoreContainer.<init> New CoreContainer 3485247
   [junit4]   2> 98167 T167 oasc.CoreContainer.load Loading cores into CoreContainer [instanceDir=/mnt/ssd/jenkins/workspace/Lucene-Solr-5.x-Linux/solr/example/solr/]
   [junit4]   2> 98168 T167 oashc.HttpShardHandlerFactory.getParameter Setting socketTimeout to: 0
   [junit4]   2> 98168 T167 oashc.HttpShardHandlerFactory.getParameter Setting urlScheme to: null
   [junit4]   2> 98168 T167 oashc.HttpShardHandlerFactory.getParameter Setting connTimeout to: 0
   [junit4]   2> 98169 T167 oashc.HttpShardHandlerFactory.getParameter Setting maxConnectionsPerHost to: 20
   [junit4]   2> 98169 T167 oashc.HttpShardHandlerFactory.getParameter Setting corePoolSize to: 0
   [junit4]   2> 98169 T167 oashc.HttpShardHandlerFactory.getParameter Setting maximumPoolSize to: 2147483647
   [junit4]   2> 98169 T167 oashc.HttpShardHandlerFactory.getParameter Setting maxThreadIdleTime to: 5
   [junit4]   2> 98169 T167 oashc.HttpShardHandlerFactory.getParameter Setting sizeOfQueue to: -1
   [junit4]   2> 98170 T167 oashc.HttpShardHandlerFactory.getParameter Setting fairnessPolicy to: false
   [junit4]   2> 98170 T167 oasu.UpdateShardHandler.<init> Creating UpdateShardHandler HTTP client with params: socketTimeout=0&connTimeout=0&retry=false
   [junit4]   2> 98170 T167 oasl.LogWatcher.createWatcher SLF4J impl is org.slf4j.impl.Log4jLoggerFactory
   [junit4]   2> 98170 T167 oasl.LogWatcher.newRegisteredLogWatcher Registering Log Listener [Log4j (org.slf4j.impl.Log4jLoggerFactory)]
   [junit4]   2> 98171 T167 oasc.CoreContainer.load Host Name: 
   [junit4]   2> 98172 T167 oasc.CorePropertiesLocator.discover Looking for core definitions underneath /mnt/ssd/jenkins/workspace/Lucene-Solr-5.x-Linux/solr/example/solr
   [junit4]   2> 98177 T167 oasc.CorePropertiesLocator.discoverUnder Found core collection1 in /mnt/ssd/jenkins/workspace/Lucene-Solr-5.x-Linux/solr/example/solr/collection1/
   [junit4]   2> 98180 T167 oasc.CorePropertiesLocator.discover Found 1 core definitions
   [junit4]   2> 98181 T177 oasc.SolrResourceLoader.<init> new SolrResourceLoader for directory: '/mnt/ssd/jenkins/workspace/Lucene-Solr-5.x-Linux/solr/example/solr/collection1/'
   [junit4]   2> 98221 T177 oasc.SolrConfig.initLibs Adding specified lib dirs to ClassLoader
   [junit4]   2> 98223 T177 oasc.SolrResourceLoader.addToClassLoader WARN No files added to classloader from lib: ../../../contrib/extraction/lib (resolved as: /mnt/ssd/jenkins/workspace/Lucene-Solr-5.x-Linux/solr/example/solr/collection1/../../../contrib/extraction/lib).
   [junit4]   2> 98224 T177 oasc.SolrResourceLoader.addToClassLoader WARN Can't find (or read) directory to add to classloader: ../../../dist/ (resolved as: /mnt/ssd/jenkins/workspace/Lucene-Solr-5.x-Linux/solr/example/solr/collection1/../../../dist).
   [junit4]   2> 98225 T177 oasc.SolrResourceLoader.addToClassLoader WARN No files added to classloader from lib: ../../../contrib/clustering/lib/ (resolved as: /mnt/ssd/jenkins/workspace/Lucene-Solr-5.x-Linux/solr/example/solr/collection1/../../../contrib/clustering/lib).
   [junit4]   2> 98225 T177 oasc.SolrResourceLoader.addToClassLoader WARN Can't find (or read) directory to add to classloader: ../../../dist/ (resolved as: /mnt/ssd/jenkins/workspace/Lucene-Solr-5.x-Linux/solr/example/solr/collection1/../../../dist).
   [junit4]   2> 98225 T177 oasc.SolrResourceLoader.addToClassLoader WARN No files added to classloader from lib: ../../../contrib/langid/lib/ (resolved as: /mnt/ssd/jenkins/workspace/Lucene-Solr-5.x-Linux/solr/example/solr/collection1/../../../contrib/langid/lib).
   [junit4]   2> 98225 T177 oasc.SolrResourceLoader.addToClassLoader WARN Can't find (or read) directory to add to classloader: ../../../dist/ (resolved as: /mnt/ssd/jenkins/workspace/Lucene-Solr-5.x-Linux/solr/example/solr/collection1/../../../dist).
   [junit4]   2> 98226 T177 oasc.SolrResourceLoader.addToClassLoader WARN No files added to classloader from lib: ../../../contrib/velocity/lib (resolved as: /mnt/ssd/jenkins/workspace/Lucene-Solr-5.x-Linux/solr/example/solr/collection1/../../../contrib/velocity/lib).
   [junit4]   2> 98226 T177 oasc.SolrResourceLoader.addToClassLoader WARN Can't find (or read) directory to add to classloader: ../../../dist/ (resolved as: /mnt/ssd/jenkins/workspace/Lucene-Solr-5.x-Linux/solr/example/solr/collection1/../../../dist).
   [junit4]   2> 98260 T177 oasu.SolrIndexConfig.<init> IndexWriter infoStream solr logging is enabled
   [junit4]   2> 98263 T177 oasc.SolrConfig.<init> Using Lucene MatchVersion: 5.0.0
   [junit4]   2> 98351 T177 oasc.SolrConfig.<init> Loaded SolrConfig: solrconfig.xml
   [junit4]   2> 98353 T177 oass.IndexSchema.readSchema Reading Solr Schema from schema.xml
   [junit4]   2> 98387 T177 oass.IndexSchema.readSchema [collection1] Schema name=example
   [junit4]   2> 99074 T177 oass.IndexSchema.readSchema unique key field: id
   [junit4]   2> 99079 T177 oasr.RestManager$Registry.registerManagedResource Registered ManagedResource impl org.apache.solr.rest.schema.analysis.ManagedWordSetResource for path /schema/analysis/stopwords/english
   [junit4]   2> 99080 T177 oasr.RestManager$Registry.registerManagedResource Registered ManagedResource impl org.apache.solr.rest.schema.analysis.ManagedSynonymFilterFactory$SynonymManager for path /schema/analysis/synonyms/english
   [junit4]   2> 99139 T177 oass.FileExchangeRateProvider.reload Reloading exchange rates from file currency.xml
   [junit4]   2> 99146 T177 oass.FileExchangeRateProvider.reload Reloading exchange rates from file currency.xml
   [junit4]   2> 99240 T177 oasc.CoreContainer.create Creating SolrCore 'collection1' using configuration from instancedir /mnt/ssd/jenkins/workspace/Lucene-Solr-5.x-Linux/solr/example/solr/collection1/
   [junit4]   2> 99240 T177 oasc.SolrCore.initDirectoryFactory org.apache.solr.core.MockDirectoryFactory
   [junit4]   2> 99241 T177 oasc.SolrCore.<init> [collection1] Opening new SolrCore at /mnt/ssd/jenkins/workspace/Lucene-Solr-5.x-Linux/solr/example/solr/collection1/, dataDir=/mnt/ssd/jenkins/workspace/Lucene-Solr-5.x-Linux/solr/build/solr-solrj/test/J1/temp/solr.client.solrj.embedded.SolrExampleJettyTest-1B12087177D4DD82-001/tempDir-001/
   [junit4]   2> 99244 T177 oasc.JmxMonitoredMap.<init> No JMX servers found, not exposing Solr information with JMX.
   [junit4]   2> 99251 T177 oasc.SolrCore.initListeners [collection1] Added SolrEventListener for newSearcher: org.apache.solr.core.QuerySenderListener{queries=[]}
   [junit4]   2> 99251 T177 oasc.SolrCore.initListeners [collection1] Added SolrEventListener for firstSearcher: org.apache.solr.core.QuerySenderListener{queries=[{q=static firstSearcher warming in solrconfig.xml}]}
   [junit4]   2> 99261 T177 oasc.CachingDirectoryFactory.get return new directory for /mnt/ssd/jenkins/workspace/Lucene-Solr-5.x-Linux/solr/build/solr-solrj/test/J1/temp/solr.client.solrj.embedded.SolrExampleJettyTest-1B12087177D4DD82-001/tempDir-001
   [junit4]   2> 99261 T177 oasc.SolrCore.getNewIndexDir New index directory detected: old=null new=/mnt/ssd/jenkins/workspace/Lucene-Solr-5.x-Linux/solr/build/solr-solrj/test/J1/temp/solr.client.solrj.embedded.SolrExampleJettyTest-1B12087177D4DD82-001/tempDir-001/index/
   [junit4]   2> 99261 T177 oasc.SolrCore.initIndex WARN [collection1] Solr index directory '/mnt/ssd/jenkins/workspace/Lucene-Solr-5.x-Linux/solr/build/solr-solrj/test/J1/temp/solr.client.solrj.embedded.SolrExampleJettyTest-1B12087177D4DD82-001/tempDir-001/index' doesn't exist. Creating new index...
   [junit4]   2> 99261 T177 oasc.CachingDirectoryFactory.get return new directory for /mnt/ssd/jenkins/workspace/Lucene-Solr-5.x-Linux/solr/build/solr-solrj/test/J1/temp/solr.client.solrj.embedded.SolrExampleJettyTest-1B12087177D4DD82-001/tempDir-001/index
   [junit4]   2> 99262 T177 oasu.LoggingInfoStream.message [IFD][coreLoadExecutor-101-thread-1]: init: current segments file is "null"; deletionPolicy=org.apache.solr.core.IndexDeletionPolicyWrapper@e9954b
   [junit4]   2> 99262 T177 oasu.LoggingInfoStream.message [IFD][coreLoadExecutor-101-thread-1]: now checkpoint "" [0 segments ; isCommit = false]
   [junit4]   2> 99262 T177 oasu.LoggingInfoStream.message [IFD][coreLoadExecutor-101-thread-1]: 0 msec to checkpoint
   [junit4]   2> 99262 T177 oasu.LoggingInfoStream.message [IW][coreLoadExecutor-101-thread-1]: init: create=true
   [junit4]   2> 99263 T177 oasu.LoggingInfoStream.message [IW][coreLoadExecutor-101-thread-1]: 
   [junit4]   2> 	dir=MockDirectoryWrapper(RAMDirectory(id=lucene-15b91c6))
   [junit4]   2> 	index=
   [junit4]   2> 	version=5.0.0
   [junit4]   2> 	analyzer=null
   [junit4]   2> 	ramBufferSizeMB=100.0
   [junit4]   2> 	maxBufferedDocs=-1
   [junit4]   2> 	maxBufferedDeleteTerms=-1
   [junit4]   2> 	mergedSegmentWarmer=null
   [junit4]   2> 	delPolicy=org.apache.solr.core.IndexDeletionPolicyWrapper
   [junit4]   2> 	commit=null
   [junit4]   2> 	openMode=CREATE
   [junit4]   2> 	similarity=org.apache.lucene.search.similarities.DefaultSimilarity
   [junit4]   2> 	mergeScheduler=ConcurrentMergeScheduler: maxThreadCount=1, maxMergeCount=2, mergeThreadPriority=-1
   [junit4]   2> 	default WRITE_LOCK_TIMEOUT=1000
   [junit4]   2> 	writeLockTimeout=1000
   [junit4]   2> 	codec=Lucene50
   [junit4]   2> 	infoStream=org.apache.solr.update.LoggingInfoStream
   [junit4]   2> 	mergePolicy=[TieredMergePolicy: maxMergeAtOnce=10, maxMergeAtOnceExplicit=30, maxMergedSegmentMB=5120.0, floorSegmentMB=2.0, forceMergeDeletesPctAllowed=10.0, segmentsPerTier=10.0, maxCFSSegmentSizeMB=8.796093022207999E12, noCFSRatio=0.0
   [junit4]   2> 	indexerThreadPool=org.apache.lucene.index.DocumentsWriterPerThreadPool@14ff1b1
   [junit4]   2> 	readerPooling=false
   [junit4]   2> 	perThreadHardLimitMB=1945
   [junit4]   2> 	useCompoundFile=false
   [junit4]   2> 	checkIntegrityAtMerge=false
   [junit4]   2> 	commitOnClose=true
   [junit4]   2> 	writer=org.apache.lucene.util.SetOnce@1b1d09c
   [junit4]   2> 	
   [junit4]   2> 99264 T177 oasu.LoggingInfoStream.message [IW][coreLoadExecutor-101-thread-1]: now flush at close
   [junit4]   2> 99264 T177 oasu.LoggingInfoStream.message [IW][coreLoadExecutor-101-thread-1]:   start flush: applyAllDeletes=true
   [junit4]   2> 99264 T177 oasu.LoggingInfoStream.message [IW][coreLoadExecutor-101-thread-1]:   index before flush 
   [junit4]   2> 99264 T177 oasu.LoggingInfoStream.message [DW][coreLoadExecutor-101-thread-1]: startFullFlush
   [junit4]   2> 99264 T177 oasu.LoggingInfoStream.message [DW][coreLoadExecutor-101-thread-1]: anyChanges? numDocsInRam=0 deletes=false hasTickets:false pendingChangesInFullFlush: false
   [junit4]   2> 99264 T177 oasu.LoggingInfoStream.message [DW][coreLoadExecutor-101-thread-1]: coreLoadExecutor-101-thread-1 finishFullFlush success=true
   [junit4]   2> 99264 T177 oasu.LoggingInfoStream.message [IW][coreLoadExecutor-101-thread-1]: apply all deletes during flush
   [junit4]   2> 99265 T177 oasu.LoggingInfoStream.message [BD][coreLoadExecutor-101-thread-1]: prune sis=null:  minGen=9223372036854775807 packetCount=0
   [junit4]   2> 99265 T177 oasu.LoggingInfoStream.message [CMS][coreLoadExecutor-101-thread-1]: now merge
   [junit4]   2> 99265 T177 oasu.LoggingInfoStream.message [CMS][coreLoadExecutor-101-thread-1]:   index: 
   [junit4]   2> 99265 T177 oasu.LoggingInfoStream.message [CMS][coreLoadExecutor-101-thread-1]:   no more merges pending; now return
   [junit4]   2> 99265 T177 oasu.LoggingInfoStream.message [IW][coreLoadExecutor-101-thread-1]: waitForMerges
   [junit4]   2> 99265 T177 oasu.LoggingInfoStream.message [IW][coreLoadExecutor-101-thread-1]: waitForMerges done
   [junit4]   2> 99266 T177 oasu.LoggingInfoStream.message [IW][coreLoadExecutor-101-thread-1]: commit: start
   [junit4]   2> 99266 T177 oasu.LoggingInfoStream.message [IW][coreLoadExecutor-101-thread-1]: commit: enter lock
   [junit4]   2> 99266 T177 oasu.LoggingInfoStream.message [IW][coreLoadExecutor-101-thread-1]: commit: now prepare
   [junit4]   2> 99266 T177 oasu.LoggingInfoStream.message [IW][coreLoadExecutor-101-thread-1]: prepareCommit: flush
   [junit4]   2> 99266 T177 oasu.LoggingInfoStream.message [IW][coreLoadExecutor-101-thread-1]:   index before flush 
   [junit4]   2> 99266 T177 oasu.LoggingInfoStream.message [DW][coreLoadExecutor-101-thread-1]: startFullFlush
   [junit4]   2> 99266 T177 oasu.LoggingInfoStream.message [DW][coreLoadExecutor-101-thread-1]: anyChanges? numDocsInRam=0 deletes=false hasTickets:false pendingChangesInFullFlush: false
   [junit4]   2> 99267 T177 oasu.LoggingInfoStream.message [IW][coreLoadExecutor-101-thread-1]: apply all deletes during flush
   [junit4]   2> 99267 T177 oasu.LoggingInfoStream.message [BD][coreLoadExecutor-101-thread-1]: prune sis=null:  minGen=9223372036854775807 packetCount=0
   [junit4]   2> 99267 T177 oasu.LoggingInfoStream.message [DW][coreLoadExecutor-101-thread-1]: coreLoadExecutor-101-thread-1 finishFullFlush success=true
   [junit4]   2> 99267 T177 oasu.LoggingInfoStream.message [IW][coreLoadExecutor-101-thread-1]: startCommit(): start
   [junit4]   2> 99267 T177 oasu.LoggingInfoStream.message [IW][coreLoadExecutor-101-thread-1]: startCommit index= changeCount=1
   [junit4]   2> 99268 T177 oasu.LoggingInfoStream.message [IW][coreLoadExecutor-101-thread-1]: done all syncs: []
   [junit4]   2> 99268 T177 oasu.LoggingInfoStream.message [IW][coreLoadExecutor-101-thread-1]: commit: pendingCommit != null
   [junit4]   2> 99268 T177 oasu.LoggingInfoStream.message [IFD][coreLoadExecutor-101-thread-1]: now checkpoint "" [0 segments ; isCommit = true]
   [junit4]   2> 99268 T177 oasc.SolrDeletionPolicy.onCommit SolrDeletionPolicy.onCommit: commits: num=1
   [junit4]   2> 		commit{dir=MockDirectoryWrapper(RAMDirectory(id=lucene-15b91c6)),segFN=segments_1,generation=1}
   [junit4]   2> 99268 T177 oasc.SolrDeletionPolicy.updateCommits newest commit generation = 1
   [junit4]   2> 99268 T177 oasu.LoggingInfoStream.message [IFD][coreLoadExecutor-101-thread-1]: 0 msec to checkpoint
   [junit4]   2> 99269 T177 oasu.LoggingInfoStream.message [IW][coreLoadExecutor-101-thread-1]: commit: wrote segments file "segments_1"
   [junit4]   2> 99270 T177 oasu.LoggingInfoStream.message [IW][coreLoadExecutor-101-thread-1]: commit: took 2.8 msec
   [junit4]   2> 99270 T177 oasu.LoggingInfoStream.message [IW][coreLoadExecutor-101-thread-1]: commit: done
   [junit4]   2> 99270 T177 oasu.LoggingInfoStream.message [IW][coreLoadExecutor-101-thread-1]: rollback
   [junit4]   2> 99270 T177 oasu.LoggingInfoStream.message [IW][coreLoadExecutor-101-thread-1]: all running merges have aborted
   [junit4]   2> 99270 T177 oasu.LoggingInfoStream.message [IW][coreLoadExecutor-101-thread-1]: rollback: done finish merges
   [junit4]   2> 99270 T177 oasu.LoggingInfoStream.message [DW][coreLoadExecutor-101-thread-1]: abort
   [junit4]   2> 99270 T177 oasu.LoggingInfoStream.message [DW][coreLoadExecutor-101-thread-1]: done abort; abortedFiles=[] success=true
   [junit4]   2> 99271 T177 oasu.LoggingInfoStream.message [IW][coreLoadExecutor-101-thread-1]: rollback: infos=
   [junit4]   2> 99271 T177 oasu.LoggingInfoStream.message [IFD][coreLoadExecutor-101-thread-1]: now checkpoint "" [0 segments ; isCommit = false]
   [junit4]   2> 99271 T177 oasu.LoggingInfoStream.message [IFD][coreLoadExecutor-101-thread-1]: 0 msec to checkpoint
   [junit4]   2> 99278 T177 oasc.SolrCore.initWriters created json: solr.JSONResponseWriter
   [junit4]   2> 99279 T177 oasc.SolrCore.initWriters adding lazy queryResponseWriter: solr.VelocityResponseWriter
   [junit4]   2> 99280 T177 oasc.SolrCore.initWriters created velocity: solr.VelocityResponseWriter
   [junit4]   2> 99287 T177 oasc.SolrCore.initWriters created xslt: solr.XSLTResponseWriter
   [junit4]   2> 99287 T177 oasr.XSLTResponseWriter.init xsltCacheLifetimeSeconds=5
   [junit4]   2> 99359 T177 oasc.SolrCore.loadUpdateProcessorChains no updateRequestProcessorChain defined as default, creating implicit default
   [junit4]   2> 99359 T177 oasc.RequestHandlers.initHandlersFromConfig created /update/csv: org.apache.solr.handler.UpdateRequestHandler
   [junit4]   2> 99359 T177 oasc.RequestHandlers.initHandlersFromConfig created /update/json: org.apache.solr.handler.UpdateRequestHandler
   [junit4]   2> 99359 T177 oasc.RequestHandlers.initHandlersFromConfig created /update/json/docs: org.apache.solr.handler.UpdateRequestHandler
   [junit4]   2> 99360 T177 oasc.RequestHandlers.initHandlersFromConfig created /update: org.apache.solr.handler.UpdateRequestHandler
   [junit4]   2> 99368 T177 oasc.RequestHandlers.initHandlersFromConfig created /select: solr.SearchHandler
   [junit4]   2> 99368 T177 oasc.RequestHandlers.initHandlersFromConfig created /query: solr.SearchHandler
   [junit4]   2> 99372 T177 oasc.RequestHandlers.initHandlersFromConfig created /get: solr.RealTimeGetHandler
   [junit4]   2> 99372 T177 oasc.RequestHandlers.initHandlersFromConfig created /export: solr.SearchHandler
   [junit4]   2> 99372 T177 oasc.RequestHandlers.initHandlersFromConfig created /browse: solr.SearchHandler
   [junit4]   2> 99372 T177 oasc.RequestHandlers.initHandlersFromConfig adding lazy requestHandler: solr.extraction.ExtractingRequestHandler
   [junit4]   2> 99372 T177 oasc.RequestHandlers.initHandlersFromConfig created /update/extract: solr.extraction.ExtractingRequestHandler
   [junit4]   2> 99373 T177 oasc.RequestHandlers.initHandlersFromConfig adding lazy requestHandler: solr.FieldAnalysisRequestHandler
   [junit4]   2> 99373 T177 oasc.RequestHandlers.initHandlersFromConfig created /analysis/field: solr.FieldAnalysisRequestHandler
   [junit4]   2> 99373 T177 oasc.RequestHandlers.initHandlersFromConfig adding lazy requestHandler: solr.DocumentAnalysisRequestHandler
   [junit4]   2> 99373 T177 oasc.RequestHandlers.initHandlersFromConfig created /analysis/document: solr.DocumentAnalysisRequestHandler
   [junit4]   2> 99379 T177 oasc.RequestHandlers.initHandlersFromConfig created /admin/: solr.admin.AdminHandlers
   [junit4]   2> 99382 T177 oasc.RequestHandlers.initHandlersFromConfig created /admin/ping: solr.PingRequestHandler
   [junit4]   2> 99386 T177 oasc.RequestHandlers.initHandlersFromConfig created /debug/dump: solr.DumpRequestHandler
   [junit4]   2> 99386 T177 oasc.RequestHandlers.initHandlersFromConfig created /replication: solr.ReplicationHandler
   [junit4]   2> 99386 T177 oasc.RequestHandlers.initHandlersFromConfig adding lazy requestHandler: solr.SearchHandler
   [junit4]   2> 99386 T177 oasc.RequestHandlers.initHandlersFromConfig created /spell: solr.SearchHandler
   [junit4]   2> 99386 T177 oasc.RequestHandlers.initHandlersFromConfig adding lazy requestHandler: solr.SearchHandler
   [junit4]   2> 99386 T177 oasc.RequestHandlers.initHandlersFromConfig created /suggest: solr.SearchHandler
   [junit4]   2> 99387 T177 oasc.RequestHandlers.initHandlersFromConfig adding lazy requestHandler: solr.SearchHandler
   [junit4]   2> 99387 T177 oasc.RequestHandlers.initHandlersFromConfig created /tvrh: solr.SearchHandler
   [junit4]   2> 99387 T177 oasc.RequestHandlers.initHandlersFromConfig adding lazy requestHandler: solr.SearchHandler
   [junit4]   2> 99387 T177 oasc.RequestHandlers.initHandlersFromConfig created /terms: solr.SearchHandler
   [junit4]   2> 99387 T177 oasc.RequestHandlers.initHandlersFromConfig adding lazy requestHandler: solr.SearchHandler
   [junit4]   2> 99387 T177 oasc.RequestHandlers.initHandlersFromConfig created /elevate: solr.SearchHandler
   [junit4]   2> 99389 T177 oashl.XMLLoader.init xsltCacheLifetimeSeconds=60
   [junit4]   2> 99390 T177 oashl.XMLLoader.init xsltCacheLifetimeSeconds=60
   [junit4]   2> 99391 T177 oashl.XMLLoader.init xsltCacheLifetimeSeconds=60
   [junit4]   2> 99392 T177 oashl.XMLLoader.init xsltCacheLifetimeSeconds=60
   [junit4]   2> 99404 T177 oasu.CommitTracker.<init> Hard AutoCommit: if uncommited for 15000ms; 
   [junit4]   2> 99404 T177 oasu.CommitTracker.<init> Soft AutoCommit: disabled
   [junit4]   2> 99406 T177 oasu.LoggingInfoStream.message [IFD][coreLoadExecutor-101-thread-1]: init: current segments file is "segments_1"; deletionPolicy=org.apache.solr.core.IndexDeletionPolicyWrapper@e9954b
   [junit4]   2> 99406 T177 oasu.LoggingInfoStream.message [IFD][coreLoadExecutor-101-thread-1]: init: load commit "segments_1"
   [junit4]   2> 99407 T177 oasc.SolrDeletionPolicy.onInit SolrDeletionPolicy.onInit: commits: num=1
   [junit4]   2> 		commit{dir=MockDirectoryWrapper(RAMDirectory(id=lucene-15b91c6)),segFN=segments_1,generation=1}
   [junit4]   2> 99407 T177 oasc.SolrDeletionPolicy.updateCommits newest commit generation = 1
   [junit4]   2> 99407 T177 oasu.LoggingInfoStream.message [IFD][coreLoadExecutor-101-thread-1]: now checkpoint "" [0 segments ; isCommit = false]
   [junit4]   2> 99407 T177 oasu.LoggingInfoStream.message [IFD][coreLoadExecutor-101-thread-1]: 0 msec to checkpoint
   [junit4]   2> 99408 T177 oasu.LoggingInfoStream.message [IW][coreLoadExecutor-101-thread-1]: init: create=false
   [junit4]   2> 99408 T177 oasu.LoggingInfoStream.message [IW][coreLoadExecutor-101-thread-1]: 
   [junit4]   2> 	dir=MockDirectoryWrapper(RAMDirectory(id=lucene-15b91c6))
   [junit4]   2> 	index=
   [junit4]   2> 	version=5.0.0
   [junit4]   2> 	analyzer=null
   [junit4]   2> 	ramBufferSizeMB=100.0
   [junit4]   2> 	maxBufferedDocs=-1
   [junit4]   2> 	maxBufferedDeleteTerms=-1
   [junit4]   2> 	mergedSegmentWarmer=null
   [junit4]   2> 	delPolicy=org.apache.solr.core.IndexDeletionPolicyWrapper
   [junit4]   2> 	commit=null
   [junit4]   2> 	openMode=APPEND
   [junit4]   2> 	similarity=org.apache.lucene.search.similarities.DefaultSimilarity
   [junit4]   2> 	mergeScheduler=ConcurrentMergeScheduler: maxThreadCount=1, maxMergeCount=2, mergeThreadPriority=-1
   [junit4]   2> 	default WRITE_LOCK_TIMEOUT=1000
   [junit4]   2> 	writeLockTimeout=1000
   [junit4]   2> 	codec=Lucene50
   [junit4]   2> 	infoStream=org.apache.solr.update.LoggingInfoStream
   [junit4]   2> 	mergePolicy=[TieredMergePolicy: maxMergeAtOnce=10, maxMergeAtOnceExplicit=30, maxMergedSegmentMB=5120.0, floorSegmentMB=2.0, forceMergeDeletesPctAllowed=10.0, segmentsPerTier=10.0, maxCFSSegmentSizeMB=8.796093022207999E12, noCFSRatio=0.0
   [junit4]   2> 	indexerThreadPool=org.apache.lucene.index.DocumentsWriterPerThreadPool@1dbf17
   [junit4]   2> 	readerPooling=false
   [junit4]   2> 	perThreadHardLimitMB=1945
   [junit4]   2> 	useCompoundFile=false
   [junit4]   2> 	checkIntegrityAtMerge=false
   [junit4]   2> 	commitOnClose=true
   [junit4]   2> 	writer=org.apache.lucene.util.SetOnce@1c496f6
   [junit4]   2> 	
   [junit4]   2> 99408 T177 oasu.LoggingInfoStream.message [IW][coreLoadExecutor-101-thread-1]: flush at getReader
   [junit4]   2> 99409 T177 oasu.LoggingInfoStream.message [DW][coreLoadExecutor-101-thread-1]: startFullFlush
   [junit4]   2> 99409 T177 oasu.LoggingInfoStream.message [DW][coreLoadExecutor-101-thread-1]: anyChanges? numDocsInRam=0 deletes=false hasTickets:false pendingChangesInFullFlush: false
   [junit4]   2> 99409 T177 oasu.LoggingInfoStream.message [IW][coreLoadExecutor-101-thread-1]: apply all deletes during flush
   [junit4]   2> 99409 T177 oasu.LoggingInfoStream.message [BD][coreLoadExecutor-101-thread-1]: prune sis=segments_1:  minGen=9223372036854775807 packetCount=0
   [junit4]   2> 99409 T177 oasu.LoggingInfoStream.message [IW][coreLoadExecutor-101-thread-1]: return reader version=1 reader=StandardDirectoryReader(segments_1:1:nrt)
   [junit4]   2> 99410 T177 oasu.LoggingInfoStream.message [DW][coreLoadExecutor-101-thread-1]: coreLoadExecutor-101-thread-1 finishFullFlush success=true
   [junit4]   2> 99410 T177 oasu.LoggingInfoStream.message [IW][coreLoadExecutor-101-thread-1]: getReader took 2 msec
   [junit4]   2> 99410 T177 oass.SolrIndexSearcher.<init> Opening Searcher@c971a6[collection1] main
   [junit4]   2> 99413 T177 oasr.ManagedResourceStorage.newStorageIO WARN Cannot write to config directory /mnt/ssd/jenkins/workspace/Lucene-Solr-5.x-Linux/solr/example/solr/collection1/conf; switching to use InMemory storage instead.
   [junit4]   2> 99414 T177 oasr.RestManager.init Initializing RestManager with initArgs: {}
   [junit4]   2> 99414 T177 oasr.ManagedResourceStorage.load Reading _rest_managed.json using InMemoryStorage
   [junit4]   2> 99415 T177 oasr.ManagedResource.reloadFromStorage WARN No stored data found for /rest/managed
   [junit4]   2> 99415 T177 oasr.ManagedResourceStorage$JsonStorage.store Saved JSON object to path _rest_managed.json using InMemoryStorage
   [junit4]   2> 99415 T177 oasr.RestManager.init Initializing 2 registered ManagedResources
   [junit4]   2> 99415 T177 oasr.ManagedResourceStorage.load Reading _schema_analysis_stopwords_english.json using InMemoryStorage
   [junit4]   2> 99416 T177 oasr.ManagedResource.reloadFromStorage WARN No stored data found for /schema/analysis/stopwords/english
   [junit4]   2> 99416 T177 oasr.ManagedResourceStorage$JsonStorage.store Saved JSON object to path _schema_analysis_stopwords_english.json using InMemoryStorage
   [junit4]   2> 99416 T177 oasrsa.ManagedWordSetResource.onManagedDataLoadedFromStorage Loaded 0 words for /schema/analysis/stopwords/english
   [junit4]   2> 99417 T177 oasr.ManagedResource.notifyObserversDuringInit Notified 1 observers of /schema/analysis/stopwords/english
   [junit4]   2> 99417 T177 oasr.ManagedResourceStorage.load Reading _schema_analysis_synonyms_english.json using InMemoryStorage
   [junit4]   2> 99418 T177 oasr.ManagedResource.reloadFromStorage WARN No stored data found for /schema/analysis/synonyms/english
   [junit4]   2> 99418 T177 oasrsa.ManagedSynonymFilterFactory$SynonymManager.onManagedDataLoadedFromStorage Loaded 0 synonym mappings for /schema/analysis/synonyms/english
   [junit4]   2> 99420 T177 oasr.ManagedResource.notifyObserversDuringInit Notified 1 observers of /schema/analysis/synonyms/english
   [junit4]   2> 99420 T177 oashc.SpellCheckComponent.inform Initializing spell checkers
   [junit4]   2> 99438 T177 oass.DirectSolrSpellChecker.init init: {name=default,field=text,classname=solr.DirectSolrSpellChecker,distanceMeasure=internal,accuracy=0.5,maxEdits=2,minPrefix=1,maxInspections=5,minQueryLength=4,maxQueryFrequency=0.01}
   [junit4]   2> 99466 T177 oashc.SpellCheckComponent.inform No queryConverter defined, using default converter
   [junit4]   2> 99468 T177 oashc.SuggestComponent.inform Initializing SuggestComponent
   [junit4]   2> 99471 T177 oasss.SolrSuggester.init init: {name=mySuggester,lookupImpl=FuzzyLookupFactory,dictionaryImpl=DocumentDictionaryFactory,field=cat,weightField=price,suggestAnalyzerFieldType=string}
   [junit4]   2> 99520 T177 oasss.SolrSuggester.init Dictionary loaded with params: {name=mySuggester,lookupImpl=FuzzyLookupFactory,dictionaryImpl=DocumentDictionaryFactory,field=cat,weightField=price,suggestAnalyzerFieldType=string}
   [junit4]   2> 99525 T177 oashc.QueryElevationComponent.inform Loading QueryElevation from: /mnt/ssd/jenkins/workspace/Lucene-Solr-5.x-Linux/solr/example/solr/collection1/conf/elevate.xml
   [junit4]   2> 99560 T177 oash.ReplicationHandler.inform Commits will be reserved for  10000
   [junit4]   2> 99561 T178 oasc.QuerySenderListener.newSearcher QuerySenderListener sending requests to Searcher@c971a6[collection1] main{ExitableDirectoryReader(UninvertingDirectoryReader())}
   [junit4]   2> 99561 T177 oasc.CoreContainer.registerCore registering core: collection1
   [junit4]   2> 99562 T167 oass.SolrDispatchFilter.init user.dir=/mnt/ssd/jenkins/workspace/Lucene-Solr-5.x-Linux/solr/build/solr-solrj/test/J1
   [junit4]   2> 99562 T167 oass.SolrDispatchFilter.init SolrDispatchFilter.init() done
   [junit4]   2> 99562 T167 oas.SolrJettyTestBase.createJetty Jetty Assigned Port#37861
   [junit4]   2> 99570 T167 oas.SolrTestCaseJ4.setUp ###Starting testLukeHandler
   [junit4]   2> ASYNC  NEW_CORE C128 name=collection1 org.apache.solr.core.SolrCore@490460
   [junit4]   2> 99606 T173 C128 oasu.LoggingInfoStream.message [DW][qtp18605185-173]: anyChanges? numDocsInRam=0 deletes=true hasTickets:false pendingChangesInFullFlush: false
   [junit4]   2> 99606 T173 C128 oasu.LoggingInfoStream.message [IW][qtp18605185-173]: nrtIsCurrent: infoVersion matches: true; DW changes: true; BD changes: false
   [junit4]   2> 99607 T173 C128 oasu.LoggingInfoStream.message [DW][qtp18605185-173]: anyChanges? numDocsInRam=0 deletes=true hasTickets:false pendingChangesInFullFlush: false
   [junit4]   2> 99607 T173 C128 oasu.LoggingInfoStream.message [IW][qtp18605185-173]: flush at getReader
   [junit4]   2> 99607 T173 C128 oasu.LoggingInfoStream.message [DW][qtp18605185-173]: startFullFlush
   [junit4]   2> 99608 T173 C128 oasu.LoggingInfoStream.message [DW][qtp18605185-173]: anyChanges? numDocsInRam=0 deletes=true hasTickets:false pendingChangesInFullFlush: false
   [junit4]   2> 99608 T173 C128 oasu.LoggingInfoStream.message [DW][qtp18605185-173]: qtp18605185-173: flush naked frozen global deletes
   [junit4]   2> 99610 T173 C128 oasu.LoggingInfoStream.message [BD][qtp18605185-173]: push deletes  1 deleted queries bytesUsed=64 delGen=2 packetCount=1 totBytesUsed=64
   [junit4]   2> 99611 T173 C128 oasu.LoggingInfoStream.message [DW][qtp18605185-173]: flush: push buffered updates:  1 deleted queries bytesUsed=64
   [junit4]   2> 99611 T173 C128 oasu.LoggingInfoStream.message [IW][qtp18605185-173]: apply all deletes during flush
   [junit4]   2> 99612 T173 C128 oasu.LoggingInfoStream.message [BD][qtp18605185-173]: prune sis=segments_1:  minGen=9223372036854775807 packetCount=1
   [junit4]   2> 99612 T173 C128 oasu.LoggingInfoStream.message [BD][qtp18605185-173]: pruneDeletes: prune 1 packets; 0 packets remain
   [junit4]   2> 99612 T173 C128 oasu.LoggingInfoStream.message [IW][qtp18605185-173]: return reader version=1 reader=StandardDirectoryReader(segments_1:1:nrt)
   [junit4]   2> 99613 T173 C128 oasu.LoggingInfoStream.message [DW][qtp18605185-173]: qtp18605185-173 finishFullFlush success=true
   [junit4]   2> 99613 T173 C128 oasu.LoggingInfoStream.message [IW][qtp18605185-173]: getReader took 6 msec
   [junit4]   2> 99615 T173 C128 oasup.LogUpdateProcessor.finish [collection1] webapp=/solr path=/update params={wt=javabin&version=2} {deleteByQuery=*:* (-1481077667612590080)} 0 36
   [junit4]   2> 99623 T174 C128 oasup.LogUpdateProcessor.finish [collection1] webapp=/solr path=/update params={wt=javabin&version=2} {add=[ID0 (1481077667655581696)]} 0 4
   [junit4]   2> 99627 T175 C128 oasup.LogUpdateProcessor.finish [collection1] webapp=/solr path=/update params={wt=javabin&version=2} {add=[ID1 (1481077667660824576)]} 0 1
   [junit4]   2> 99630 T176 C128 oasup.LogUpdateProcessor.finish [collection1] webapp=/solr path=/update params={wt=javabin&version=2} {add=[ID2 (1481077667665018880)]} 0 1
   [junit4]   2> 99634 T173 C128 oasup.LogUpdateProcessor.finish [collection1] webapp=/solr path=/update params={wt=javabin&version=2} {add=[ID3 (1481077667668164608)]} 0 1
   [junit4]   2> 99637 T174 C128 oasup.LogUpdateProcessor.finish [collection1] webapp=/solr path=/update params={wt=javabin&version=2} {add=[ID4 (1481077667672358912)]} 0 0
   [junit4]   2> 99637 T178 C128 oasc.SolrCore.execute [collection1] webapp=null path=null params={q=static+firstSearcher+warming+in+solrconfig.xml&distrib=false&event=firstSearcher} hits=0 status=0 QTime=74 
   [junit4]   2> 99638 T178 oasc.QuerySenderListener.newSearcher QuerySenderListener done.
   [junit4]   2> 99638 T178 oashc.SpellCheckComponent$SpellCheckerListener.newSearcher Loading spell index for spellchecker: default
   [junit4]   2> 99638 T178 oashc.SpellCheckComponent$SpellCheckerListener.newSearcher Loading spell index for spellchecker: wordbreak
   [junit4]   2> 99639 T178 oashc.SuggestComponent$SuggesterListener.newSearcher Loading suggester index for: mySuggester
   [junit4]   2> 99639 T178 oasss.SolrSuggester.reload reload()
   [junit4]   2> 99639 T178 oasss.SolrSuggester.build build()
   [junit4]   2> 99640 T175 C128 oasu.DirectUpdateHandler2.commit start commit{,optimize=false,openSearcher=true,waitSearcher=true,expungeDeletes=false,softCommit=false,prepareCommit=false}
   [junit4]   2> 99641 T175 C128 oasu.LoggingInfoStream.message [IW][qtp18605185-175]: commit: start
   [junit4]   2> 99641 T175 C128 oasu.LoggingInfoStream.message [IW][qtp18605185-175]: commit: enter lock
   [junit4]   2> 99641 T175 C128 oasu.LoggingInfoStream.message [IW][qtp18605185-175]: commit: now prepare
   [junit4]   2> 99642 T175 C128 oasu.LoggingInfoStream.message [IW][qtp18605185-175]: prepareCommit: flush
   [junit4]   2> 99642 T175 C128 oasu.LoggingInfoStream.message [IW][qtp18605185-175]:   index before flush 
   [junit4]   2> 99642 T175 C128 oasu.LoggingInfoStream.message [DW][qtp18605185-175]: startFullFlush
   [junit4]   2> 99643 T175 C128 oasu.LoggingInfoStream.message [DW][qtp18605185-175]: anyChanges? numDocsInRam=5 deletes=true hasTickets:false pendingChangesInFullFlush: false
   [junit4]   2> 99643 T175 C128 oasu.LoggingInfoStream.message [DWFC][qtp18605185-175]: addFlushableState DocumentsWriterPerThread [pendingDeletes=gen=0 4 deleted terms (unique count=4) bytesUsed=556, segment=_0, aborting=false, numDocsInRAM=5, deleteQueue=DWDQ: [ generation: 2 ]]
   [junit4]   2> 99644 T175 C128 oasu.LoggingInfoStream.message [DWPT][qtp18605185-175]: flush postings as segment _0 numDocs=5
   [junit4]   2> 99667 T175 C128 oasu.LoggingInfoStream.message [DWPT][qtp18605185-175]: new segment has 0 deleted docs
   [junit4]   2> 99668 T175 C128 oasu.LoggingInfoStream.message [DWPT][qtp18605185-175]: new segment has no vectors; no norms; no docValues; no prox; no freqs
   [junit4]   2> 99668 T175 C128 oasu.LoggingInfoStream.message [DWPT][qtp18605185-175]: flushedFiles=[_0_Lucene41_0.tip, _0_Lucene41_0.doc, _0_Lucene41_0.tim, _0.fdx, _0.fdt, _0.fnm]
   [junit4]   2> 99668 T175 C128 oasu.LoggingInfoStream.message [DWPT][qtp18605185-175]: flushed codec=Lucene50
   [junit4]   2> 99669 T175 C128 oasu.LoggingInfoStream.message [DWPT][qtp18605185-175]: flushed: segment=_0 ramUsed=0.063 MB newFlushedSize(includes docstores)=0.001 MB docs/MB=6,040.184
   [junit4]   2> 99669 T175 C128 oasu.LoggingInfoStream.message [DW][qtp18605185-175]: publishFlushedSegment seg-private updates=null
   [junit4]   2> 99670 T175 C128 oasu.LoggingInfoStream.message [IW][qtp18605185-175]: publishFlushedSegment
   [junit4]   2> 99670 T175 C128 oasu.LoggingInfoStream.message [BD][qtp18605185-175]: push deletes  5 deleted terms (unique count=5) bytesUsed=1056 delGen=4 packetCount=1 totBytesUsed=1056
   [junit4]   2> 99670 T175 C128 oasu.LoggingInfoStream.message [IW][qtp18605185-175]: publish sets newSegment delGen=5 seg=_0(5.0.0):C5
   [junit4]   2> 99671 T175 C128 oasu.LoggingInfoStream.message [IFD][qtp18605185-175]: now checkpoint "_0(5.0.0):C5" [1 segments ; isCommit = false]
   [junit4]   2> 99671 T175 C128 oasu.LoggingInfoStream.message [IFD][qtp18605185-175]: 0 msec to checkpoint
   [junit4]   2> 99672 T175 C128 oasu.LoggingInfoStream.message [IW][qtp18605185-175]: apply all deletes during flush
   [junit4]   2> 99672 T175 C128 oasu.LoggingInfoStream.message [BD][qtp18605185-175]: applyDeletes: infos=[_0(5.0.0):C5] packetCount=1
   [junit4]   2> 99672 T175 C128 oasu.LoggingInfoStream.message [BD][qtp18605185-175]: applyDeletes took 0 msec
   [junit4]   2> 99673 T175 C128 oasu.LoggingInfoStream.message [BD][qtp18605185-175]: prune sis=segments_1: _0(5.0.0):C5 minGen=6 packetCount=1
   [junit4]   2> 99673 T175 C128 oasu.LoggingInfoStream.message [BD][qtp18605185-175]: pruneDeletes: prune 1 packets; 0 packets remain
   [junit4]   2> 99673 T175 C128 oasu.LoggingInfoStream.message [DW][qtp18605185-175]: qtp18605185-175 finishFullFlush success=true
   [junit4]   2> 99674 T178 oasc.SolrCore.registerSearcher [collection1] Registered new searcher Searcher@c971a6[collection1] main{ExitableDirectoryReader(UninvertingDirectoryReader())}
   [junit4]   2> 99674 T175 C128 oasu.LoggingInfoStream.message [TMP][qtp18605185-175]: findMerges: 1 segments
   [junit4]   2> 99675 T175 C128 oasu.LoggingInfoStream.message [TMP][qtp18605185-175]:   seg=_0(5.0.0):C5 size=0.001 MB [floored]
   [junit4]   2> 99675 T175 C128 oasu.LoggingInfoStream.message [TMP][qtp18605185-175]:   allowedSegmentCount=1 vs count=1 (eligible count=1) tooBigCount=0
   [junit4]   2> 99675 T175 C128 oasu.LoggingInfoStream.message [CMS][qtp18605185-175]: now merge
   [junit4]   2> 99676 T175 C128 oasu.LoggingInfoStream.message [CMS][qtp18605185-175]:   index: _0(5.0.0):C5
   [junit4]   2> 99676 T175 C128 oasu.LoggingInfoStream.message [CMS][qtp18605185-175]:   no more merges pending; now return
   [junit4]   2> 99676 T175 C128 oasu.LoggingInfoStream.message [IW][qtp18605185-175]: startCommit(): start
   [junit4]   2> 99677 T175 C128 oasu.LoggingInfoStream.message [IW][qtp18605185-175]: startCommit index=_0(5.0.0):C5 changeCount=3
   [junit4]   2> 99678 T175 C128 oasu.LoggingInfoStream.message [IW][qtp18605185-175]: done all syncs: [_0_Lucene41_0.tip, _0_Lucene41_0.doc, _0.si, _0_Lucene41_0.tim, _0.fdx, _0.fdt, _0.fnm]
   [junit4]   2> 99678 T175 C128 oasu.LoggingInfoStream.message [IW][qtp18605185-175]: commit: pendingCommit != null
   [junit4]   2> 99678 T175 C128 oasu.LoggingInfoStream.message [IFD][qtp18605185-175]: now checkpoint "_0(5.0.0):C5" [1 segments ; isCommit = true]
   [junit4]   2> 99679 T175 C128 oasc.SolrDeletionPolicy.onCommit SolrDeletionPolicy.onCommit: commits: num=2
   [junit4]   2> 		commit{dir=MockDirectoryWrapper(RAMDirectory(id=lucene-15b91c6)),segFN=segments_1,generation=1}
   [junit4]   2> 		commit{dir=MockDirectoryWrapper(RAMDirectory(id=lucene-15b91c6)),segFN=segments_2,generation=2}
   [junit4]   2> 99679 T175 C128 oasc.SolrDeletionPolicy.updateCommits newest commit generation = 2
   [junit4]   2> 99680 T175 C128 oasu.LoggingInfoStream.message [IFD][qtp18605185-175]: deleteCommits: now decRef commit "segments_1"
   [junit4]   2> 99680 T175 C128 oasu.LoggingInfoStream.message [IFD][qtp18605185-175]: delete "segments_1"
   [junit4]   2> 99680 T175 C128 oasu.LoggingInfoStream.message [IFD][qtp18605185-175]: 2 msec to checkpoint
   [junit4]   2> 99681 T175 C128 oasu.LoggingInfoStream.message [IW][qtp18605185-175]: commit: wrote segments file "segments_2"
   [junit4]   2> 99681 T175 C128 oasu.LoggingInfoStream.message [IW][qtp18605185-175]: commit: took 39.5 msec
   [junit4]   2> 99681 T175 C128 oasu.LoggingInfoStream.message [IW][qtp18605185-175]: commit: done
   [junit4]   2> 99682 T175 C128 oasu.LoggingInfoStream.message [DW][qtp18605185-175]: anyChanges? numDocsInRam=0 deletes=false hasTickets:false pendingChangesInFullFlush: false
   [junit4]   2> 99682 T175 C128 oasu.LoggingInfoStream.message [IW][qtp18605185-175]: nrtIsCurrent: infoVersion matches: false; DW changes: false; BD changes: false
   [junit4]   2> 99683 T175 C128 oasu.LoggingInfoStream.message [IW][qtp18605185-175]: flush at getReader
   [junit4]   2> 99683 T175 C128 oasu.LoggingInfoStream.message [DW][qtp18605185-175]: startFullFlush
   [junit4]   2> 99683 T175 C128 oasu.LoggingInfoStream.message [DW][qtp18605185-175]: anyChanges? numDocsInRam=0 deletes=false hasTickets:false pendingChangesInFullFlush: false
   [junit4]   2> 99684 T175 C128 oasu.LoggingInfoStream.message [IW][qtp18605185-175]: apply all deletes during flush
   [junit4]   2> 99684 T175 C128 oasu.LoggingInfoStream.message [BD][qtp18605185-175]: applyDeletes: no deletes; skipping
   [junit4]   2> 99684 T175 C128 oasu.LoggingInfoStream.message [BD][qtp18605185-175]: prune sis=segments_1: _0(5.0.0):C5 minGen=6 packetCount=0
   [junit4]   2> 99694 T175 C128 oasu.LoggingInfoStream.message [IW][qtp18605185-175]: return reader version=3 reader=StandardDirectoryReader(segments_1:3:nrt _0(5.0.0):C5)
   [junit4]   2> 99694 T175 C128 oasu.LoggingInfoStream.message [DW][qtp18605185-175]: qtp18605185-175 finishFullFlush success=true
   [junit4]   2> 99694 T175 C128 oasu.LoggingInfoStream.message [IW][qtp18605185-175]: getReader took 11 msec
   [junit4]   2> 99695 T175 C128 oass.SolrIndexSearcher.<init> Opening Searcher@94576a[collection1] main
   [junit4]   2> 99697 T178 oasc.QuerySenderListener.newSearcher QuerySenderListener sending requests to Searcher@94576a[collection1] main{ExitableDirectoryReader(UninvertingDirectoryReader(Uninverting(_0(5.0.0):C5)))}
   [junit4]   2> 99697 T178 oasc.QuerySenderListener.newSearcher QuerySenderListener done.
   [junit4]   2> 99697 T175 C128 oasu.DirectUpdateHandler2.commit end_commit_flush
   [junit4]   2> 99697 T178 oasc.SolrCore.registerSearcher [collection1] Registered new searcher Searcher@94576a[collection1] main{ExitableDirectoryReader(UninvertingDirectoryReader(Uninverting(_0(5.0.0):C5)))}
   [junit4]   2> 99698 T175 C128 oasup.LogUpdateProcessor.finish [collection1] webapp=/solr path=/update params={waitSearcher=true&commit=true&softCommit=false&wt=javabin&version=2} {commit=} 0 58
   [junit4]   2> 99701 T176 C128 oasc.SolrCore.execute [collection1] webapp=/solr path=/select params={q=*:*&wt=javabin&version=2} hits=5 status=0 QTime=0 
   [junit4]   2> 99708 T173 C128 oasu.LoggingInfoStream.message [DW][qtp18605185-173]: anyChanges? numDocsInRam=0 deletes=false hasTickets:false pendingChangesInFullFlush: false
   [junit4]   2> 99709 T173 C128 oasu.LoggingInfoStream.message [IW][qtp18605185-173]: nrtIsCurrent: infoVersion matches: true; DW changes: false; BD changes: false
   [junit4]   2> 99709 T173 C128 oasu.LoggingInfoStream.message [DW][qtp18605185-173]: anyChanges? numDocsInRam=0 deletes=false hasTickets:false pendingChangesInFullFlush: false
   [junit4]   2> 99722 T173 C128 oasc.SolrCore.execute [collection1] webapp=/solr path=/admin/luke params={wt=javabin&version=2} status=0 QTime=15 
   [junit4]   2> 99728 T175 C128 oasu.LoggingInfoStream.message [DW][qtp18605185-175]: anyChanges? numDocsInRam=0 deletes=false hasTickets:false pendingChangesInFullFlush: false
   [junit4]   2> 99728 T175 C128 oasu.LoggingInfoStream.message [IW][qtp18605185-175]: nrtIsCurrent: infoVersion matches: true; DW changes: false; BD changes: false
   [junit4]   2> 99729 T175 C128 oasu.LoggingInfoStream.message [DW][qtp18605185-175]: anyChanges? numDocsInRam=0 deletes=false hasTickets:false pendingChangesInFullFlush: false
   [junit4]   2> 99732 T175 C128 oasc.SolrCore.execute [collection1] webapp=/solr path=/admin/luke params={show=schema&wt=javabin&version=2} status=0 QTime=4 
   [junit4]   2> 99754 T167 oas.SolrTestCaseJ4.tearDown ###Ending testLukeHandler
   [junit4]   2> 99766 T167 oas.SolrTestCaseJ4.setUp ###Starting testPivotFacets
   [junit4]   2> 99770 T173 C128 oasu.LoggingInfoStream.message [DW][qtp18605185-173]: anyChanges? numDocsInRam=0 deletes=true hasTickets:false pendingChangesInFullFlush: false
   [junit4]   2> 99771 T173 C128 oasu.LoggingInfoStream.message [IW][qtp18605185-173]: nrtIsCurrent: infoVersion matches: true; DW changes: true; BD changes: false
   [junit4]   2> 99771 T173 C128 oasu.LoggingInfoStream.message [DW][qtp18605185-173]: anyChanges? numDocsInRam=0 deletes=true hasTickets:false pendingChangesInFullFlush: false
   [junit4]   2> 99771 T173 C128 oasu.LoggingInfoStream.message [IW][qtp18605185-173]: flush at getReader
   [junit4]   2> 99772 T173 C128 oasu.LoggingInfoStream.message [DW][qtp18605185-173]: startFullFlush
   [junit4]   2> 99772 T173 C128 oasu.LoggingInfoStream.message [DW][qtp18605185-173]: anyChanges? numDocsInRam=0 deletes=true hasTickets:false pendingChangesInFullFlush: false
   [junit4]   2> 99772 T173 C128 oasu.LoggingInfoStream.message [DW][qtp18605185-173]: qtp18605185-173: flush naked frozen global deletes
   [junit4]   2> 99773 T173 C128 oasu.LoggingInfoStream.message [BD][qtp18605185-173]: push deletes  1 deleted queries bytesUsed=64 delGen=8 packetCount=1 totBytesUsed=64
   [junit4]   2> 99773 T173 C128 oasu.LoggingInfoStream.message [DW][qtp18605185-173]: flush: push buffered updates:  1 deleted queries bytesUsed=64
   [junit4]   2> 99773 T173 C128 oasu.LoggingInfoStream.message [IW][qtp18605185-173]: apply all deletes during flush
   [junit4]   2> 99773 T173 C128 oasu.LoggingInfoStream.message [BD][qtp18605185-173]: applyDeletes: infos=[_0(5.0.0):C5] packetCount=1
   [junit4]   2> 99831 T173 C128 oasu.LoggingInfoStream.message [BD][qtp18605185-173]: seg=_0(5.0.0):C5 segGen=6 coalesced deletes=[CoalescedUpdates(termSets=1,queries=1,numericDVUpdates=0,binaryDVUpdates=0)] newDelCount=5 100% deleted
   [junit4]   2> 99832 T173 C128 oasu.LoggingInfoStream.message [BD][qtp18605185-173]: applyDeletes took 59 msec
   [junit4]   2> 99832 T173 C128 oasu.LoggingInfoStream.message [IFD][qtp18605185-173]: now checkpoint "_0(5.0.0):C5/5" [1 segments ; isCommit = false]
   [junit4]   2> 99832 T173 C128 oasu.LoggingInfoStream.message [IFD][qtp18605185-173]: 0 msec to checkpoint
   [junit4]   2> 99833 T173 C128 oasu.LoggingInfoStream.message [IW][qtp18605185-173]: drop 100% deleted segments: _0(5.0.0):C5/5
   [junit4]   2> 99833 T173 C128 oasu.LoggingInfoStream.message [IFD][qtp18605185-173]: now checkpoint "" [0 segments ; isCommit = false]
   [junit4]   2> 99833 T173 C128 oasu.LoggingInfoStream.message [IFD][qtp18605185-173]: 0 msec to checkpoint
   [junit4]   2> 99834 T173 C128 oasu.LoggingInfoStream.message [BD][qtp18605185-173]: prune sis=segments_1:  minGen=9223372036854775807 packetCount=1
   [junit4]   2> 99834 T173 C128 oasu.LoggingInfoStream.message [BD][qtp18605185-173]: pruneDeletes: prune 1 packets; 0 packets remain
   [junit4]   2> 99834 T173 C128 oasu.LoggingInfoStream.message [IW][qtp18605185-173]: return reader version=5 reader=StandardDirectoryReader(segments_1:5:nrt)
   [junit4]   2> 99835 T173 C128 oasu.LoggingInfoStream.message [DW][qtp18605185-173]: qtp18605185-173 finishFullFlush success=true
   [junit4]   2> 99835 T173 C128 oasu.LoggingInfoStream.message [IW][qtp18605185-173]: getReader took 64 msec
   [junit4]   2> 99836 T173 C128 oass.SolrIndexSearcher.<init> Opening Searcher@27df5b[collection1] realtime
   [junit4]   2> 99836 T173 C128 oasup.LogUpdateProcessor.finish [collection1] webapp=/solr path=/update params={wt=javabin&version=2} {deleteByQuery=*:* (-1481077667810770944)} 0 67
   [junit4]   2> 99839 T174 C128 oasu.DirectUpdateHandler2.commit start commit{,optimize=false,openSearcher=true,waitSearcher=true,expungeDeletes=false,softCommit=false,prepareCommit=false}
   [junit4]   2> 99839 T174 C128 oasu.LoggingInfoStream.message [IW][qtp18605185-174]: commit: start
   [junit4]   2> 99840 T174 C128 oasu.LoggingInfoStream.message [IW][qtp18605185-174]: commit: enter lock
   [junit4]   2> 99840 T174 C128 oasu.LoggingInfoStream.message [IW][qtp18605185-174]: commit: now prepare
   [junit4]   2> 99840 T174 C128 oasu.LoggingInfoStream.message [IW][qtp18605185-174]: prepareCommit: flush
   [junit4]   2> 99841 T174 C128 oasu.LoggingInfoStream.message [IW][qtp18605185-174]:   index before flush 
   [junit4]   2> 99841 T174 C128 oasu.LoggingInfoStream.message [DW][qtp18605185-174]: startFullFlush
   [junit4]   2> 99841 T174 C128 oasu.LoggingInfoStream.message [DW][qtp18605185-174]: anyChanges? numDocsInRam=0 deletes=false hasTickets:false pendingChangesInFullFlush: false
   [junit4]   2> 99842 T174 C128 oasu.LoggingInfoStream.message [IW][qtp18605185-174]: apply all deletes during flush
   [junit4]   2> 99842 T174 C128 oasu.LoggingInfoStream.message [BD][qtp18605185-174]: prune sis=segments_1:  minGen=9223372036854775807 packetCount=0
   [junit4]   2> 99842 T174 C128 oasu.LoggingInfoStream.message [DW][qtp18605185-174]: qtp18605185-174 finishFullFlush success=true
   [junit4]   2> 99842 T174 C128 oasu.LoggingInfoStream.message [IW][qtp18605185-174]: startCommit(): start
   [junit4]   2> 99843 T174 C128 oasu.LoggingInfoStream.message [IW][qtp18605185-174]: startCommit index= changeCount=6
   [junit4]   2> 99843 T174 C128 oasu.LoggingInfoStream.message [IW][qtp18605185-174]: done all syncs: []
   [junit4]   2> 99844 T174 C128 oasu.LoggingInfoStream.message [IW][qtp18605185-174]: commit: pendingCommit != null
   [junit4]   2> 99844 T174 C128 oasu.LoggingInfoStream.message [IFD][qtp18605185-174]: now checkpoint "" [0 segments ; isCommit = true]
   [junit4]   2> 99844 T174 C128 oasc.SolrDeletionPolicy.onCommit SolrDeletionPolicy.onCommit: commits: num=2
   [junit4]   2> 		commit{dir=MockDirectoryWrapper(RAMDirectory(id=lucene-15b91c6)),segFN=segments_2,generation=2}
   [junit4]   2> 		commit{dir=MockDirectoryWrapper(RAMDirectory(id=lucene-15b91c6)),segFN=segments_3,generation=3}
   [junit4]   2> 99845 T174 C128 oasc.SolrDeletionPolicy.updateCommits newest commit generation = 3
   [junit4]   2> 99845 T174 C128 oasu.LoggingInfoStream.message [IFD][qtp18605185-174]: deleteCommits: now decRef commit "segments_2"
   [junit4]   2> 99845 T174 C128 oasu.LoggingInfoStream.message [IFD][qtp18605185-174]: delete "segments_2"
   [junit4]   2> 99846 T174 C128 oasu.LoggingInfoStream.message [IFD][qtp18605185-174]: 1 msec to checkpoint
   [junit4]   2> 99846 T174 C128 oasu.LoggingInfoStream.message [IW][qtp18605185-174]: commit: wrote segments file "segments_3"
   [junit4]   2> 99846 T174 C128 oasu.LoggingInfoStream.message [IW][qtp18605185-174]: commit: took 6.1 msec
   [junit4]   2> 99847 T174 C128 oasu.LoggingInfoStream.message [IW][qtp18605185-174]: commit: done
   [junit4]   2> 99847 T174 C128 oasu.LoggingInfoStream.message [DW][qtp18605185-174]: anyChanges? numDocsInRam=0 deletes=false hasTickets:false pendingChangesInFullFlush: false
   [junit4]   2> 99848 T174 C128 oasu.LoggingInfoStream.message [IW][qtp18605185-174]: nrtIsCurrent: infoVersion matches: true; DW changes: false; BD changes: false
   [junit4]   2> 99848 T174 C128 oasu.LoggingInfoStream.message [DW][qtp18605185-174]: anyChanges? numDocsInRam=0 deletes=false hasTickets:false pendingChangesInFullFlush: false
   [junit4]   2> 99848 T174 C128 oass.SolrIndexSearcher.<init> Opening Searcher@1ce40ab[collection1] main
   [junit4]   2> 99849 T178 oasc.QuerySenderListener.newSearcher QuerySenderListener sending requests to Searcher@1ce40ab[collection1] main{ExitableDirectoryReader(UninvertingDirectoryReader())}
   [junit4]   2> 99849 T174 C128 oasu.DirectUpdateHandler2.commit end_commit_flush
   [junit4]   2> 99849 T178 oasc.QuerySenderListener.newSearcher QuerySenderListener done.
   [junit4]   2> 99850 T178 oasc.SolrCore.registerSearcher [collection1] Registered new searcher Searcher@1ce40ab[collection1] main{ExitableDirectoryReader(UninvertingDirectoryReader())}
   [junit4]   2> 99851 T178 oasu.LoggingInfoStream.message [IFD][searcherExecutor-102-thread-1]: delete "_0_Lucene41_0.tip"
   [junit4]   2> 99851 T178 oasu.LoggingInfoStream.message [IFD][searcherExecutor-102

[...truncated too long message...]

ssage [BD][SUITE-SolrExampleStreamingBinaryTest-seed#[1B12087177D4DD82]-worker]: applyDeletes: no deletes; skipping
   [junit4]   2> 254321 T131 C24 oasu.LoggingInfoStream.message [BD][SUITE-SolrExampleStreamingBinaryTest-seed#[1B12087177D4DD82]-worker]: prune sis=segments_1: _23(5.0.0):C2 _24(5.0.0):C2 _22(5.0.0):C1 _21(5.0.0):C5 _27(5.0.0):C1 _29(5.0.0):C1 _2b(5.0.0):C1 minGen=366 packetCount=0
   [junit4]   2> 254321 T131 C24 oasu.LoggingInfoStream.message [CMS][SUITE-SolrExampleStreamingBinaryTest-seed#[1B12087177D4DD82]-worker]: now merge
   [junit4]   2> 254321 T131 C24 oasu.LoggingInfoStream.message [CMS][SUITE-SolrExampleStreamingBinaryTest-seed#[1B12087177D4DD82]-worker]:   index: _23(5.0.0):C2 _24(5.0.0):C2 _22(5.0.0):C1 _21(5.0.0):C5 _27(5.0.0):C1 _29(5.0.0):C1 _2b(5.0.0):C1
   [junit4]   2> 254322 T131 C24 oasu.LoggingInfoStream.message [CMS][SUITE-SolrExampleStreamingBinaryTest-seed#[1B12087177D4DD82]-worker]:   no more merges pending; now return
   [junit4]   2> 254322 T131 C24 oasu.LoggingInfoStream.message [IW][SUITE-SolrExampleStreamingBinaryTest-seed#[1B12087177D4DD82]-worker]: waitForMerges
   [junit4]   2> 254322 T131 C24 oasu.LoggingInfoStream.message [IW][SUITE-SolrExampleStreamingBinaryTest-seed#[1B12087177D4DD82]-worker]: waitForMerges done
   [junit4]   2> 254323 T131 C24 oasu.LoggingInfoStream.message [IW][SUITE-SolrExampleStreamingBinaryTest-seed#[1B12087177D4DD82]-worker]: commit: start
   [junit4]   2> 254323 T131 C24 oasu.LoggingInfoStream.message [IW][SUITE-SolrExampleStreamingBinaryTest-seed#[1B12087177D4DD82]-worker]: commit: enter lock
   [junit4]   2> 254324 T131 C24 oasu.LoggingInfoStream.message [IW][SUITE-SolrExampleStreamingBinaryTest-seed#[1B12087177D4DD82]-worker]: commit: now prepare
   [junit4]   2> 254324 T131 C24 oasu.LoggingInfoStream.message [IW][SUITE-SolrExampleStreamingBinaryTest-seed#[1B12087177D4DD82]-worker]: prepareCommit: flush
   [junit4]   2> 254324 T131 C24 oasu.LoggingInfoStream.message [IW][SUITE-SolrExampleStreamingBinaryTest-seed#[1B12087177D4DD82]-worker]:   index before flush _23(5.0.0):C2 _24(5.0.0):C2 _22(5.0.0):C1 _21(5.0.0):C5 _27(5.0.0):C1 _29(5.0.0):C1 _2b(5.0.0):C1
   [junit4]   2> 254325 T131 C24 oasu.LoggingInfoStream.message [DW][SUITE-SolrExampleStreamingBinaryTest-seed#[1B12087177D4DD82]-worker]: startFullFlush
   [junit4]   2> 254325 T131 C24 oasu.LoggingInfoStream.message [DW][SUITE-SolrExampleStreamingBinaryTest-seed#[1B12087177D4DD82]-worker]: anyChanges? numDocsInRam=0 deletes=false hasTickets:false pendingChangesInFullFlush: false
   [junit4]   2> 254325 T131 C24 oasu.LoggingInfoStream.message [IW][SUITE-SolrExampleStreamingBinaryTest-seed#[1B12087177D4DD82]-worker]: apply all deletes during flush
   [junit4]   2> 254326 T131 C24 oasu.LoggingInfoStream.message [BD][SUITE-SolrExampleStreamingBinaryTest-seed#[1B12087177D4DD82]-worker]: applyDeletes: no deletes; skipping
   [junit4]   2> 254326 T131 C24 oasu.LoggingInfoStream.message [BD][SUITE-SolrExampleStreamingBinaryTest-seed#[1B12087177D4DD82]-worker]: prune sis=segments_1: _23(5.0.0):C2 _24(5.0.0):C2 _22(5.0.0):C1 _21(5.0.0):C5 _27(5.0.0):C1 _29(5.0.0):C1 _2b(5.0.0):C1 minGen=366 packetCount=0
   [junit4]   2> 254326 T131 C24 oasu.LoggingInfoStream.message [DW][SUITE-SolrExampleStreamingBinaryTest-seed#[1B12087177D4DD82]-worker]: SUITE-SolrExampleStreamingBinaryTest-seed#[1B12087177D4DD82]-worker finishFullFlush success=true
   [junit4]   2> 254327 T131 C24 oasu.LoggingInfoStream.message [IW][SUITE-SolrExampleStreamingBinaryTest-seed#[1B12087177D4DD82]-worker]: startCommit(): start
   [junit4]   2> 254327 T131 C24 oasu.LoggingInfoStream.message [IW][SUITE-SolrExampleStreamingBinaryTest-seed#[1B12087177D4DD82]-worker]:   skip startCommit(): no changes pending
   [junit4]   2> 254327 T131 C24 oasu.LoggingInfoStream.message [IW][SUITE-SolrExampleStreamingBinaryTest-seed#[1B12087177D4DD82]-worker]: commit: pendingCommit == null; skip
   [junit4]   2> 254327 T131 C24 oasu.LoggingInfoStream.message [IW][SUITE-SolrExampleStreamingBinaryTest-seed#[1B12087177D4DD82]-worker]: commit: wrote segments file "null"
   [junit4]   2> 254328 T131 C24 oasu.LoggingInfoStream.message [IW][SUITE-SolrExampleStreamingBinaryTest-seed#[1B12087177D4DD82]-worker]: commit: took 3.4 msec
   [junit4]   2> 254328 T131 C24 oasu.LoggingInfoStream.message [IW][SUITE-SolrExampleStreamingBinaryTest-seed#[1B12087177D4DD82]-worker]: commit: done
   [junit4]   2> 254328 T131 C24 oasu.LoggingInfoStream.message [IW][SUITE-SolrExampleStreamingBinaryTest-seed#[1B12087177D4DD82]-worker]: rollback
   [junit4]   2> 254328 T131 C24 oasu.LoggingInfoStream.message [IW][SUITE-SolrExampleStreamingBinaryTest-seed#[1B12087177D4DD82]-worker]: all running merges have aborted
   [junit4]   2> 254328 T131 C24 oasu.LoggingInfoStream.message [IW][SUITE-SolrExampleStreamingBinaryTest-seed#[1B12087177D4DD82]-worker]: rollback: done finish merges
   [junit4]   2> 254329 T131 C24 oasu.LoggingInfoStream.message [DW][SUITE-SolrExampleStreamingBinaryTest-seed#[1B12087177D4DD82]-worker]: abort
   [junit4]   2> 254329 T131 C24 oasu.LoggingInfoStream.message [DW][SUITE-SolrExampleStreamingBinaryTest-seed#[1B12087177D4DD82]-worker]: done abort; abortedFiles=[] success=true
   [junit4]   2> 254329 T131 C24 oasu.LoggingInfoStream.message [IW][SUITE-SolrExampleStreamingBinaryTest-seed#[1B12087177D4DD82]-worker]: rollback: infos=_23(5.0.0):C2 _24(5.0.0):C2 _22(5.0.0):C1 _21(5.0.0):C5 _27(5.0.0):C1 _29(5.0.0):C1 _2b(5.0.0):C1
   [junit4]   2> 254329 T131 C24 oasu.LoggingInfoStream.message [IFD][SUITE-SolrExampleStreamingBinaryTest-seed#[1B12087177D4DD82]-worker]: now checkpoint "_23(5.0.0):C2 _24(5.0.0):C2 _22(5.0.0):C1 _21(5.0.0):C5 _27(5.0.0):C1 _29(5.0.0):C1 _2b(5.0.0):C1" [7 segments ; isCommit = false]
   [junit4]   2> 254330 T131 C24 oasu.LoggingInfoStream.message [IFD][SUITE-SolrExampleStreamingBinaryTest-seed#[1B12087177D4DD82]-worker]: 0 msec to checkpoint
   [junit4]   2> 254331 T131 oasc.SolrCore.closeSearcher [collection1] Closing main searcher on request.
   [junit4]   2> 254331 T131 oasc.CachingDirectoryFactory.close Closing MockDirectoryFactory - 2 directories currently being tracked
   [junit4]   2> 254331 T131 oasc.CachingDirectoryFactory.closeCacheValue looking to close /mnt/ssd/jenkins/workspace/Lucene-Solr-5.x-Linux/solr/build/solr-solrj/test/J0/temp/solr.client.solrj.embedded.SolrExampleStreamingBinaryTest-1B12087177D4DD82-001/tempDir-001 [CachedDir<<refCount=0;path=/mnt/ssd/jenkins/workspace/Lucene-Solr-5.x-Linux/solr/build/solr-solrj/test/J0/temp/solr.client.solrj.embedded.SolrExampleStreamingBinaryTest-1B12087177D4DD82-001/tempDir-001;done=false>>]
   [junit4]   2> 254331 T131 oasc.CachingDirectoryFactory.close Closing directory: /mnt/ssd/jenkins/workspace/Lucene-Solr-5.x-Linux/solr/build/solr-solrj/test/J0/temp/solr.client.solrj.embedded.SolrExampleStreamingBinaryTest-1B12087177D4DD82-001/tempDir-001
   [junit4]   2> 254332 T131 oasc.CachingDirectoryFactory.closeCacheValue looking to close /mnt/ssd/jenkins/workspace/Lucene-Solr-5.x-Linux/solr/build/solr-solrj/test/J0/temp/solr.client.solrj.embedded.SolrExampleStreamingBinaryTest-1B12087177D4DD82-001/tempDir-001/index [CachedDir<<refCount=0;path=/mnt/ssd/jenkins/workspace/Lucene-Solr-5.x-Linux/solr/build/solr-solrj/test/J0/temp/solr.client.solrj.embedded.SolrExampleStreamingBinaryTest-1B12087177D4DD82-001/tempDir-001/index;done=false>>]
   [junit4]   2> 254332 T131 oasc.CachingDirectoryFactory.close Closing directory: /mnt/ssd/jenkins/workspace/Lucene-Solr-5.x-Linux/solr/build/solr-solrj/test/J0/temp/solr.client.solrj.embedded.SolrExampleStreamingBinaryTest-1B12087177D4DD82-001/tempDir-001/index
   [junit4]   2> 254332 T131 oejsh.ContextHandler.doStop stopped o.e.j.s.ServletContextHandler{/solr,null}
   [junit4]   2> 259302 T131 oas.SolrTestCaseJ4.deleteCore ###deleteCore
   [junit4]   2> NOTE: leaving temporary files on disk at: /mnt/ssd/jenkins/workspace/Lucene-Solr-5.x-Linux/solr/build/solr-solrj/test/J0/temp/solr.client.solrj.embedded.SolrExampleStreamingBinaryTest-1B12087177D4DD82-001
   [junit4]   2> NOTE: test params are: codec=Asserting(Lucene50): {}, docValues:{}, sim=DefaultSimilarity, locale=ga, timezone=Pacific/Pohnpei
   [junit4]   2> NOTE: Linux 3.13.0-36-generic i386/Oracle Corporation 1.9.0-ea (32-bit)/cpus=8,threads=1,free=42682816,total=108003328
   [junit4]   2> NOTE: All tests run in this JVM: [LargeVolumeJettyTest, TestEmbeddedSolrServer, SolrExceptionTest, SolrExampleXMLTest, NoOpResponseParserTest, JettyWebappTest, TestCoreAdmin, SolrExampleStreamingBinaryTest]
   [junit4] Completed on J0 in 25.18s, 29 tests, 1 error <<< FAILURES!

[...truncated 35 lines...]
BUILD FAILED
/mnt/ssd/jenkins/workspace/Lucene-Solr-5.x-Linux/build.xml:524: The following error occurred while executing this line:
/mnt/ssd/jenkins/workspace/Lucene-Solr-5.x-Linux/build.xml:472: The following error occurred while executing this line:
/mnt/ssd/jenkins/workspace/Lucene-Solr-5.x-Linux/build.xml:61: The following error occurred while executing this line:
/mnt/ssd/jenkins/workspace/Lucene-Solr-5.x-Linux/extra-targets.xml:39: The following error occurred while executing this line:
/mnt/ssd/jenkins/workspace/Lucene-Solr-5.x-Linux/solr/build.xml:202: The following error occurred while executing this line:
/mnt/ssd/jenkins/workspace/Lucene-Solr-5.x-Linux/solr/common-build.xml:496: The following error occurred while executing this line:
/mnt/ssd/jenkins/workspace/Lucene-Solr-5.x-Linux/lucene/common-build.xml:1360: The following error occurred while executing this line:
/mnt/ssd/jenkins/workspace/Lucene-Solr-5.x-Linux/lucene/common-build.xml:962: There were test failures: 53 suites, 314 tests, 5 errors

Total time: 103 minutes 56 seconds
Build step 'Invoke Ant' marked build as failure
[description-setter] Description set: Java: 32bit/jdk1.9.0-ea-b28 -server -XX:+UseG1GC
Archiving artifacts
Recording test results
Email was triggered for: Failure - Any
Sending email for trigger: Failure - Any



Mime
View raw message