lucene-dev mailing list archives

Site index · List index
Message view « Date » · « Thread »
Top « Date » · « Thread »
From Policeman Jenkins Server <jenk...@thetaphi.de>
Subject [JENKINS] Lucene-Solr-4.x-Linux (64bit/jdk1.7.0_67) - Build # 11031 - Still Failing!
Date Tue, 02 Sep 2014 21:32:30 GMT
Build: http://jenkins.thetaphi.de/job/Lucene-Solr-4.x-Linux/11031/
Java: 64bit/jdk1.7.0_67 -XX:+UseCompressedOops -XX:+UseSerialGC

6 tests failed.
REGRESSION:  org.apache.solr.client.solrj.SolrExampleBinaryTest.testChildDoctransformer

Error Message:
Expected mime type application/octet-stream but got text/html. <html> <head> <meta http-equiv="Content-Type" content="text/html;charset=ISO-8859-1"/> <title>Error 500 Server Error</title> </head> <body> <h2>HTTP ERROR: 500</h2> <p>Problem accessing /solr/collection1/select. Reason: <pre>    Server Error</pre></p> <hr /><i><small>Powered by Jetty://</small></i>                                                                                                                                                                                                                                                                                                                                                                                                                                                                                                                                                                                                                                                                                                                                                                                                                                                                                                                                                                                                                     </body> </html> 

Stack Trace:
org.apache.solr.client.solrj.impl.HttpSolrServer$RemoteSolrException: Expected mime type application/octet-stream but got text/html. <html>
<head>
<meta http-equiv="Content-Type" content="text/html;charset=ISO-8859-1"/>
<title>Error 500 Server Error</title>
</head>
<body>
<h2>HTTP ERROR: 500</h2>
<p>Problem accessing /solr/collection1/select. Reason:
<pre>    Server Error</pre></p>
<hr /><i><small>Powered by Jetty://</small></i>
                                                
                                                
                                                
                                                
                                                
                                                
                                                
                                                
                                                
                                                
                                                
                                                
                                                
                                                
                                                
                                                
                                                
                                                
                                                
                                                
</body>
</html>

	at __randomizedtesting.SeedInfo.seed([69078053919685D4:1ADD9FC91D8EF2D2]:0)
	at org.apache.solr.client.solrj.impl.HttpSolrServer.executeMethod(HttpSolrServer.java:512)
	at org.apache.solr.client.solrj.impl.HttpSolrServer.request(HttpSolrServer.java:210)
	at org.apache.solr.client.solrj.impl.HttpSolrServer.request(HttpSolrServer.java:206)
	at org.apache.solr.client.solrj.request.QueryRequest.process(QueryRequest.java:91)
	at org.apache.solr.client.solrj.SolrServer.query(SolrServer.java:301)
	at org.apache.solr.client.solrj.SolrExampleTests.testChildDoctransformer(SolrExampleTests.java:1373)
	at sun.reflect.NativeMethodAccessorImpl.invoke0(Native Method)
	at sun.reflect.NativeMethodAccessorImpl.invoke(NativeMethodAccessorImpl.java:57)
	at sun.reflect.DelegatingMethodAccessorImpl.invoke(DelegatingMethodAccessorImpl.java:43)
	at java.lang.reflect.Method.invoke(Method.java:606)
	at com.carrotsearch.randomizedtesting.RandomizedRunner.invoke(RandomizedRunner.java:1618)
	at com.carrotsearch.randomizedtesting.RandomizedRunner$6.evaluate(RandomizedRunner.java:827)
	at com.carrotsearch.randomizedtesting.RandomizedRunner$7.evaluate(RandomizedRunner.java:863)
	at com.carrotsearch.randomizedtesting.RandomizedRunner$8.evaluate(RandomizedRunner.java:877)
	at com.carrotsearch.randomizedtesting.rules.SystemPropertiesRestoreRule$1.evaluate(SystemPropertiesRestoreRule.java:53)
	at org.apache.lucene.util.TestRuleSetupTeardownChained$1.evaluate(TestRuleSetupTeardownChained.java:50)
	at org.apache.lucene.util.TestRuleFieldCacheSanity$1.evaluate(TestRuleFieldCacheSanity.java:51)
	at org.apache.lucene.util.AbstractBeforeAfterRule$1.evaluate(AbstractBeforeAfterRule.java:46)
	at com.carrotsearch.randomizedtesting.rules.SystemPropertiesInvariantRule$1.evaluate(SystemPropertiesInvariantRule.java:55)
	at org.apache.lucene.util.TestRuleThreadAndTestName$1.evaluate(TestRuleThreadAndTestName.java:49)
	at org.apache.lucene.util.TestRuleIgnoreAfterMaxFailures$1.evaluate(TestRuleIgnoreAfterMaxFailures.java:65)
	at org.apache.lucene.util.TestRuleMarkFailure$1.evaluate(TestRuleMarkFailure.java:48)
	at com.carrotsearch.randomizedtesting.rules.StatementAdapter.evaluate(StatementAdapter.java:36)
	at com.carrotsearch.randomizedtesting.ThreadLeakControl$StatementRunner.run(ThreadLeakControl.java:365)
	at com.carrotsearch.randomizedtesting.ThreadLeakControl.forkTimeoutingTask(ThreadLeakControl.java:798)
	at com.carrotsearch.randomizedtesting.ThreadLeakControl$3.evaluate(ThreadLeakControl.java:458)
	at com.carrotsearch.randomizedtesting.RandomizedRunner.runSingleTest(RandomizedRunner.java:836)
	at com.carrotsearch.randomizedtesting.RandomizedRunner$3.evaluate(RandomizedRunner.java:738)
	at com.carrotsearch.randomizedtesting.RandomizedRunner$4.evaluate(RandomizedRunner.java:772)
	at com.carrotsearch.randomizedtesting.RandomizedRunner$5.evaluate(RandomizedRunner.java:783)
	at com.carrotsearch.randomizedtesting.rules.StatementAdapter.evaluate(StatementAdapter.java:36)
	at com.carrotsearch.randomizedtesting.rules.SystemPropertiesRestoreRule$1.evaluate(SystemPropertiesRestoreRule.java:53)
	at org.apache.lucene.util.AbstractBeforeAfterRule$1.evaluate(AbstractBeforeAfterRule.java:46)
	at org.apache.lucene.util.TestRuleStoreClassName$1.evaluate(TestRuleStoreClassName.java:42)
	at com.carrotsearch.randomizedtesting.rules.SystemPropertiesInvariantRule$1.evaluate(SystemPropertiesInvariantRule.java:55)
	at com.carrotsearch.randomizedtesting.rules.NoShadowingOrOverridesOnMethodsRule$1.evaluate(NoShadowingOrOverridesOnMethodsRule.java:39)
	at com.carrotsearch.randomizedtesting.rules.NoShadowingOrOverridesOnMethodsRule$1.evaluate(NoShadowingOrOverridesOnMethodsRule.java:39)
	at com.carrotsearch.randomizedtesting.rules.StatementAdapter.evaluate(StatementAdapter.java:36)
	at com.carrotsearch.randomizedtesting.rules.StatementAdapter.evaluate(StatementAdapter.java:36)
	at com.carrotsearch.randomizedtesting.rules.StatementAdapter.evaluate(StatementAdapter.java:36)
	at org.apache.lucene.util.TestRuleAssertionsRequired$1.evaluate(TestRuleAssertionsRequired.java:43)
	at org.apache.lucene.util.TestRuleMarkFailure$1.evaluate(TestRuleMarkFailure.java:48)
	at org.apache.lucene.util.TestRuleIgnoreAfterMaxFailures$1.evaluate(TestRuleIgnoreAfterMaxFailures.java:65)
	at org.apache.lucene.util.TestRuleIgnoreTestSuites$1.evaluate(TestRuleIgnoreTestSuites.java:55)
	at com.carrotsearch.randomizedtesting.rules.StatementAdapter.evaluate(StatementAdapter.java:36)
	at com.carrotsearch.randomizedtesting.ThreadLeakControl$StatementRunner.run(ThreadLeakControl.java:365)
	at java.lang.Thread.run(Thread.java:745)


REGRESSION:  org.apache.solr.client.solrj.SolrExampleXMLTest.testChildDoctransformer

Error Message:
java.lang.AssertionError

Stack Trace:
org.apache.solr.client.solrj.impl.HttpSolrServer$RemoteSolrException: java.lang.AssertionError
	at __randomizedtesting.SeedInfo.seed([69078053919685D4:1ADD9FC91D8EF2D2]:0)
	at org.apache.solr.client.solrj.impl.HttpSolrServer.executeMethod(HttpSolrServer.java:550)
	at org.apache.solr.client.solrj.impl.HttpSolrServer.request(HttpSolrServer.java:210)
	at org.apache.solr.client.solrj.impl.HttpSolrServer.request(HttpSolrServer.java:206)
	at org.apache.solr.client.solrj.request.QueryRequest.process(QueryRequest.java:91)
	at org.apache.solr.client.solrj.SolrServer.query(SolrServer.java:301)
	at org.apache.solr.client.solrj.SolrExampleTests.testChildDoctransformer(SolrExampleTests.java:1373)
	at sun.reflect.NativeMethodAccessorImpl.invoke0(Native Method)
	at sun.reflect.NativeMethodAccessorImpl.invoke(NativeMethodAccessorImpl.java:57)
	at sun.reflect.DelegatingMethodAccessorImpl.invoke(DelegatingMethodAccessorImpl.java:43)
	at java.lang.reflect.Method.invoke(Method.java:606)
	at com.carrotsearch.randomizedtesting.RandomizedRunner.invoke(RandomizedRunner.java:1618)
	at com.carrotsearch.randomizedtesting.RandomizedRunner$6.evaluate(RandomizedRunner.java:827)
	at com.carrotsearch.randomizedtesting.RandomizedRunner$7.evaluate(RandomizedRunner.java:863)
	at com.carrotsearch.randomizedtesting.RandomizedRunner$8.evaluate(RandomizedRunner.java:877)
	at com.carrotsearch.randomizedtesting.rules.SystemPropertiesRestoreRule$1.evaluate(SystemPropertiesRestoreRule.java:53)
	at org.apache.lucene.util.TestRuleSetupTeardownChained$1.evaluate(TestRuleSetupTeardownChained.java:50)
	at org.apache.lucene.util.TestRuleFieldCacheSanity$1.evaluate(TestRuleFieldCacheSanity.java:51)
	at org.apache.lucene.util.AbstractBeforeAfterRule$1.evaluate(AbstractBeforeAfterRule.java:46)
	at com.carrotsearch.randomizedtesting.rules.SystemPropertiesInvariantRule$1.evaluate(SystemPropertiesInvariantRule.java:55)
	at org.apache.lucene.util.TestRuleThreadAndTestName$1.evaluate(TestRuleThreadAndTestName.java:49)
	at org.apache.lucene.util.TestRuleIgnoreAfterMaxFailures$1.evaluate(TestRuleIgnoreAfterMaxFailures.java:65)
	at org.apache.lucene.util.TestRuleMarkFailure$1.evaluate(TestRuleMarkFailure.java:48)
	at com.carrotsearch.randomizedtesting.rules.StatementAdapter.evaluate(StatementAdapter.java:36)
	at com.carrotsearch.randomizedtesting.ThreadLeakControl$StatementRunner.run(ThreadLeakControl.java:365)
	at com.carrotsearch.randomizedtesting.ThreadLeakControl.forkTimeoutingTask(ThreadLeakControl.java:798)
	at com.carrotsearch.randomizedtesting.ThreadLeakControl$3.evaluate(ThreadLeakControl.java:458)
	at com.carrotsearch.randomizedtesting.RandomizedRunner.runSingleTest(RandomizedRunner.java:836)
	at com.carrotsearch.randomizedtesting.RandomizedRunner$3.evaluate(RandomizedRunner.java:738)
	at com.carrotsearch.randomizedtesting.RandomizedRunner$4.evaluate(RandomizedRunner.java:772)
	at com.carrotsearch.randomizedtesting.RandomizedRunner$5.evaluate(RandomizedRunner.java:783)
	at com.carrotsearch.randomizedtesting.rules.StatementAdapter.evaluate(StatementAdapter.java:36)
	at com.carrotsearch.randomizedtesting.rules.SystemPropertiesRestoreRule$1.evaluate(SystemPropertiesRestoreRule.java:53)
	at org.apache.lucene.util.AbstractBeforeAfterRule$1.evaluate(AbstractBeforeAfterRule.java:46)
	at org.apache.lucene.util.TestRuleStoreClassName$1.evaluate(TestRuleStoreClassName.java:42)
	at com.carrotsearch.randomizedtesting.rules.SystemPropertiesInvariantRule$1.evaluate(SystemPropertiesInvariantRule.java:55)
	at com.carrotsearch.randomizedtesting.rules.NoShadowingOrOverridesOnMethodsRule$1.evaluate(NoShadowingOrOverridesOnMethodsRule.java:39)
	at com.carrotsearch.randomizedtesting.rules.NoShadowingOrOverridesOnMethodsRule$1.evaluate(NoShadowingOrOverridesOnMethodsRule.java:39)
	at com.carrotsearch.randomizedtesting.rules.StatementAdapter.evaluate(StatementAdapter.java:36)
	at com.carrotsearch.randomizedtesting.rules.StatementAdapter.evaluate(StatementAdapter.java:36)
	at com.carrotsearch.randomizedtesting.rules.StatementAdapter.evaluate(StatementAdapter.java:36)
	at org.apache.lucene.util.TestRuleAssertionsRequired$1.evaluate(TestRuleAssertionsRequired.java:43)
	at org.apache.lucene.util.TestRuleMarkFailure$1.evaluate(TestRuleMarkFailure.java:48)
	at org.apache.lucene.util.TestRuleIgnoreAfterMaxFailures$1.evaluate(TestRuleIgnoreAfterMaxFailures.java:65)
	at org.apache.lucene.util.TestRuleIgnoreTestSuites$1.evaluate(TestRuleIgnoreTestSuites.java:55)
	at com.carrotsearch.randomizedtesting.rules.StatementAdapter.evaluate(StatementAdapter.java:36)
	at com.carrotsearch.randomizedtesting.ThreadLeakControl$StatementRunner.run(ThreadLeakControl.java:365)
	at java.lang.Thread.run(Thread.java:745)


REGRESSION:  org.apache.solr.client.solrj.embedded.SolrExampleEmbeddedTest.testChildDoctransformer

Error Message:


Stack Trace:
java.lang.AssertionError
	at __randomizedtesting.SeedInfo.seed([69078053919685D4:1ADD9FC91D8EF2D2]:0)
	at org.apache.lucene.search.join.ToChildBlockJoinQuery$ToChildBlockJoinScorer.advance(ToChildBlockJoinQuery.java:286)
	at org.apache.lucene.search.FilteredQuery$LeapFrogScorer.advanceToNextCommonDoc(FilteredQuery.java:274)
	at org.apache.lucene.search.FilteredQuery$LeapFrogScorer.nextDoc(FilteredQuery.java:286)
	at org.apache.lucene.search.Weight$DefaultBulkScorer.scoreAll(Weight.java:192)
	at org.apache.lucene.search.Weight$DefaultBulkScorer.score(Weight.java:163)
	at org.apache.lucene.search.BulkScorer.score(BulkScorer.java:35)
	at org.apache.lucene.search.IndexSearcher.search(IndexSearcher.java:621)
	at org.apache.lucene.search.IndexSearcher.search(IndexSearcher.java:297)
	at org.apache.solr.search.SolrIndexSearcher.buildAndRunCollectorChain(SolrIndexSearcher.java:209)
	at org.apache.solr.search.SolrIndexSearcher.getDocListNC(SolrIndexSearcher.java:1619)
	at org.apache.solr.search.SolrIndexSearcher.getDocListC(SolrIndexSearcher.java:1433)
	at org.apache.solr.search.SolrIndexSearcher.search(SolrIndexSearcher.java:514)
	at org.apache.solr.search.SolrIndexSearcher.getDocList(SolrIndexSearcher.java:1268)
	at org.apache.solr.response.transform.ChildDocTransformer.transform(ChildDocTransformerFactory.java:144)
	at org.apache.solr.response.BinaryResponseWriter$Resolver.writeResultsBody(BinaryResponseWriter.java:159)
	at org.apache.solr.response.BinaryResponseWriter$Resolver.writeResults(BinaryResponseWriter.java:183)
	at org.apache.solr.response.BinaryResponseWriter$Resolver.resolve(BinaryResponseWriter.java:88)
	at org.apache.solr.common.util.JavaBinCodec.writeVal(JavaBinCodec.java:158)
	at org.apache.solr.common.util.JavaBinCodec.writeNamedList(JavaBinCodec.java:148)
	at org.apache.solr.common.util.JavaBinCodec.writeKnownType(JavaBinCodec.java:242)
	at org.apache.solr.common.util.JavaBinCodec.writeVal(JavaBinCodec.java:153)
	at org.apache.solr.common.util.JavaBinCodec.marshal(JavaBinCodec.java:96)
	at org.apache.solr.response.BinaryResponseWriter.getParsedResponse(BinaryResponseWriter.java:256)
	at org.apache.solr.client.solrj.embedded.EmbeddedSolrServer.getParsedResponse(EmbeddedSolrServer.java:241)
	at org.apache.solr.client.solrj.embedded.EmbeddedSolrServer.request(EmbeddedSolrServer.java:213)
	at org.apache.solr.client.solrj.request.QueryRequest.process(QueryRequest.java:91)
	at org.apache.solr.client.solrj.SolrServer.query(SolrServer.java:301)
	at org.apache.solr.client.solrj.SolrExampleTests.testChildDoctransformer(SolrExampleTests.java:1373)
	at sun.reflect.NativeMethodAccessorImpl.invoke0(Native Method)
	at sun.reflect.NativeMethodAccessorImpl.invoke(NativeMethodAccessorImpl.java:57)
	at sun.reflect.DelegatingMethodAccessorImpl.invoke(DelegatingMethodAccessorImpl.java:43)
	at java.lang.reflect.Method.invoke(Method.java:606)
	at com.carrotsearch.randomizedtesting.RandomizedRunner.invoke(RandomizedRunner.java:1618)
	at com.carrotsearch.randomizedtesting.RandomizedRunner$6.evaluate(RandomizedRunner.java:827)
	at com.carrotsearch.randomizedtesting.RandomizedRunner$7.evaluate(RandomizedRunner.java:863)
	at com.carrotsearch.randomizedtesting.RandomizedRunner$8.evaluate(RandomizedRunner.java:877)
	at com.carrotsearch.randomizedtesting.rules.SystemPropertiesRestoreRule$1.evaluate(SystemPropertiesRestoreRule.java:53)
	at org.apache.lucene.util.TestRuleSetupTeardownChained$1.evaluate(TestRuleSetupTeardownChained.java:50)
	at org.apache.lucene.util.TestRuleFieldCacheSanity$1.evaluate(TestRuleFieldCacheSanity.java:51)
	at org.apache.lucene.util.AbstractBeforeAfterRule$1.evaluate(AbstractBeforeAfterRule.java:46)
	at com.carrotsearch.randomizedtesting.rules.SystemPropertiesInvariantRule$1.evaluate(SystemPropertiesInvariantRule.java:55)
	at org.apache.lucene.util.TestRuleThreadAndTestName$1.evaluate(TestRuleThreadAndTestName.java:49)
	at org.apache.lucene.util.TestRuleIgnoreAfterMaxFailures$1.evaluate(TestRuleIgnoreAfterMaxFailures.java:65)
	at org.apache.lucene.util.TestRuleMarkFailure$1.evaluate(TestRuleMarkFailure.java:48)
	at com.carrotsearch.randomizedtesting.rules.StatementAdapter.evaluate(StatementAdapter.java:36)
	at com.carrotsearch.randomizedtesting.ThreadLeakControl$StatementRunner.run(ThreadLeakControl.java:365)
	at com.carrotsearch.randomizedtesting.ThreadLeakControl.forkTimeoutingTask(ThreadLeakControl.java:798)
	at com.carrotsearch.randomizedtesting.ThreadLeakControl$3.evaluate(ThreadLeakControl.java:458)
	at com.carrotsearch.randomizedtesting.RandomizedRunner.runSingleTest(RandomizedRunner.java:836)
	at com.carrotsearch.randomizedtesting.RandomizedRunner$3.evaluate(RandomizedRunner.java:738)
	at com.carrotsearch.randomizedtesting.RandomizedRunner$4.evaluate(RandomizedRunner.java:772)
	at com.carrotsearch.randomizedtesting.RandomizedRunner$5.evaluate(RandomizedRunner.java:783)
	at com.carrotsearch.randomizedtesting.rules.StatementAdapter.evaluate(StatementAdapter.java:36)
	at com.carrotsearch.randomizedtesting.rules.SystemPropertiesRestoreRule$1.evaluate(SystemPropertiesRestoreRule.java:53)
	at org.apache.lucene.util.AbstractBeforeAfterRule$1.evaluate(AbstractBeforeAfterRule.java:46)
	at org.apache.lucene.util.TestRuleStoreClassName$1.evaluate(TestRuleStoreClassName.java:42)
	at com.carrotsearch.randomizedtesting.rules.SystemPropertiesInvariantRule$1.evaluate(SystemPropertiesInvariantRule.java:55)
	at com.carrotsearch.randomizedtesting.rules.NoShadowingOrOverridesOnMethodsRule$1.evaluate(NoShadowingOrOverridesOnMethodsRule.java:39)
	at com.carrotsearch.randomizedtesting.rules.NoShadowingOrOverridesOnMethodsRule$1.evaluate(NoShadowingOrOverridesOnMethodsRule.java:39)
	at com.carrotsearch.randomizedtesting.rules.StatementAdapter.evaluate(StatementAdapter.java:36)
	at com.carrotsearch.randomizedtesting.rules.StatementAdapter.evaluate(StatementAdapter.java:36)
	at com.carrotsearch.randomizedtesting.rules.StatementAdapter.evaluate(StatementAdapter.java:36)
	at org.apache.lucene.util.TestRuleAssertionsRequired$1.evaluate(TestRuleAssertionsRequired.java:43)
	at org.apache.lucene.util.TestRuleMarkFailure$1.evaluate(TestRuleMarkFailure.java:48)
	at org.apache.lucene.util.TestRuleIgnoreAfterMaxFailures$1.evaluate(TestRuleIgnoreAfterMaxFailures.java:65)
	at org.apache.lucene.util.TestRuleIgnoreTestSuites$1.evaluate(TestRuleIgnoreTestSuites.java:55)
	at com.carrotsearch.randomizedtesting.rules.StatementAdapter.evaluate(StatementAdapter.java:36)
	at com.carrotsearch.randomizedtesting.ThreadLeakControl$StatementRunner.run(ThreadLeakControl.java:365)
	at java.lang.Thread.run(Thread.java:745)


REGRESSION:  org.apache.solr.client.solrj.embedded.SolrExampleJettyTest.testChildDoctransformer

Error Message:
Expected mime type application/octet-stream but got text/html. <html> <head> <meta http-equiv="Content-Type" content="text/html;charset=ISO-8859-1"/> <title>Error 500 Server Error</title> </head> <body> <h2>HTTP ERROR: 500</h2> <p>Problem accessing /solr/collection1/select. Reason: <pre>    Server Error</pre></p> <hr /><i><small>Powered by Jetty://</small></i>                                                                                                                                                                                                                                                                                                                                                                                                                                                                                                                                                                                                                                                                                                                                                                                                                                                                                                                                                                                                                     </body> </html> 

Stack Trace:
org.apache.solr.client.solrj.impl.HttpSolrServer$RemoteSolrException: Expected mime type application/octet-stream but got text/html. <html>
<head>
<meta http-equiv="Content-Type" content="text/html;charset=ISO-8859-1"/>
<title>Error 500 Server Error</title>
</head>
<body>
<h2>HTTP ERROR: 500</h2>
<p>Problem accessing /solr/collection1/select. Reason:
<pre>    Server Error</pre></p>
<hr /><i><small>Powered by Jetty://</small></i>
                                                
                                                
                                                
                                                
                                                
                                                
                                                
                                                
                                                
                                                
                                                
                                                
                                                
                                                
                                                
                                                
                                                
                                                
                                                
                                                
</body>
</html>

	at __randomizedtesting.SeedInfo.seed([69078053919685D4:1ADD9FC91D8EF2D2]:0)
	at org.apache.solr.client.solrj.impl.HttpSolrServer.executeMethod(HttpSolrServer.java:512)
	at org.apache.solr.client.solrj.impl.HttpSolrServer.request(HttpSolrServer.java:210)
	at org.apache.solr.client.solrj.impl.HttpSolrServer.request(HttpSolrServer.java:206)
	at org.apache.solr.client.solrj.request.QueryRequest.process(QueryRequest.java:91)
	at org.apache.solr.client.solrj.SolrServer.query(SolrServer.java:301)
	at org.apache.solr.client.solrj.SolrExampleTests.testChildDoctransformer(SolrExampleTests.java:1373)
	at sun.reflect.NativeMethodAccessorImpl.invoke0(Native Method)
	at sun.reflect.NativeMethodAccessorImpl.invoke(NativeMethodAccessorImpl.java:57)
	at sun.reflect.DelegatingMethodAccessorImpl.invoke(DelegatingMethodAccessorImpl.java:43)
	at java.lang.reflect.Method.invoke(Method.java:606)
	at com.carrotsearch.randomizedtesting.RandomizedRunner.invoke(RandomizedRunner.java:1618)
	at com.carrotsearch.randomizedtesting.RandomizedRunner$6.evaluate(RandomizedRunner.java:827)
	at com.carrotsearch.randomizedtesting.RandomizedRunner$7.evaluate(RandomizedRunner.java:863)
	at com.carrotsearch.randomizedtesting.RandomizedRunner$8.evaluate(RandomizedRunner.java:877)
	at com.carrotsearch.randomizedtesting.rules.SystemPropertiesRestoreRule$1.evaluate(SystemPropertiesRestoreRule.java:53)
	at org.apache.lucene.util.TestRuleSetupTeardownChained$1.evaluate(TestRuleSetupTeardownChained.java:50)
	at org.apache.lucene.util.TestRuleFieldCacheSanity$1.evaluate(TestRuleFieldCacheSanity.java:51)
	at org.apache.lucene.util.AbstractBeforeAfterRule$1.evaluate(AbstractBeforeAfterRule.java:46)
	at com.carrotsearch.randomizedtesting.rules.SystemPropertiesInvariantRule$1.evaluate(SystemPropertiesInvariantRule.java:55)
	at org.apache.lucene.util.TestRuleThreadAndTestName$1.evaluate(TestRuleThreadAndTestName.java:49)
	at org.apache.lucene.util.TestRuleIgnoreAfterMaxFailures$1.evaluate(TestRuleIgnoreAfterMaxFailures.java:65)
	at org.apache.lucene.util.TestRuleMarkFailure$1.evaluate(TestRuleMarkFailure.java:48)
	at com.carrotsearch.randomizedtesting.rules.StatementAdapter.evaluate(StatementAdapter.java:36)
	at com.carrotsearch.randomizedtesting.ThreadLeakControl$StatementRunner.run(ThreadLeakControl.java:365)
	at com.carrotsearch.randomizedtesting.ThreadLeakControl.forkTimeoutingTask(ThreadLeakControl.java:798)
	at com.carrotsearch.randomizedtesting.ThreadLeakControl$3.evaluate(ThreadLeakControl.java:458)
	at com.carrotsearch.randomizedtesting.RandomizedRunner.runSingleTest(RandomizedRunner.java:836)
	at com.carrotsearch.randomizedtesting.RandomizedRunner$3.evaluate(RandomizedRunner.java:738)
	at com.carrotsearch.randomizedtesting.RandomizedRunner$4.evaluate(RandomizedRunner.java:772)
	at com.carrotsearch.randomizedtesting.RandomizedRunner$5.evaluate(RandomizedRunner.java:783)
	at com.carrotsearch.randomizedtesting.rules.StatementAdapter.evaluate(StatementAdapter.java:36)
	at com.carrotsearch.randomizedtesting.rules.SystemPropertiesRestoreRule$1.evaluate(SystemPropertiesRestoreRule.java:53)
	at org.apache.lucene.util.AbstractBeforeAfterRule$1.evaluate(AbstractBeforeAfterRule.java:46)
	at org.apache.lucene.util.TestRuleStoreClassName$1.evaluate(TestRuleStoreClassName.java:42)
	at com.carrotsearch.randomizedtesting.rules.SystemPropertiesInvariantRule$1.evaluate(SystemPropertiesInvariantRule.java:55)
	at com.carrotsearch.randomizedtesting.rules.NoShadowingOrOverridesOnMethodsRule$1.evaluate(NoShadowingOrOverridesOnMethodsRule.java:39)
	at com.carrotsearch.randomizedtesting.rules.NoShadowingOrOverridesOnMethodsRule$1.evaluate(NoShadowingOrOverridesOnMethodsRule.java:39)
	at com.carrotsearch.randomizedtesting.rules.StatementAdapter.evaluate(StatementAdapter.java:36)
	at com.carrotsearch.randomizedtesting.rules.StatementAdapter.evaluate(StatementAdapter.java:36)
	at com.carrotsearch.randomizedtesting.rules.StatementAdapter.evaluate(StatementAdapter.java:36)
	at org.apache.lucene.util.TestRuleAssertionsRequired$1.evaluate(TestRuleAssertionsRequired.java:43)
	at org.apache.lucene.util.TestRuleMarkFailure$1.evaluate(TestRuleMarkFailure.java:48)
	at org.apache.lucene.util.TestRuleIgnoreAfterMaxFailures$1.evaluate(TestRuleIgnoreAfterMaxFailures.java:65)
	at org.apache.lucene.util.TestRuleIgnoreTestSuites$1.evaluate(TestRuleIgnoreTestSuites.java:55)
	at com.carrotsearch.randomizedtesting.rules.StatementAdapter.evaluate(StatementAdapter.java:36)
	at com.carrotsearch.randomizedtesting.ThreadLeakControl$StatementRunner.run(ThreadLeakControl.java:365)
	at java.lang.Thread.run(Thread.java:745)


REGRESSION:  org.apache.solr.client.solrj.embedded.SolrExampleStreamingBinaryTest.testChildDoctransformer

Error Message:
Expected mime type application/octet-stream but got text/html. <html> <head> <meta http-equiv="Content-Type" content="text/html;charset=ISO-8859-1"/> <title>Error 500 Server Error</title> </head> <body> <h2>HTTP ERROR: 500</h2> <p>Problem accessing /solr/collection1/select. Reason: <pre>    Server Error</pre></p> <hr /><i><small>Powered by Jetty://</small></i>                                                                                                                                                                                                                                                                                                                                                                                                                                                                                                                                                                                                                                                                                                                                                                                                                                                                                                                                                                                                                     </body> </html> 

Stack Trace:
org.apache.solr.client.solrj.impl.HttpSolrServer$RemoteSolrException: Expected mime type application/octet-stream but got text/html. <html>
<head>
<meta http-equiv="Content-Type" content="text/html;charset=ISO-8859-1"/>
<title>Error 500 Server Error</title>
</head>
<body>
<h2>HTTP ERROR: 500</h2>
<p>Problem accessing /solr/collection1/select. Reason:
<pre>    Server Error</pre></p>
<hr /><i><small>Powered by Jetty://</small></i>
                                                
                                                
                                                
                                                
                                                
                                                
                                                
                                                
                                                
                                                
                                                
                                                
                                                
                                                
                                                
                                                
                                                
                                                
                                                
                                                
</body>
</html>

	at __randomizedtesting.SeedInfo.seed([69078053919685D4:1ADD9FC91D8EF2D2]:0)
	at org.apache.solr.client.solrj.impl.HttpSolrServer.executeMethod(HttpSolrServer.java:512)
	at org.apache.solr.client.solrj.impl.HttpSolrServer.request(HttpSolrServer.java:210)
	at org.apache.solr.client.solrj.impl.HttpSolrServer.request(HttpSolrServer.java:206)
	at org.apache.solr.client.solrj.impl.ConcurrentUpdateSolrServer.request(ConcurrentUpdateSolrServer.java:281)
	at org.apache.solr.client.solrj.request.QueryRequest.process(QueryRequest.java:91)
	at org.apache.solr.client.solrj.SolrServer.query(SolrServer.java:301)
	at org.apache.solr.client.solrj.SolrExampleTests.testChildDoctransformer(SolrExampleTests.java:1373)
	at sun.reflect.NativeMethodAccessorImpl.invoke0(Native Method)
	at sun.reflect.NativeMethodAccessorImpl.invoke(NativeMethodAccessorImpl.java:57)
	at sun.reflect.DelegatingMethodAccessorImpl.invoke(DelegatingMethodAccessorImpl.java:43)
	at java.lang.reflect.Method.invoke(Method.java:606)
	at com.carrotsearch.randomizedtesting.RandomizedRunner.invoke(RandomizedRunner.java:1618)
	at com.carrotsearch.randomizedtesting.RandomizedRunner$6.evaluate(RandomizedRunner.java:827)
	at com.carrotsearch.randomizedtesting.RandomizedRunner$7.evaluate(RandomizedRunner.java:863)
	at com.carrotsearch.randomizedtesting.RandomizedRunner$8.evaluate(RandomizedRunner.java:877)
	at com.carrotsearch.randomizedtesting.rules.SystemPropertiesRestoreRule$1.evaluate(SystemPropertiesRestoreRule.java:53)
	at org.apache.lucene.util.TestRuleSetupTeardownChained$1.evaluate(TestRuleSetupTeardownChained.java:50)
	at org.apache.lucene.util.TestRuleFieldCacheSanity$1.evaluate(TestRuleFieldCacheSanity.java:51)
	at org.apache.lucene.util.AbstractBeforeAfterRule$1.evaluate(AbstractBeforeAfterRule.java:46)
	at com.carrotsearch.randomizedtesting.rules.SystemPropertiesInvariantRule$1.evaluate(SystemPropertiesInvariantRule.java:55)
	at org.apache.lucene.util.TestRuleThreadAndTestName$1.evaluate(TestRuleThreadAndTestName.java:49)
	at org.apache.lucene.util.TestRuleIgnoreAfterMaxFailures$1.evaluate(TestRuleIgnoreAfterMaxFailures.java:65)
	at org.apache.lucene.util.TestRuleMarkFailure$1.evaluate(TestRuleMarkFailure.java:48)
	at com.carrotsearch.randomizedtesting.rules.StatementAdapter.evaluate(StatementAdapter.java:36)
	at com.carrotsearch.randomizedtesting.ThreadLeakControl$StatementRunner.run(ThreadLeakControl.java:365)
	at com.carrotsearch.randomizedtesting.ThreadLeakControl.forkTimeoutingTask(ThreadLeakControl.java:798)
	at com.carrotsearch.randomizedtesting.ThreadLeakControl$3.evaluate(ThreadLeakControl.java:458)
	at com.carrotsearch.randomizedtesting.RandomizedRunner.runSingleTest(RandomizedRunner.java:836)
	at com.carrotsearch.randomizedtesting.RandomizedRunner$3.evaluate(RandomizedRunner.java:738)
	at com.carrotsearch.randomizedtesting.RandomizedRunner$4.evaluate(RandomizedRunner.java:772)
	at com.carrotsearch.randomizedtesting.RandomizedRunner$5.evaluate(RandomizedRunner.java:783)
	at com.carrotsearch.randomizedtesting.rules.StatementAdapter.evaluate(StatementAdapter.java:36)
	at com.carrotsearch.randomizedtesting.rules.SystemPropertiesRestoreRule$1.evaluate(SystemPropertiesRestoreRule.java:53)
	at org.apache.lucene.util.AbstractBeforeAfterRule$1.evaluate(AbstractBeforeAfterRule.java:46)
	at org.apache.lucene.util.TestRuleStoreClassName$1.evaluate(TestRuleStoreClassName.java:42)
	at com.carrotsearch.randomizedtesting.rules.SystemPropertiesInvariantRule$1.evaluate(SystemPropertiesInvariantRule.java:55)
	at com.carrotsearch.randomizedtesting.rules.NoShadowingOrOverridesOnMethodsRule$1.evaluate(NoShadowingOrOverridesOnMethodsRule.java:39)
	at com.carrotsearch.randomizedtesting.rules.NoShadowingOrOverridesOnMethodsRule$1.evaluate(NoShadowingOrOverridesOnMethodsRule.java:39)
	at com.carrotsearch.randomizedtesting.rules.StatementAdapter.evaluate(StatementAdapter.java:36)
	at com.carrotsearch.randomizedtesting.rules.StatementAdapter.evaluate(StatementAdapter.java:36)
	at com.carrotsearch.randomizedtesting.rules.StatementAdapter.evaluate(StatementAdapter.java:36)
	at org.apache.lucene.util.TestRuleAssertionsRequired$1.evaluate(TestRuleAssertionsRequired.java:43)
	at org.apache.lucene.util.TestRuleMarkFailure$1.evaluate(TestRuleMarkFailure.java:48)
	at org.apache.lucene.util.TestRuleIgnoreAfterMaxFailures$1.evaluate(TestRuleIgnoreAfterMaxFailures.java:65)
	at org.apache.lucene.util.TestRuleIgnoreTestSuites$1.evaluate(TestRuleIgnoreTestSuites.java:55)
	at com.carrotsearch.randomizedtesting.rules.StatementAdapter.evaluate(StatementAdapter.java:36)
	at com.carrotsearch.randomizedtesting.ThreadLeakControl$StatementRunner.run(ThreadLeakControl.java:365)
	at java.lang.Thread.run(Thread.java:745)


REGRESSION:  org.apache.solr.client.solrj.embedded.SolrExampleStreamingTest.testChildDoctransformer

Error Message:
java.lang.AssertionError

Stack Trace:
org.apache.solr.client.solrj.impl.HttpSolrServer$RemoteSolrException: java.lang.AssertionError
	at __randomizedtesting.SeedInfo.seed([69078053919685D4:1ADD9FC91D8EF2D2]:0)
	at org.apache.solr.client.solrj.impl.HttpSolrServer.executeMethod(HttpSolrServer.java:550)
	at org.apache.solr.client.solrj.impl.HttpSolrServer.request(HttpSolrServer.java:210)
	at org.apache.solr.client.solrj.impl.HttpSolrServer.request(HttpSolrServer.java:206)
	at org.apache.solr.client.solrj.impl.ConcurrentUpdateSolrServer.request(ConcurrentUpdateSolrServer.java:281)
	at org.apache.solr.client.solrj.request.QueryRequest.process(QueryRequest.java:91)
	at org.apache.solr.client.solrj.SolrServer.query(SolrServer.java:301)
	at org.apache.solr.client.solrj.SolrExampleTests.testChildDoctransformer(SolrExampleTests.java:1373)
	at sun.reflect.NativeMethodAccessorImpl.invoke0(Native Method)
	at sun.reflect.NativeMethodAccessorImpl.invoke(NativeMethodAccessorImpl.java:57)
	at sun.reflect.DelegatingMethodAccessorImpl.invoke(DelegatingMethodAccessorImpl.java:43)
	at java.lang.reflect.Method.invoke(Method.java:606)
	at com.carrotsearch.randomizedtesting.RandomizedRunner.invoke(RandomizedRunner.java:1618)
	at com.carrotsearch.randomizedtesting.RandomizedRunner$6.evaluate(RandomizedRunner.java:827)
	at com.carrotsearch.randomizedtesting.RandomizedRunner$7.evaluate(RandomizedRunner.java:863)
	at com.carrotsearch.randomizedtesting.RandomizedRunner$8.evaluate(RandomizedRunner.java:877)
	at com.carrotsearch.randomizedtesting.rules.SystemPropertiesRestoreRule$1.evaluate(SystemPropertiesRestoreRule.java:53)
	at org.apache.lucene.util.TestRuleSetupTeardownChained$1.evaluate(TestRuleSetupTeardownChained.java:50)
	at org.apache.lucene.util.TestRuleFieldCacheSanity$1.evaluate(TestRuleFieldCacheSanity.java:51)
	at org.apache.lucene.util.AbstractBeforeAfterRule$1.evaluate(AbstractBeforeAfterRule.java:46)
	at com.carrotsearch.randomizedtesting.rules.SystemPropertiesInvariantRule$1.evaluate(SystemPropertiesInvariantRule.java:55)
	at org.apache.lucene.util.TestRuleThreadAndTestName$1.evaluate(TestRuleThreadAndTestName.java:49)
	at org.apache.lucene.util.TestRuleIgnoreAfterMaxFailures$1.evaluate(TestRuleIgnoreAfterMaxFailures.java:65)
	at org.apache.lucene.util.TestRuleMarkFailure$1.evaluate(TestRuleMarkFailure.java:48)
	at com.carrotsearch.randomizedtesting.rules.StatementAdapter.evaluate(StatementAdapter.java:36)
	at com.carrotsearch.randomizedtesting.ThreadLeakControl$StatementRunner.run(ThreadLeakControl.java:365)
	at com.carrotsearch.randomizedtesting.ThreadLeakControl.forkTimeoutingTask(ThreadLeakControl.java:798)
	at com.carrotsearch.randomizedtesting.ThreadLeakControl$3.evaluate(ThreadLeakControl.java:458)
	at com.carrotsearch.randomizedtesting.RandomizedRunner.runSingleTest(RandomizedRunner.java:836)
	at com.carrotsearch.randomizedtesting.RandomizedRunner$3.evaluate(RandomizedRunner.java:738)
	at com.carrotsearch.randomizedtesting.RandomizedRunner$4.evaluate(RandomizedRunner.java:772)
	at com.carrotsearch.randomizedtesting.RandomizedRunner$5.evaluate(RandomizedRunner.java:783)
	at com.carrotsearch.randomizedtesting.rules.StatementAdapter.evaluate(StatementAdapter.java:36)
	at com.carrotsearch.randomizedtesting.rules.SystemPropertiesRestoreRule$1.evaluate(SystemPropertiesRestoreRule.java:53)
	at org.apache.lucene.util.AbstractBeforeAfterRule$1.evaluate(AbstractBeforeAfterRule.java:46)
	at org.apache.lucene.util.TestRuleStoreClassName$1.evaluate(TestRuleStoreClassName.java:42)
	at com.carrotsearch.randomizedtesting.rules.SystemPropertiesInvariantRule$1.evaluate(SystemPropertiesInvariantRule.java:55)
	at com.carrotsearch.randomizedtesting.rules.NoShadowingOrOverridesOnMethodsRule$1.evaluate(NoShadowingOrOverridesOnMethodsRule.java:39)
	at com.carrotsearch.randomizedtesting.rules.NoShadowingOrOverridesOnMethodsRule$1.evaluate(NoShadowingOrOverridesOnMethodsRule.java:39)
	at com.carrotsearch.randomizedtesting.rules.StatementAdapter.evaluate(StatementAdapter.java:36)
	at com.carrotsearch.randomizedtesting.rules.StatementAdapter.evaluate(StatementAdapter.java:36)
	at com.carrotsearch.randomizedtesting.rules.StatementAdapter.evaluate(StatementAdapter.java:36)
	at org.apache.lucene.util.TestRuleAssertionsRequired$1.evaluate(TestRuleAssertionsRequired.java:43)
	at org.apache.lucene.util.TestRuleMarkFailure$1.evaluate(TestRuleMarkFailure.java:48)
	at org.apache.lucene.util.TestRuleIgnoreAfterMaxFailures$1.evaluate(TestRuleIgnoreAfterMaxFailures.java:65)
	at org.apache.lucene.util.TestRuleIgnoreTestSuites$1.evaluate(TestRuleIgnoreTestSuites.java:55)
	at com.carrotsearch.randomizedtesting.rules.StatementAdapter.evaluate(StatementAdapter.java:36)
	at com.carrotsearch.randomizedtesting.ThreadLeakControl$StatementRunner.run(ThreadLeakControl.java:365)
	at java.lang.Thread.run(Thread.java:745)




Build Log:
[...truncated 12800 lines...]
   [junit4] Suite: org.apache.solr.client.solrj.embedded.SolrExampleStreamingTest
   [junit4]   2> Creating dataDir: /mnt/ssd/jenkins/workspace/Lucene-Solr-4.x-Linux/solr/build/solr-solrj/test/J1/./temp/solr.client.solrj.embedded.SolrExampleStreamingTest-69078053919685D4-001/init-core-data-001
   [junit4]   2> 22283 T81 oas.SolrTestCaseJ4.initCore ####initCore
   [junit4]   2> 22284 T81 oas.SolrTestCaseJ4.initCore ####initCore end
   [junit4]   2> 22284 T81 oejs.Server.doStart jetty-8.1.10.v20130312
   [junit4]   2> 22287 T81 oejs.AbstractConnector.doStart Started SelectChannelConnector@127.0.0.1:48491
   [junit4]   2> 22288 T81 oass.SolrDispatchFilter.init SolrDispatchFilter.init()
   [junit4]   2> 22288 T81 oasc.SolrResourceLoader.locateSolrHome JNDI not configured for solr (NoInitialContextEx)
   [junit4]   2> 22288 T81 oasc.SolrResourceLoader.locateSolrHome using system property solr.solr.home: /mnt/ssd/jenkins/workspace/Lucene-Solr-4.x-Linux/solr/example/solr
   [junit4]   2> 22288 T81 oasc.SolrResourceLoader.<init> new SolrResourceLoader for directory: '/mnt/ssd/jenkins/workspace/Lucene-Solr-4.x-Linux/solr/example/solr/'
   [junit4]   2> 22298 T81 oasc.ConfigSolr.fromFile Loading container configuration from /mnt/ssd/jenkins/workspace/Lucene-Solr-4.x-Linux/solr/example/solr/solr.xml
   [junit4]   2> 22328 T81 oasc.CorePropertiesLocator.<init> Config-defined core root directory: /mnt/ssd/jenkins/workspace/Lucene-Solr-4.x-Linux/solr/example/solr
   [junit4]   2> 22328 T81 oasc.CoreContainer.<init> New CoreContainer 1522014557
   [junit4]   2> 22328 T81 oasc.CoreContainer.load Loading cores into CoreContainer [instanceDir=/mnt/ssd/jenkins/workspace/Lucene-Solr-4.x-Linux/solr/example/solr/]
   [junit4]   2> 22329 T81 oashc.HttpShardHandlerFactory.getParameter Setting socketTimeout to: 0
   [junit4]   2> 22329 T81 oashc.HttpShardHandlerFactory.getParameter Setting urlScheme to: null
   [junit4]   2> 22330 T81 oashc.HttpShardHandlerFactory.getParameter Setting connTimeout to: 0
   [junit4]   2> 22330 T81 oashc.HttpShardHandlerFactory.getParameter Setting maxConnectionsPerHost to: 20
   [junit4]   2> 22330 T81 oashc.HttpShardHandlerFactory.getParameter Setting corePoolSize to: 0
   [junit4]   2> 22331 T81 oashc.HttpShardHandlerFactory.getParameter Setting maximumPoolSize to: 2147483647
   [junit4]   2> 22331 T81 oashc.HttpShardHandlerFactory.getParameter Setting maxThreadIdleTime to: 5
   [junit4]   2> 22331 T81 oashc.HttpShardHandlerFactory.getParameter Setting sizeOfQueue to: -1
   [junit4]   2> 22331 T81 oashc.HttpShardHandlerFactory.getParameter Setting fairnessPolicy to: false
   [junit4]   2> 22332 T81 oasu.UpdateShardHandler.<init> Creating UpdateShardHandler HTTP client with params: socketTimeout=0&connTimeout=0&retry=false
   [junit4]   2> 22332 T81 oasl.LogWatcher.createWatcher SLF4J impl is org.slf4j.impl.Log4jLoggerFactory
   [junit4]   2> 22333 T81 oasl.LogWatcher.newRegisteredLogWatcher Registering Log Listener [Log4j (org.slf4j.impl.Log4jLoggerFactory)]
   [junit4]   2> 22333 T81 oasc.CoreContainer.load Host Name: 
   [junit4]   2> 22336 T81 oasc.CorePropertiesLocator.discover Looking for core definitions underneath /mnt/ssd/jenkins/workspace/Lucene-Solr-4.x-Linux/solr/example/solr
   [junit4]   2> 22338 T81 oasc.CorePropertiesLocator.discoverUnder Found core collection1 in /mnt/ssd/jenkins/workspace/Lucene-Solr-4.x-Linux/solr/example/solr/collection1/
   [junit4]   2> 22340 T81 oasc.CorePropertiesLocator.discover Found 1 core definitions
   [junit4]   2> 22341 T91 oasc.SolrResourceLoader.<init> new SolrResourceLoader for directory: '/mnt/ssd/jenkins/workspace/Lucene-Solr-4.x-Linux/solr/example/solr/collection1/'
   [junit4]   2> 22379 T91 oasc.SolrConfig.initLibs Adding specified lib dirs to ClassLoader
   [junit4]   2> 22379 T91 oasc.SolrResourceLoader.addToClassLoader WARN No files added to classloader from lib: ../../../contrib/extraction/lib (resolved as: /mnt/ssd/jenkins/workspace/Lucene-Solr-4.x-Linux/solr/example/solr/collection1/../../../contrib/extraction/lib).
   [junit4]   2> 22380 T91 oasc.SolrResourceLoader.addToClassLoader WARN Can't find (or read) directory to add to classloader: ../../../dist/ (resolved as: /mnt/ssd/jenkins/workspace/Lucene-Solr-4.x-Linux/solr/example/solr/collection1/../../../dist).
   [junit4]   2> 22380 T91 oasc.SolrResourceLoader.addToClassLoader WARN No files added to classloader from lib: ../../../contrib/clustering/lib/ (resolved as: /mnt/ssd/jenkins/workspace/Lucene-Solr-4.x-Linux/solr/example/solr/collection1/../../../contrib/clustering/lib).
   [junit4]   2> 22380 T91 oasc.SolrResourceLoader.addToClassLoader WARN Can't find (or read) directory to add to classloader: ../../../dist/ (resolved as: /mnt/ssd/jenkins/workspace/Lucene-Solr-4.x-Linux/solr/example/solr/collection1/../../../dist).
   [junit4]   2> 22381 T91 oasc.SolrResourceLoader.addToClassLoader WARN No files added to classloader from lib: ../../../contrib/langid/lib/ (resolved as: /mnt/ssd/jenkins/workspace/Lucene-Solr-4.x-Linux/solr/example/solr/collection1/../../../contrib/langid/lib).
   [junit4]   2> 22381 T91 oasc.SolrResourceLoader.addToClassLoader WARN Can't find (or read) directory to add to classloader: ../../../dist/ (resolved as: /mnt/ssd/jenkins/workspace/Lucene-Solr-4.x-Linux/solr/example/solr/collection1/../../../dist).
   [junit4]   2> 22381 T91 oasc.SolrResourceLoader.addToClassLoader WARN No files added to classloader from lib: ../../../contrib/velocity/lib (resolved as: /mnt/ssd/jenkins/workspace/Lucene-Solr-4.x-Linux/solr/example/solr/collection1/../../../contrib/velocity/lib).
   [junit4]   2> 22381 T91 oasc.SolrResourceLoader.addToClassLoader WARN Can't find (or read) directory to add to classloader: ../../../dist/ (resolved as: /mnt/ssd/jenkins/workspace/Lucene-Solr-4.x-Linux/solr/example/solr/collection1/../../../dist).
   [junit4]   2> 22403 T91 oasu.SolrIndexConfig.<init> IndexWriter infoStream solr logging is enabled
   [junit4]   2> 22406 T91 oasc.SolrConfig.<init> Using Lucene MatchVersion: 4.11.0
   [junit4]   2> 22468 T91 oasc.SolrConfig.<init> Loaded SolrConfig: solrconfig.xml
   [junit4]   2> 22468 T91 oass.IndexSchema.readSchema Reading Solr Schema from schema.xml
   [junit4]   2> 22492 T91 oass.IndexSchema.readSchema [collection1] Schema name=example
   [junit4]   2> 22855 T91 oass.IndexSchema.readSchema unique key field: id
   [junit4]   2> 22856 T91 oasr.RestManager$Registry.registerManagedResource Registered ManagedResource impl org.apache.solr.rest.schema.analysis.ManagedWordSetResource for path /schema/analysis/stopwords/english
   [junit4]   2> 22857 T91 oasr.RestManager$Registry.registerManagedResource Registered ManagedResource impl org.apache.solr.rest.schema.analysis.ManagedSynonymFilterFactory$SynonymManager for path /schema/analysis/synonyms/english
   [junit4]   2> 22874 T91 oass.FileExchangeRateProvider.reload Reloading exchange rates from file currency.xml
   [junit4]   2> 22878 T91 oass.FileExchangeRateProvider.reload Reloading exchange rates from file currency.xml
   [junit4]   2> 22896 T91 oasc.CoreContainer.create Creating SolrCore 'collection1' using configuration from instancedir /mnt/ssd/jenkins/workspace/Lucene-Solr-4.x-Linux/solr/example/solr/collection1/
   [junit4]   2> 22896 T91 oasc.SolrCore.initDirectoryFactory org.apache.solr.core.MockDirectoryFactory
   [junit4]   2> 22897 T91 oasc.SolrCore.<init> [collection1] Opening new SolrCore at /mnt/ssd/jenkins/workspace/Lucene-Solr-4.x-Linux/solr/example/solr/collection1/, dataDir=/mnt/ssd/jenkins/workspace/Lucene-Solr-4.x-Linux/solr/build/solr-solrj/test/J1/temp/solr.client.solrj.embedded.SolrExampleStreamingTest-69078053919685D4-001/tempDir-001/
   [junit4]   2> 22897 T91 oasc.JmxMonitoredMap.<init> No JMX servers found, not exposing Solr information with JMX.
   [junit4]   2> 22897 T91 oasc.SolrCore.initListeners [collection1] Added SolrEventListener for newSearcher: org.apache.solr.core.QuerySenderListener{queries=[]}
   [junit4]   2> 22898 T91 oasc.SolrCore.initListeners [collection1] Added SolrEventListener for firstSearcher: org.apache.solr.core.QuerySenderListener{queries=[{q=static firstSearcher warming in solrconfig.xml}]}
   [junit4]   2> 22898 T91 oasc.CachingDirectoryFactory.get return new directory for /mnt/ssd/jenkins/workspace/Lucene-Solr-4.x-Linux/solr/build/solr-solrj/test/J1/temp/solr.client.solrj.embedded.SolrExampleStreamingTest-69078053919685D4-001/tempDir-001
   [junit4]   2> 22898 T91 oasc.SolrCore.getNewIndexDir New index directory detected: old=null new=/mnt/ssd/jenkins/workspace/Lucene-Solr-4.x-Linux/solr/build/solr-solrj/test/J1/temp/solr.client.solrj.embedded.SolrExampleStreamingTest-69078053919685D4-001/tempDir-001/index/
   [junit4]   2> 22899 T91 oasc.SolrCore.initIndex WARN [collection1] Solr index directory '/mnt/ssd/jenkins/workspace/Lucene-Solr-4.x-Linux/solr/build/solr-solrj/test/J1/temp/solr.client.solrj.embedded.SolrExampleStreamingTest-69078053919685D4-001/tempDir-001/index' doesn't exist. Creating new index...
   [junit4]   2> 22899 T91 oasc.CachingDirectoryFactory.get return new directory for /mnt/ssd/jenkins/workspace/Lucene-Solr-4.x-Linux/solr/build/solr-solrj/test/J1/temp/solr.client.solrj.embedded.SolrExampleStreamingTest-69078053919685D4-001/tempDir-001/index
   [junit4]   2> 22900 T91 oasu.LoggingInfoStream.message [IFD][coreLoadExecutor-72-thread-1]: init: current segments file is "null"; deletionPolicy=org.apache.solr.core.IndexDeletionPolicyWrapper@6733fa82
   [junit4]   2> 22900 T91 oasu.LoggingInfoStream.message [IFD][coreLoadExecutor-72-thread-1]: now checkpoint "" [0 segments ; isCommit = false]
   [junit4]   2> 22900 T91 oasu.LoggingInfoStream.message [IFD][coreLoadExecutor-72-thread-1]: 0 msec to checkpoint
   [junit4]   2> 22900 T91 oasu.LoggingInfoStream.message [IW][coreLoadExecutor-72-thread-1]: init: create=true
   [junit4]   2> 22900 T91 oasu.LoggingInfoStream.message [IW][coreLoadExecutor-72-thread-1]: 
   [junit4]   2> 	dir=MockDirectoryWrapper(RAMDirectory@52e7a6e lockFactory=NativeFSLockFactory@/mnt/ssd/jenkins/workspace/Lucene-Solr-4.x-Linux/solr/build/solr-solrj/test/J1/temp/solr.client.solrj.embedded.SolrExampleStreamingTest-69078053919685D4-001/tempDir-001/index)
   [junit4]   2> 	index=
   [junit4]   2> 	version=4.11.0
   [junit4]   2> 	matchVersion=4.11.0
   [junit4]   2> 	analyzer=null
   [junit4]   2> 	ramBufferSizeMB=100.0
   [junit4]   2> 	maxBufferedDocs=-1
   [junit4]   2> 	maxBufferedDeleteTerms=-1
   [junit4]   2> 	mergedSegmentWarmer=null
   [junit4]   2> 	readerTermsIndexDivisor=1
   [junit4]   2> 	termIndexInterval=32
   [junit4]   2> 	delPolicy=org.apache.solr.core.IndexDeletionPolicyWrapper
   [junit4]   2> 	commit=null
   [junit4]   2> 	openMode=CREATE
   [junit4]   2> 	similarity=org.apache.lucene.search.similarities.DefaultSimilarity
   [junit4]   2> 	mergeScheduler=ConcurrentMergeScheduler: maxThreadCount=1, maxMergeCount=2, mergeThreadPriority=-1
   [junit4]   2> 	default WRITE_LOCK_TIMEOUT=1000
   [junit4]   2> 	writeLockTimeout=1000
   [junit4]   2> 	codec=Lucene410
   [junit4]   2> 	infoStream=org.apache.solr.update.LoggingInfoStream
   [junit4]   2> 	mergePolicy=[TieredMergePolicy: maxMergeAtOnce=10, maxMergeAtOnceExplicit=30, maxMergedSegmentMB=5120.0, floorSegmentMB=2.0, forceMergeDeletesPctAllowed=10.0, segmentsPerTier=10.0, maxCFSSegmentSizeMB=8.796093022207999E12, noCFSRatio=0.0
   [junit4]   2> 	indexerThreadPool=org.apache.lucene.index.DocumentsWriterPerThreadPool@583a1bd
   [junit4]   2> 	readerPooling=false
   [junit4]   2> 	perThreadHardLimitMB=1945
   [junit4]   2> 	useCompoundFile=false
   [junit4]   2> 	checkIntegrityAtMerge=false
   [junit4]   2> 	writer=org.apache.lucene.util.SetOnce@4ef821f
   [junit4]   2> 	
   [junit4]   2> 22901 T91 oasu.LoggingInfoStream.message [IW][coreLoadExecutor-72-thread-1]: now flush at close
   [junit4]   2> 22901 T91 oasu.LoggingInfoStream.message [IW][coreLoadExecutor-72-thread-1]:   start flush: applyAllDeletes=true
   [junit4]   2> 22901 T91 oasu.LoggingInfoStream.message [IW][coreLoadExecutor-72-thread-1]:   index before flush 
   [junit4]   2> 22901 T91 oasu.LoggingInfoStream.message [DW][coreLoadExecutor-72-thread-1]: startFullFlush
   [junit4]   2> 22901 T91 oasu.LoggingInfoStream.message [DW][coreLoadExecutor-72-thread-1]: anyChanges? numDocsInRam=0 deletes=false hasTickets:false pendingChangesInFullFlush: false
   [junit4]   2> 22902 T91 oasu.LoggingInfoStream.message [DW][coreLoadExecutor-72-thread-1]: coreLoadExecutor-72-thread-1 finishFullFlush success=true
   [junit4]   2> 22902 T91 oasu.LoggingInfoStream.message [IW][coreLoadExecutor-72-thread-1]: apply all deletes during flush
   [junit4]   2> 22902 T91 oasu.LoggingInfoStream.message [BD][coreLoadExecutor-72-thread-1]: prune sis=null:  minGen=9223372036854775807 packetCount=0
   [junit4]   2> 22902 T91 oasu.LoggingInfoStream.message [CMS][coreLoadExecutor-72-thread-1]: now merge
   [junit4]   2> 22902 T91 oasu.LoggingInfoStream.message [CMS][coreLoadExecutor-72-thread-1]:   index: 
   [junit4]   2> 22903 T91 oasu.LoggingInfoStream.message [CMS][coreLoadExecutor-72-thread-1]:   no more merges pending; now return
   [junit4]   2> 22903 T91 oasu.LoggingInfoStream.message [IW][coreLoadExecutor-72-thread-1]: waitForMerges
   [junit4]   2> 22903 T91 oasu.LoggingInfoStream.message [IW][coreLoadExecutor-72-thread-1]: waitForMerges done
   [junit4]   2> 22903 T91 oasu.LoggingInfoStream.message [IW][coreLoadExecutor-72-thread-1]: commit: start
   [junit4]   2> 22903 T91 oasu.LoggingInfoStream.message [IW][coreLoadExecutor-72-thread-1]: commit: enter lock
   [junit4]   2> 22903 T91 oasu.LoggingInfoStream.message [IW][coreLoadExecutor-72-thread-1]: commit: now prepare
   [junit4]   2> 22904 T91 oasu.LoggingInfoStream.message [IW][coreLoadExecutor-72-thread-1]: prepareCommit: flush
   [junit4]   2> 22904 T91 oasu.LoggingInfoStream.message [IW][coreLoadExecutor-72-thread-1]:   index before flush 
   [junit4]   2> 22904 T91 oasu.LoggingInfoStream.message [DW][coreLoadExecutor-72-thread-1]: startFullFlush
   [junit4]   2> 22904 T91 oasu.LoggingInfoStream.message [DW][coreLoadExecutor-72-thread-1]: anyChanges? numDocsInRam=0 deletes=false hasTickets:false pendingChangesInFullFlush: false
   [junit4]   2> 22904 T91 oasu.LoggingInfoStream.message [IW][coreLoadExecutor-72-thread-1]: apply all deletes during flush
   [junit4]   2> 22905 T91 oasu.LoggingInfoStream.message [BD][coreLoadExecutor-72-thread-1]: prune sis=null:  minGen=9223372036854775807 packetCount=0
   [junit4]   2> 22905 T91 oasu.LoggingInfoStream.message [DW][coreLoadExecutor-72-thread-1]: coreLoadExecutor-72-thread-1 finishFullFlush success=true
   [junit4]   2> 22905 T91 oasu.LoggingInfoStream.message [IW][coreLoadExecutor-72-thread-1]: startCommit(): start
   [junit4]   2> 22905 T91 oasu.LoggingInfoStream.message [IW][coreLoadExecutor-72-thread-1]: startCommit index= changeCount=1
   [junit4]   2> 22905 T91 oasu.LoggingInfoStream.message [IW][coreLoadExecutor-72-thread-1]: done all syncs: []
   [junit4]   2> 22906 T91 oasu.LoggingInfoStream.message [IW][coreLoadExecutor-72-thread-1]: commit: pendingCommit != null
   [junit4]   2> 22906 T91 oasu.LoggingInfoStream.message [IW][coreLoadExecutor-72-thread-1]: commit: wrote segments file "segments_1"
   [junit4]   2> 22906 T91 oasu.LoggingInfoStream.message [IFD][coreLoadExecutor-72-thread-1]: now checkpoint "" [0 segments ; isCommit = true]
   [junit4]   2> 22906 T91 oasc.SolrDeletionPolicy.onCommit SolrDeletionPolicy.onCommit: commits: num=1
   [junit4]   2> 		commit{dir=MockDirectoryWrapper(RAMDirectory@52e7a6e lockFactory=NativeFSLockFactory@/mnt/ssd/jenkins/workspace/Lucene-Solr-4.x-Linux/solr/build/solr-solrj/test/J1/temp/solr.client.solrj.embedded.SolrExampleStreamingTest-69078053919685D4-001/tempDir-001/index),segFN=segments_1,generation=1}
   [junit4]   2> 22906 T91 oasc.SolrDeletionPolicy.updateCommits newest commit generation = 1
   [junit4]   2> 22907 T91 oasu.LoggingInfoStream.message [IFD][coreLoadExecutor-72-thread-1]: 0 msec to checkpoint
   [junit4]   2> 22907 T91 oasu.LoggingInfoStream.message [IW][coreLoadExecutor-72-thread-1]: commit: took 3.2 msec
   [junit4]   2> 22907 T91 oasu.LoggingInfoStream.message [IW][coreLoadExecutor-72-thread-1]: commit: done
   [junit4]   2> 22907 T91 oasu.LoggingInfoStream.message [IW][coreLoadExecutor-72-thread-1]: rollback
   [junit4]   2> 22907 T91 oasu.LoggingInfoStream.message [IW][coreLoadExecutor-72-thread-1]: all running merges have aborted
   [junit4]   2> 22908 T91 oasu.LoggingInfoStream.message [IW][coreLoadExecutor-72-thread-1]: rollback: done finish merges
   [junit4]   2> 22908 T91 oasu.LoggingInfoStream.message [DW][coreLoadExecutor-72-thread-1]: abort
   [junit4]   2> 22908 T91 oasu.LoggingInfoStream.message [DW][coreLoadExecutor-72-thread-1]: done abort; abortedFiles=[] success=true
   [junit4]   2> 22908 T91 oasu.LoggingInfoStream.message [IW][coreLoadExecutor-72-thread-1]: rollback: infos=
   [junit4]   2> 22908 T91 oasu.LoggingInfoStream.message [IFD][coreLoadExecutor-72-thread-1]: now checkpoint "" [0 segments ; isCommit = false]
   [junit4]   2> 22908 T91 oasu.LoggingInfoStream.message [IFD][coreLoadExecutor-72-thread-1]: 0 msec to checkpoint
   [junit4]   2> 22909 T91 oasc.SolrCore.initWriters created json: solr.JSONResponseWriter
   [junit4]   2> 22909 T91 oasc.SolrCore.initWriters adding lazy queryResponseWriter: solr.VelocityResponseWriter
   [junit4]   2> 22909 T91 oasc.SolrCore.initWriters created velocity: solr.VelocityResponseWriter
   [junit4]   2> 22909 T91 oasc.SolrCore.initWriters created xslt: solr.XSLTResponseWriter
   [junit4]   2> 22909 T91 oasr.XSLTResponseWriter.init xsltCacheLifetimeSeconds=5
   [junit4]   2> 22910 T91 oasc.SolrCore.loadUpdateProcessorChains no updateRequestProcessorChain defined as default, creating implicit default
   [junit4]   2> 22911 T91 oasc.RequestHandlers.initHandlersFromConfig created /update: org.apache.solr.handler.UpdateRequestHandler
   [junit4]   2> 22911 T91 oasc.RequestHandlers.initHandlersFromConfig created /update/json: org.apache.solr.handler.UpdateRequestHandler
   [junit4]   2> 22911 T91 oasc.RequestHandlers.initHandlersFromConfig created /update/csv: org.apache.solr.handler.UpdateRequestHandler
   [junit4]   2> 22911 T91 oasc.RequestHandlers.initHandlersFromConfig created /update/json/docs: org.apache.solr.handler.UpdateRequestHandler
   [junit4]   2> 22912 T91 oasc.RequestHandlers.initHandlersFromConfig created /select: solr.SearchHandler
   [junit4]   2> 22912 T91 oasc.RequestHandlers.initHandlersFromConfig created /query: solr.SearchHandler
   [junit4]   2> 22912 T91 oasc.RequestHandlers.initHandlersFromConfig created /get: solr.RealTimeGetHandler
   [junit4]   2> 22913 T91 oasc.RequestHandlers.initHandlersFromConfig created /export: solr.SearchHandler
   [junit4]   2> 22913 T91 oasc.RequestHandlers.initHandlersFromConfig created /browse: solr.SearchHandler
   [junit4]   2> 22913 T91 oasc.RequestHandlers.initHandlersFromConfig WARN Multiple requestHandler registered to the same name: /update ignoring: org.apache.solr.handler.UpdateRequestHandler
   [junit4]   2> 22913 T91 oasc.RequestHandlers.initHandlersFromConfig created /update: solr.UpdateRequestHandler
   [junit4]   2> 22913 T91 oasc.RequestHandlers.initHandlersFromConfig adding lazy requestHandler: solr.extraction.ExtractingRequestHandler
   [junit4]   2> 22913 T91 oasc.RequestHandlers.initHandlersFromConfig created /update/extract: solr.extraction.ExtractingRequestHandler
   [junit4]   2> 22914 T91 oasc.RequestHandlers.initHandlersFromConfig adding lazy requestHandler: solr.FieldAnalysisRequestHandler
   [junit4]   2> 22914 T91 oasc.RequestHandlers.initHandlersFromConfig created /analysis/field: solr.FieldAnalysisRequestHandler
   [junit4]   2> 22914 T91 oasc.RequestHandlers.initHandlersFromConfig adding lazy requestHandler: solr.DocumentAnalysisRequestHandler
   [junit4]   2> 22914 T91 oasc.RequestHandlers.initHandlersFromConfig created /analysis/document: solr.DocumentAnalysisRequestHandler
   [junit4]   2> 22914 T91 oasc.RequestHandlers.initHandlersFromConfig created /admin/: solr.admin.AdminHandlers
   [junit4]   2> 22915 T91 oasc.RequestHandlers.initHandlersFromConfig created /admin/ping: solr.PingRequestHandler
   [junit4]   2> 22915 T91 oasc.RequestHandlers.initHandlersFromConfig created /debug/dump: solr.DumpRequestHandler
   [junit4]   2> 22915 T91 oasc.RequestHandlers.initHandlersFromConfig created /replication: solr.ReplicationHandler
   [junit4]   2> 22915 T91 oasc.RequestHandlers.initHandlersFromConfig adding lazy requestHandler: solr.SearchHandler
   [junit4]   2> 22915 T91 oasc.RequestHandlers.initHandlersFromConfig created /spell: solr.SearchHandler
   [junit4]   2> 22916 T91 oasc.RequestHandlers.initHandlersFromConfig adding lazy requestHandler: solr.SearchHandler
   [junit4]   2> 22916 T91 oasc.RequestHandlers.initHandlersFromConfig created /suggest: solr.SearchHandler
   [junit4]   2> 22916 T91 oasc.RequestHandlers.initHandlersFromConfig adding lazy requestHandler: solr.SearchHandler
   [junit4]   2> 22916 T91 oasc.RequestHandlers.initHandlersFromConfig created /tvrh: solr.SearchHandler
   [junit4]   2> 22916 T91 oasc.RequestHandlers.initHandlersFromConfig adding lazy requestHandler: solr.SearchHandler
   [junit4]   2> 22916 T91 oasc.RequestHandlers.initHandlersFromConfig created /terms: solr.SearchHandler
   [junit4]   2> 22917 T91 oasc.RequestHandlers.initHandlersFromConfig adding lazy requestHandler: solr.SearchHandler
   [junit4]   2> 22917 T91 oasc.RequestHandlers.initHandlersFromConfig created /elevate: solr.SearchHandler
   [junit4]   2> 22919 T91 oashl.XMLLoader.init xsltCacheLifetimeSeconds=60
   [junit4]   2> 22920 T91 oashl.XMLLoader.init xsltCacheLifetimeSeconds=60
   [junit4]   2> 22920 T91 oashl.XMLLoader.init xsltCacheLifetimeSeconds=60
   [junit4]   2> 22921 T91 oashl.XMLLoader.init xsltCacheLifetimeSeconds=60
   [junit4]   2> 22922 T91 oashl.XMLLoader.init xsltCacheLifetimeSeconds=60
   [junit4]   2> 22925 T91 oasu.CommitTracker.<init> Hard AutoCommit: if uncommited for 15000ms; 
   [junit4]   2> 22925 T91 oasu.CommitTracker.<init> Soft AutoCommit: disabled
   [junit4]   2> 22926 T91 oasu.LoggingInfoStream.message [IFD][coreLoadExecutor-72-thread-1]: init: current segments file is "segments_1"; deletionPolicy=org.apache.solr.core.IndexDeletionPolicyWrapper@6733fa82
   [junit4]   2> 22926 T91 oasu.LoggingInfoStream.message [IFD][coreLoadExecutor-72-thread-1]: init: load commit "segments_1"
   [junit4]   2> 22926 T91 oasc.SolrDeletionPolicy.onInit SolrDeletionPolicy.onInit: commits: num=1
   [junit4]   2> 		commit{dir=MockDirectoryWrapper(RAMDirectory@52e7a6e lockFactory=NativeFSLockFactory@/mnt/ssd/jenkins/workspace/Lucene-Solr-4.x-Linux/solr/build/solr-solrj/test/J1/temp/solr.client.solrj.embedded.SolrExampleStreamingTest-69078053919685D4-001/tempDir-001/index),segFN=segments_1,generation=1}
   [junit4]   2> 22926 T91 oasc.SolrDeletionPolicy.updateCommits newest commit generation = 1
   [junit4]   2> 22927 T91 oasu.LoggingInfoStream.message [IFD][coreLoadExecutor-72-thread-1]: now checkpoint "" [0 segments ; isCommit = false]
   [junit4]   2> 22927 T91 oasu.LoggingInfoStream.message [IFD][coreLoadExecutor-72-thread-1]: 0 msec to checkpoint
   [junit4]   2> 22927 T91 oasu.LoggingInfoStream.message [IW][coreLoadExecutor-72-thread-1]: init: create=false
   [junit4]   2> 22927 T91 oasu.LoggingInfoStream.message [IW][coreLoadExecutor-72-thread-1]: 
   [junit4]   2> 	dir=MockDirectoryWrapper(RAMDirectory@52e7a6e lockFactory=NativeFSLockFactory@/mnt/ssd/jenkins/workspace/Lucene-Solr-4.x-Linux/solr/build/solr-solrj/test/J1/temp/solr.client.solrj.embedded.SolrExampleStreamingTest-69078053919685D4-001/tempDir-001/index)
   [junit4]   2> 	index=
   [junit4]   2> 	version=4.11.0
   [junit4]   2> 	matchVersion=4.11.0
   [junit4]   2> 	analyzer=null
   [junit4]   2> 	ramBufferSizeMB=100.0
   [junit4]   2> 	maxBufferedDocs=-1
   [junit4]   2> 	maxBufferedDeleteTerms=-1
   [junit4]   2> 	mergedSegmentWarmer=null
   [junit4]   2> 	readerTermsIndexDivisor=1
   [junit4]   2> 	termIndexInterval=32
   [junit4]   2> 	delPolicy=org.apache.solr.core.IndexDeletionPolicyWrapper
   [junit4]   2> 	commit=null
   [junit4]   2> 	openMode=APPEND
   [junit4]   2> 	similarity=org.apache.lucene.search.similarities.DefaultSimilarity
   [junit4]   2> 	mergeScheduler=ConcurrentMergeScheduler: maxThreadCount=1, maxMergeCount=2, mergeThreadPriority=-1
   [junit4]   2> 	default WRITE_LOCK_TIMEOUT=1000
   [junit4]   2> 	writeLockTimeout=1000
   [junit4]   2> 	codec=Lucene410
   [junit4]   2> 	infoStream=org.apache.solr.update.LoggingInfoStream
   [junit4]   2> 	mergePolicy=[TieredMergePolicy: maxMergeAtOnce=10, maxMergeAtOnceExplicit=30, maxMergedSegmentMB=5120.0, floorSegmentMB=2.0, forceMergeDeletesPctAllowed=10.0, segmentsPerTier=10.0, maxCFSSegmentSizeMB=8.796093022207999E12, noCFSRatio=0.0
   [junit4]   2> 	indexerThreadPool=org.apache.lucene.index.DocumentsWriterPerThreadPool@1a13853b
   [junit4]   2> 	readerPooling=false
   [junit4]   2> 	perThreadHardLimitMB=1945
   [junit4]   2> 	useCompoundFile=false
   [junit4]   2> 	checkIntegrityAtMerge=false
   [junit4]   2> 	writer=org.apache.lucene.util.SetOnce@778ff1dc
   [junit4]   2> 	
   [junit4]   2> 22928 T91 oasu.LoggingInfoStream.message [IW][coreLoadExecutor-72-thread-1]: flush at getReader
   [junit4]   2> 22928 T91 oasu.LoggingInfoStream.message [DW][coreLoadExecutor-72-thread-1]: startFullFlush
   [junit4]   2> 22928 T91 oasu.LoggingInfoStream.message [DW][coreLoadExecutor-72-thread-1]: anyChanges? numDocsInRam=0 deletes=false hasTickets:false pendingChangesInFullFlush: false
   [junit4]   2> 22928 T91 oasu.LoggingInfoStream.message [IW][coreLoadExecutor-72-thread-1]: apply all deletes during flush
   [junit4]   2> 22928 T91 oasu.LoggingInfoStream.message [BD][coreLoadExecutor-72-thread-1]: prune sis=segments_1:  minGen=9223372036854775807 packetCount=0
   [junit4]   2> 22929 T91 oasu.LoggingInfoStream.message [IW][coreLoadExecutor-72-thread-1]: return reader version=1 reader=StandardDirectoryReader(segments_1:1:nrt)
   [junit4]   2> 22929 T91 oasu.LoggingInfoStream.message [DW][coreLoadExecutor-72-thread-1]: coreLoadExecutor-72-thread-1 finishFullFlush success=true
   [junit4]   2> 22929 T91 oasu.LoggingInfoStream.message [IW][coreLoadExecutor-72-thread-1]: getReader took 1 msec
   [junit4]   2> 22929 T91 oass.SolrIndexSearcher.<init> Opening Searcher@28f0a20e[collection1] main
   [junit4]   2> 22930 T91 oasr.ManagedResourceStorage.newStorageIO WARN Cannot write to config directory /mnt/ssd/jenkins/workspace/Lucene-Solr-4.x-Linux/solr/example/solr/collection1/conf; switching to use InMemory storage instead.
   [junit4]   2> 22930 T91 oasr.RestManager.init Initializing RestManager with initArgs: {}
   [junit4]   2> 22930 T91 oasr.ManagedResourceStorage.load Reading _rest_managed.json using InMemoryStorage
   [junit4]   2> 22931 T91 oasr.ManagedResource.reloadFromStorage WARN No stored data found for /rest/managed
   [junit4]   2> 22931 T91 oasr.ManagedResourceStorage$JsonStorage.store Saved JSON object to path _rest_managed.json using InMemoryStorage
   [junit4]   2> 22931 T91 oasr.RestManager.init Initializing 2 registered ManagedResources
   [junit4]   2> 22932 T91 oasr.ManagedResourceStorage.load Reading _schema_analysis_stopwords_english.json using InMemoryStorage
   [junit4]   2> 22932 T91 oasr.ManagedResource.reloadFromStorage WARN No stored data found for /schema/analysis/stopwords/english
   [junit4]   2> 22932 T91 oasr.ManagedResourceStorage$JsonStorage.store Saved JSON object to path _schema_analysis_stopwords_english.json using InMemoryStorage
   [junit4]   2> 22932 T91 oasrsa.ManagedWordSetResource.onManagedDataLoadedFromStorage Loaded 0 words for /schema/analysis/stopwords/english
   [junit4]   2> 22933 T91 oasr.ManagedResource.notifyObserversDuringInit Notified 1 observers of /schema/analysis/stopwords/english
   [junit4]   2> 22933 T91 oasr.ManagedResourceStorage.load Reading _schema_analysis_synonyms_english.json using InMemoryStorage
   [junit4]   2> 22933 T91 oasr.ManagedResource.reloadFromStorage WARN No stored data found for /schema/analysis/synonyms/english
   [junit4]   2> 22933 T91 oasrsa.ManagedSynonymFilterFactory$SynonymManager.onManagedDataLoadedFromStorage Loaded 0 synonym mappings for /schema/analysis/synonyms/english
   [junit4]   2> 22934 T91 oasr.ManagedResource.notifyObserversDuringInit Notified 1 observers of /schema/analysis/synonyms/english
   [junit4]   2> 22934 T91 oashc.SpellCheckComponent.inform Initializing spell checkers
   [junit4]   2> 22934 T91 oass.DirectSolrSpellChecker.init init: {name=default,field=text,classname=solr.DirectSolrSpellChecker,distanceMeasure=internal,accuracy=0.5,maxEdits=2,minPrefix=1,maxInspections=5,minQueryLength=4,maxQueryFrequency=0.01}
   [junit4]   2> 22935 T91 oashc.SpellCheckComponent.inform No queryConverter defined, using default converter
   [junit4]   2> 22935 T91 oashc.SuggestComponent.inform Initializing SuggestComponent
   [junit4]   2> 22935 T91 oasss.SolrSuggester.init init: {name=mySuggester,lookupImpl=FuzzyLookupFactory,dictionaryImpl=DocumentDictionaryFactory,field=cat,weightField=price,suggestAnalyzerFieldType=string}
   [junit4]   2> 22936 T91 oasss.SolrSuggester.init Dictionary loaded with params: {name=mySuggester,lookupImpl=FuzzyLookupFactory,dictionaryImpl=DocumentDictionaryFactory,field=cat,weightField=price,suggestAnalyzerFieldType=string}
   [junit4]   2> 22936 T91 oashc.QueryElevationComponent.inform Loading QueryElevation from: /mnt/ssd/jenkins/workspace/Lucene-Solr-4.x-Linux/solr/example/solr/collection1/conf/elevate.xml
   [junit4]   2> 22949 T91 oash.ReplicationHandler.inform Commits will be reserved for  10000
   [junit4]   2> 22950 T92 oasc.QuerySenderListener.newSearcher QuerySenderListener sending requests to Searcher@28f0a20e[collection1] main{StandardDirectoryReader(segments_1:1:nrt)}
   [junit4]   2> 22950 T91 oasc.CoreContainer.registerCore registering core: collection1
   [junit4]   2> 22950 T81 oass.SolrDispatchFilter.init user.dir=/mnt/ssd/jenkins/workspace/Lucene-Solr-4.x-Linux/solr/build/solr-solrj/test/J1
   [junit4]   2> 22951 T81 oass.SolrDispatchFilter.init SolrDispatchFilter.init() done
   [junit4]   2> 22951 T81 oas.SolrJettyTestBase.createJetty Jetty Assigned Port#48491
   [junit4]   2> ASYNC  NEW_CORE C21 name=collection1 org.apache.solr.core.SolrCore@5a8eab0
   [junit4]   2> 22951 T92 C21 oasc.SolrCore.execute [collection1] webapp=null path=null params={distrib=false&q=static+firstSearcher+warming+in+solrconfig.xml&event=firstSearcher} hits=0 status=0 QTime=1 
   [junit4]   2> 22951 T92 oasc.QuerySenderListener.newSearcher QuerySenderListener done.
   [junit4]   2> 22952 T92 oashc.SpellCheckComponent$SpellCheckerListener.newSearcher Loading spell index for spellchecker: default
   [junit4]   2> 22952 T92 oashc.SpellCheckComponent$SpellCheckerListener.newSearcher Loading spell index for spellchecker: wordbreak
   [junit4]   2> 22952 T92 oashc.SuggestComponent$SuggesterListener.newSearcher Loading suggester index for: mySuggester
   [junit4]   2> 22952 T92 oasss.SolrSuggester.reload reload()
   [junit4]   2> 22952 T92 oasss.SolrSuggester.build build()
   [junit4]   2> 22954 T92 oasc.SolrCore.registerSearcher [collection1] Registered new searcher Searcher@28f0a20e[collection1] main{StandardDirectoryReader(segments_1:1:nrt)}
   [junit4]   2> 22959 T81 oas.SolrTestCaseJ4.setUp ###Starting testUnicode
   [junit4]   2> 22964 T89 C21 oasu.LoggingInfoStream.message [DW][qtp1183575776-89]: anyChanges? numDocsInRam=0 deletes=true hasTickets:false pendingChangesInFullFlush: false
   [junit4]   2> 22964 T89 C21 oasu.LoggingInfoStream.message [IW][qtp1183575776-89]: nrtIsCurrent: infoVersion matches: true; DW changes: true; BD changes: false
   [junit4]   2> 22964 T89 C21 oasu.LoggingInfoStream.message [DW][qtp1183575776-89]: anyChanges? numDocsInRam=0 deletes=true hasTickets:false pendingChangesInFullFlush: false
   [junit4]   2> 22965 T89 C21 oasu.LoggingInfoStream.message [IW][qtp1183575776-89]: flush at getReader
   [junit4]   2> 22965 T89 C21 oasu.LoggingInfoStream.message [DW][qtp1183575776-89]: startFullFlush
   [junit4]   2> 22965 T89 C21 oasu.LoggingInfoStream.message [DW][qtp1183575776-89]: anyChanges? numDocsInRam=0 deletes=true hasTickets:false pendingChangesInFullFlush: false
   [junit4]   2> 22966 T89 C21 oasu.LoggingInfoStream.message [DW][qtp1183575776-89]: qtp1183575776-89: flush naked frozen global deletes
   [junit4]   2> 22966 T89 C21 oasu.LoggingInfoStream.message [BD][qtp1183575776-89]: push deletes  1 deleted queries bytesUsed=64 delGen=2 packetCount=1 totBytesUsed=64
   [junit4]   2> 22967 T89 C21 oasu.LoggingInfoStream.message [DW][qtp1183575776-89]: flush: push buffered updates:  1 deleted queries bytesUsed=64
   [junit4]   2> 22967 T89 C21 oasu.LoggingInfoStream.message [IW][qtp1183575776-89]: apply all deletes during flush
   [junit4]   2> 22967 T89 C21 oasu.LoggingInfoStream.message [BD][qtp1183575776-89]: prune sis=segments_1:  minGen=9223372036854775807 packetCount=1
   [junit4]   2> 22968 T89 C21 oasu.LoggingInfoStream.message [BD][qtp1183575776-89]: pruneDeletes: prune 1 packets; 0 packets remain
   [junit4]   2> 22968 T89 C21 oasu.LoggingInfoStream.message [IW][qtp1183575776-89]: return reader version=1 reader=StandardDirectoryReader(segments_1:1:nrt)
   [junit4]   2> 22968 T89 C21 oasu.LoggingInfoStream.message [DW][qtp1183575776-89]: qtp1183575776-89 finishFullFlush success=true
   [junit4]   2> 22969 T89 C21 oasu.LoggingInfoStream.message [IW][qtp1183575776-89]: getReader took 4 msec
   [junit4]   2> 22969 T89 C21 oasup.LogUpdateProcessor.finish [collection1] webapp=/solr path=/update params={version=2.2&wt=xml} {deleteByQuery=*:* (-1478170649979518976)} 0 7
   [junit4]   2> 23234 T90 C21 oasup.LogUpdateProcessor.finish [collection1] webapp=/solr path=/update params={version=2.2&wt=xml} {add=[0 (1478170650001539072), 1 (1478170650003636224), 2 (1478170650003636225), 3 (1478170650003636226), 4 (1478170650004684800), 5 (1478170650004684801), 6 (1478170650004684802), 7 (1478170650004684803), 8 (1478170650005733376), 9 (1478170650005733377), ... (30 adds)]} 0 251
   [junit4]   2> 23238 T87 C21 oasu.DirectUpdateHandler2.commit start commit{,optimize=false,openSearcher=true,waitSearcher=true,expungeDeletes=false,softCommit=false,prepareCommit=false}
   [junit4]   2> 23239 T87 C21 oasu.LoggingInfoStream.message [IW][qtp1183575776-87]: commit: start
   [junit4]   2> 23240 T87 C21 oasu.LoggingInfoStream.message [IW][qtp1183575776-87]: commit: enter lock
   [junit4]   2> 23240 T87 C21 oasu.LoggingInfoStream.message [IW][qtp1183575776-87]: commit: now prepare
   [junit4]   2> 23241 T87 C21 oasu.LoggingInfoStream.message [IW][qtp1183575776-87]: prepareCommit: flush
   [junit4]   2> 23241 T87 C21 oasu.LoggingInfoStream.message [IW][qtp1183575776-87]:   index before flush 
   [junit4]   2> 23242 T87 C21 oasu.LoggingInfoStream.message [DW][qtp1183575776-87]: startFullFlush
   [junit4]   2> 23242 T87 C21 oasu.LoggingInfoStream.message [DW][qtp1183575776-87]: anyChanges? numDocsInRam=30 deletes=true hasTickets:false pendingChangesInFullFlush: false
   [junit4]   2> 23243 T87 C21 oasu.LoggingInfoStream.message [DWFC][qtp1183575776-87]: addFlushableState DocumentsWriterPerThread [pendingDeletes=gen=0 29 deleted terms (unique count=29) bytesUsed=4805, segment=_0, aborting=false, numDocsInRAM=30, deleteQueue=DWDQ: [ generation: 2 ]]
   [junit4]   2> 23244 T87 C21 oasu.LoggingInfoStream.message [DWPT][qtp1183575776-87]: flush postings as segment _0 numDocs=30
   [junit4]   2> 23247 T87 C21 oasu.LoggingInfoStream.message [DWPT][qtp1183575776-87]: new segment has 0 deleted docs
   [junit4]   2> 23248 T87 C21 oasu.LoggingInfoStream.message [DWPT][qtp1183575776-87]: new segment has no vectors; no norms; no docValues; no prox; no freqs
   [junit4]   2> 23249 T87 C21 oasu.LoggingInfoStream.message [DWPT][qtp1183575776-87]: flushedFiles=[_0.fdx, _0_Lucene41_0.doc, _0.fnm, _0.fdt, _0_Lucene41_0.tim, _0_Lucene41_0.tip]
   [junit4]   2> 23250 T87 C21 oasu.LoggingInfoStream.message [DWPT][qtp1183575776-87]: flushed codec=Lucene410
   [junit4]   2> 23250 T87 C21 oasu.LoggingInfoStream.message [DWPT][qtp1183575776-87]: flushed: segment=_0 ramUsed=0.07 MB newFlushedSize(includes docstores)=0.003 MB docs/MB=9,475.084
   [junit4]   2> 23251 T87 C21 oasu.LoggingInfoStream.message [DW][qtp1183575776-87]: publishFlushedSegment seg-private updates=null
   [junit4]   2> 23252 T87 C21 oasu.LoggingInfoStream.message [IW][qtp1183575776-87]: publishFlushedSegment
   [junit4]   2> 23252 T87 C21 oasu.LoggingInfoStream.message [BD][qtp1183575776-87]: push deletes  30 deleted terms (unique count=30) bytesUsed=1056 delGen=4 packetCount=1 totBytesUsed=1056
   [junit4]   2> 23253 T87 C21 oasu.LoggingInfoStream.message [IW][qtp1183575776-87]: publish sets newSegment delGen=5 seg=_0(4.11.0):C30
   [junit4]   2> 23254 T87 C21 oasu.LoggingInfoStream.message [IFD][qtp1183575776-87]: now checkpoint "_0(4.11.0):C30" [1 segments ; isCommit = false]
   [junit4]   2> 23254 T87 C21 oasu.LoggingInfoStream.message [IFD][qtp1183575776-87]: 0 msec to checkpoint
   [junit4]   2> 23255 T87 C21 oasu.LoggingInfoStream.message [IW][qtp1183575776-87]: apply all deletes during flush
   [junit4]   2> 23256 T87 C21 oasu.LoggingInfoStream.message [BD][qtp1183575776-87]: applyDeletes: infos=[_0(4.11.0):C30] packetCount=1
   [junit4]   2> 23257 T87 C21 oasu.LoggingInfoStream.message [BD][qtp1183575776-87]: applyDeletes took 1 msec
   [junit4]   2> 23257 T87 C21 oasu.LoggingInfoStream.message [BD][qtp1183575776-87]: prune sis=segments_1: _0(4.11.0):C30 minGen=6 packetCount=1
   [junit4]   2> 23258 T87 C21 oasu.LoggingInfoStream.message [BD][qtp1183575776-87]: pruneDeletes: prune 1 packets; 0 packets remain
   [junit4]   2> 23258 T87 C21 oasu.LoggingInfoStream.message [DW][qtp1183575776-87]: qtp1183575776-87 finishFullFlush success=true
   [junit4]   2> 23259 T87 C21 oasu.LoggingInfoStream.message [TMP][qtp1183575776-87]: findMerges: 1 segments
   [junit4]   2> 23260 T87 C21 oasu.LoggingInfoStream.message [TMP][qtp1183575776-87]:   seg=_0(4.11.0):C30 size=0.003 MB [floored]
   [junit4]   2> 23260 T87 C21 oasu.LoggingInfoStream.message [TMP][qtp1183575776-87]:   allowedSegmentCount=1 vs count=1 (eligible count=1) tooBigCount=0
   [junit4]   2> 23261 T87 C21 oasu.LoggingInfoStream.message [CMS][qtp1183575776-87]: now merge
   [junit4]   2> 23262 T87 C21 oasu.LoggingInfoStream.message [CMS][qtp1183575776-87]:   index: _0(4.11.0):C30
   [junit4]   2> 23262 T87 C21 oasu.LoggingInfoStream.message [CMS][qtp1183575776-87]:   no more merges pending; now return
   [junit4]   2> 23263 T87 C21 oasu.LoggingInfoStream.message [IW][qtp1183575776-87]: startCommit(): start
   [junit4]   2> 23263 T87 C21 oasu.LoggingInfoStream.message [IW][qtp1183575776-87]: startCommit index=_0(4.11.0):C30 changeCount=3
   [junit4]   2> 23264 T87 C21 oasu.LoggingInfoStream.message [IW][qtp1183575776-87]: done all syncs: [_0.fdx, _0_Lucene41_0.doc, _0.si, _0.fnm, _0.fdt, _0_Lucene41_0.tim, _0_Lucene41_0.tip]
   [junit4]   2> 23265 T87 C21 oasu.LoggingInfoStream.message [IW][qtp1183575776-87]: commit: pendingCommit != null
   [junit4]   2> 23266 T87 C21 oasu.LoggingInfoStream.message [IW][qtp1183575776-87]: commit: wrote segments file "segments_2"
   [junit4]   2> 23267 T87 C21 oasu.LoggingInfoStream.message [IFD][qtp1183575776-87]: now checkpoint "_0(4.11.0):C30" [1 segments ; isCommit = true]
   [junit4]   2> 23267 T87 C21 oasc.SolrDeletionPolicy.onCommit SolrDeletionPolicy.onCommit: commits: num=2
   [junit4]   2> 		commit{dir=MockDirectoryWrapper(RAMDirectory@52e7a6e lockFactory=NativeFSLockFactory@/mnt/ssd/jenkins/workspace/Lucene-Solr-4.x-Linux/solr/build/solr-solrj/test/J1/temp/solr.client.solrj.embedded.SolrExampleStreamingTest-69078053919685D4-001/tempDir-001/index),segFN=segments_1,generation=1}
   [junit4]   2> 		commit{dir=MockDirectoryWrapper(RAMDirectory@52e7a6e lockFactory=NativeFSLockFactory@/mnt/ssd/jenkins/workspace/Lucene-Solr-4.x-Linux/solr/build/solr-solrj/test/J1/temp/solr.client.solrj.embedded.SolrExampleStreamingTest-69078053919685D4-001/tempDir-001/index),segFN=segments_2,generation=2}
   [junit4]   2> 23270 T87 C21 oasc.SolrDeletionPolicy.updateCommits newest commit generation = 2
   [junit4]   2> 23270 T87 C21 oasu.LoggingInfoStream.message [IFD][qtp1183575776-87]: deleteCommits: now decRef commit "segments_1"
   [junit4]   2> 23271 T87 C21 oasu.LoggingInfoStream.message [IFD][qtp1183575776-87]: delete "segments_1"
   [junit4]   2> 23271 T87 C21 oasu.LoggingInfoStream.message [IFD][qtp1183575776-87]: 4 msec to checkpoint
   [junit4]   2> 23271 T87 C21 oasu.LoggingInfoStream.message [IW][qtp1183575776-87]: commit: took 30.4 msec
   [junit4]   2> 23271 T87 C21 oasu.LoggingInfoStream.message [IW][qtp1183575776-87]: commit: done
   [junit4]   2> 23272 T87 C21 oasu.LoggingInfoStream.message [DW][qtp1183575776-87]: anyChanges? numDocsInRam=0 deletes=false hasTickets:false pendingChangesInFullFlush: false
   [junit4]   2> 23272 T87 C21 oasu.LoggingInfoStream.message [IW][qtp1183575776-87]: nrtIsCurrent: infoVersion matches: false; DW changes: false; BD changes: false
   [junit4]   2> 23272 T87 C21 oasu.LoggingInfoStream.message [IW][qtp1183575776-87]: flush at getReader
   [junit4]   2> 23273 T87 C21 oasu.LoggingInfoStream.message [DW][qtp1183575776-87]: startFullFlush
   [junit4]   2> 23273 T87 C21 oasu.LoggingInfoStream.message [DW][qtp1183575776-87]: anyChanges? numDocsInRam=0 deletes=false hasTickets:false pendingChangesInFullFlush: false
   [junit4]   2> 23273 T87 C21 oasu.LoggingInfoStream.message [IW][qtp1183575776-87]: apply all deletes during flush
   [junit4]   2> 23273 T87 C21 oasu.LoggingInfoStream.message [BD][qtp1183575776-87]: applyDeletes: no deletes; skipping
   [junit4]   2> 23274 T87 C21 oasu.LoggingInfoStream.message [BD][qtp1183575776-87]: prune sis=segments_2: _0(4.11.0):C30 minGen=6 packetCount=0
   [junit4]   2> 23326 T87 C21 oasu.LoggingInfoStream.message [IW][qtp1183575776-87]: return reader version=3 reader=StandardDirectoryReader(segments_2:3:nrt _0(4.11.0):C30)
   [junit4]   2> 23326 T87 C21 oasu.LoggingInfoStream.message [DW][qtp1183575776-87]: qtp1183575776-87 finishFullFlush success=true
   [junit4]   2> 23327 T87 C21 oasu.LoggingInfoStream.message [IW][qtp1183575776-87]: getReader took 55 msec
   [junit4]   2> 23327 T87 C21 oass.SolrIndexSearcher.<init> Opening Searcher@265f2c44[collection1] main
   [junit4]   2> 23328 T87 C21 oasu.DirectUpdateHandler2.commit end_commit_flush
   [junit4]   2> 23328 T92 oasc.QuerySenderListener.newSearcher QuerySenderListener sending requests to Searcher@265f2c44[collection1] main{StandardDirectoryReader(segments_2:3:nrt _0(4.11.0):C30)}
   [junit4]   2> 23329 T92 oasc.QuerySenderListener.newSearcher QuerySenderListener done.
   [junit4]   2> 23330 T92 oasc.SolrCore.registerSearcher [collection1] Registered new searcher Searcher@265f2c44[collection1] main{StandardDirectoryReader(segments_2:3:nrt _0(4.11.0):C30)}
   [junit4]   2> 23330 T87 C21 oasup.LogUpdateProcessor.finish [collection1] webapp=/solr path=/update params={version=2.2&wt=xml&waitSearcher=true&commit=true&softCommit=false} {commit=} 0 92
   [junit4]   2> 23340 T89 C21 oasc.SolrCore.execute [collection1] webapp=/solr path=/select params={version=2.2&wt=xml&q=*:*&rows=30} hits=30 status=0 QTime=0 
   [junit4]   2> 23356 T88 C21 oasu.LoggingInfoStream.message [DW][qtp1183575776-88]: anyChanges? numDocsInRam=0 deletes=true hasTickets:false pendingChangesInFullFlush: false
   [junit4]   2> ASYNC  NEW_CORE C22 name=collection1 org.apache.solr.core.SolrCore@5a8eab0
   [junit4]   2> 23368 T88 C22 oasu.LoggingInfoStream.message [IW][qtp1183575776-88]: nrtIsCurrent: infoVersion matches: true; DW changes: true; BD changes: false
   [junit4]   2> 23369 T88 C22 oasu.LoggingInfoStream.message [DW][qtp1183575776-88]: anyChanges? numDocsInRam=0 deletes=true hasTickets:false pendingChangesInFullFlush: false
   [junit4]   2> 23369 T88 C22 oasu.LoggingInfoStream.message [IW][qtp1183575776-88]: flush at getReader
   [junit4]   2> 23370 T88 C22 oasu.LoggingInfoStream.message [DW][qtp1183575776-88]: startFullFlush
   [junit4]   2> 23370 T88 C22 oasu.LoggingInfoStream.message [DW][qtp1183575776-88]: anyChanges? numDocsInRam=0 deletes=true hasTickets:false pendingChangesInFullFlush: false
   [junit4]   2> 23371 T88 C22 oasu.LoggingInfoStream.message [DW][qtp1183575776-88]: qtp1183575776-88: flush naked frozen global deletes
   [junit4]   2> 23372 T88 C22 oasu.LoggingInfoStream.message [BD][qtp1183575776-88]: push deletes  1 deleted queries bytesUsed=64 delGen=8 packetCount=1 totBytesUsed=64
   [junit4]   2> 23373 T88 C22 oasu.LoggingInfoStream.message [DW][qtp1183575776-88]: flush: push buffered updates:  1 deleted queries bytesUsed=64
   [junit4]   2> 23374 T88 C22 oasu.LoggingInfoStream.message [IW][qtp1183575776-88]: apply all deletes during flush
   [junit4]   2> 23374 T88 C22 oasu.LoggingInfoStream.message [BD][qtp1183575776-88]: applyDeletes: infos=[_0(4.11.0):C30] packetCount=1
   [junit4]   2> 23376 T88 C22 oasu.LoggingInfoStream.message [BD][qtp1183575776-88]: seg=_0(4.11.0):C30 segGen=6 coalesced deletes=[CoalescedUpdates(termSets=1,queries=1,numericDVUpdates=0,binaryDVUpdates=0)] newDelCount=30 100% deleted
   [junit4]   2> 23377 T88 C22 oasu.LoggingInfoStream.message [BD][qtp1183575776-88]: applyDeletes took 3 msec
   [junit4]   2> 23378 T88 C22 oasu.LoggingInfoStream.message [IFD][qtp1183575776-88]: now checkpoint "_0(4.11.0):C30/30" [1 segments ; isCommit = false]
   [junit4]   2> 23378 T88 C22 oasu.LoggingInfoStream.message [IFD][qtp1183575776-88]: 0 msec to checkpoint
   [junit4]   2> 23379 T88 C22 oasu.LoggingInfoStream.message [IW][qtp1183575776-88]: drop 100% deleted segments: _0(4.11.0):C30/30
   [junit4]   2> 23380 T88 C22 oasu.LoggingInfoStream.message [IFD][qtp1183575776-88]: now checkpoint "" [0 segments ; isCommit = false]
   [junit4]   2> 23380 T88 C22 oasu.LoggingInfoStream.message [IFD][qtp1183575776-88]: 0 msec to checkpoint
   [junit4]   2> 23381 T88 C22 oasu.LoggingInfoStream.message [BD][qtp1183575776-88]: prune sis=segments_2:  minGen=9223372036854775807 packetCount=1
   [junit4]   2> 23381 T88 C22 oasu.LoggingInfoStream.message [BD][qtp1183575776-88]: pruneDeletes: prune 1 packets; 0 packets remain
   [junit4]   2> 23382 T88 C22 oasu.LoggingInfoStream.message [IW][qtp1183575776-88]: return reader version=5 reader=StandardDirectoryReader(segments_2:5:nrt)
   [junit4]   2> 23382 T88 C22 oasu.LoggingInfoStream.message [DW][qtp1183575776-88]: qtp1183575776-88 finishFullFlush success=true
   [junit4]   2> 23383 T88 C22 oasu.LoggingInfoStream.message [IW][qtp1183575776-88]: getReader took 14 msec
   [junit4]   2> 23383 T88 C22 oass.SolrIndexSearcher.<init> Opening Searcher@21fd31fd[collection1] realtime
   [junit4]   2> 23384 T88 C22 oasup.LogUpdateProcessor.finish [collection1] webapp=/solr path=/update params={version=2.2&wt=xml} {deleteByQuery=*:* (-1478170650390560768)} 0 29
   [junit4]   2> 23639 T90 C22 oasup.LogUpdateProcessor.finish [collection1] webapp=/solr path=/update params={version=2.2&wt=xml} {add=[0 (1478170650426212352), 1 (1478170650427260928), 2 (1478170650428309504), 3 (1478170650428309505), 4 (1478170650428309506), 5 (1478170650428309507), 6 (1478170650428309508)]} 0 251
   [junit4]   2> 23643 T88 C22 oasu.DirectUpdateHandler2.commit start commit{,optimize=false,openSearcher=true,waitSearcher=true,expungeDeletes=false,softCommit=false,prepareCommit=false}
   [junit4]   2> 23644 T88 C22 oasu.LoggingInfoStream.message [IW][qtp1183575776-88]: commit: start
   [junit4]   2> 23644 T88 C22 oasu.LoggingInfoStream.message [IW][qtp1183575776-88]: commit: enter lock
   [junit4]   2> 23645 T88 C22 oasu.LoggingInfoStream.message [IW][qtp1183575776-88]: commit: now prepare
   [junit4]   2> 23645 T88 C22 oasu.LoggingInfoStream.message [IW][qtp1183575776-88]: prepareCommit: flush
   [junit4]   2> 23646 T88 C22 oasu.LoggingInfoStream.message [IW][qtp1183575776-88]:   index before flush 
   [junit4]   2> 23646 T88 C22 oasu.LoggingInfoStream.message [DW][qtp1183575776-88]: startFullFlush
   [junit4]   2> 23647 T88 C22 oasu.LoggingInfoStream.message [DW][qtp1183575776-88]: anyChanges? numDocsInRam=7 deletes=true hasTickets:false pendingChangesInFullFlush: false
   [junit4]   2> 23647 T88 C22 oasu.LoggingInfoStream.message [DWFC][qtp1183575776-88]: addFlushableState DocumentsWriterPerThread [pendingDeletes=gen=0 6 deleted terms (unique count=6) bytesUsed=990, segment=_1, aborting=false, numDocsInRAM=7, deleteQueue=DWDQ: [ generation: 5 ]]
   [junit4]   2> 23648 T88 C22 oasu.LoggingInfoStream.message [DWPT][qtp1183575776-88]: flush postings as segment _1 numDocs=7
   [junit4]   2> 23651 T88 C22 oasu.LoggingInfoStream.message [DWPT][qtp1183575776-88]: new segment has 0 deleted docs
   [junit4]   2> 23651 T88 C22 oasu.LoggingInfoStream.message [DWPT][qtp1183575776-88]: new segment has no vectors; no norms; no docValues; no prox; no freqs
   [junit4]   2> 23652 T88 C22 oasu.LoggingInfoStream.message [DWPT][qtp1183575776-88]: flushedFiles=[_1_Lucene41_0.tim, _1.fdt, _1.fdx, _1_Lucene41_0.tip, _1_Lucene41_0.doc, _1.fnm]
   [junit4]   2> 23652 T88 C22 oasu.LoggingInfoStream.message [DWPT][qtp1183575776-88]: flushed codec=Lucene410
   [junit4]   2> 23653 T88 C22 oasu.LoggingInfoStream.message [DWPT][qtp1183575776-88]: flushed: segment=_1 ramUsed=0.064 MB newFlushedSize(includes docstores)=0.001 MB docs/MB=5,318.864
   [junit4]   2> 23654 T88 C22 oasu.LoggingInfoStream.message [DW][qtp1183575776-88]: publishFlushedSegment seg-private updates=null
   [junit4]   2> 23654 T88 C22 oasu.LoggingInfoStream.message [IW][qtp1183575776-88]: publishFlushedSegment
   [junit4]   2> 23655 T88 C22 oasu.LoggingInfoStream.message [BD][qtp1183575776-88]: push deletes  7 deleted terms (unique count=7) bytesUsed=1056 delGen=10 packetCount=1 totBytesUsed=1056
   [junit4]   2> 23655 T88 C22 oasu.LoggingInfoStream.message [IW][qtp1183575776-88]: publish sets newSegment delGen=11 seg=_1(4.11.0):C7
   [junit4]   2> 23656 T88 C22 oasu.LoggingInfoStream.message [IFD][qtp1183575776-88]: now checkpoint "_1(4.11.0):C7" [1 segments ; isCommit = false]
   [junit4]   2> 23656 T88 C22 oasu.LoggingInfoStream.message [IFD][qtp1183575776-88]: 0 msec t

[...truncated too long message...]

ream.message [IW][SUITE-SolrExampleJettyTest-seed#[69078053919685D4]-worker]:   start flush: applyAllDeletes=true
   [junit4]   2> 120270 T225 C74 oasu.LoggingInfoStream.message [IW][SUITE-SolrExampleJettyTest-seed#[69078053919685D4]-worker]:   index before flush _1b(4.11.0):C1
   [junit4]   2> 120271 T225 C74 oasu.LoggingInfoStream.message [DW][SUITE-SolrExampleJettyTest-seed#[69078053919685D4]-worker]: startFullFlush
   [junit4]   2> 120271 T225 C74 oasu.LoggingInfoStream.message [DW][SUITE-SolrExampleJettyTest-seed#[69078053919685D4]-worker]: anyChanges? numDocsInRam=0 deletes=false hasTickets:false pendingChangesInFullFlush: false
   [junit4]   2> 120271 T225 C74 oasu.LoggingInfoStream.message [DW][SUITE-SolrExampleJettyTest-seed#[69078053919685D4]-worker]: SUITE-SolrExampleJettyTest-seed#[69078053919685D4]-worker finishFullFlush success=true
   [junit4]   2> 120272 T225 C74 oasu.LoggingInfoStream.message [IW][SUITE-SolrExampleJettyTest-seed#[69078053919685D4]-worker]: apply all deletes during flush
   [junit4]   2> 120273 T225 C74 oasu.LoggingInfoStream.message [BD][SUITE-SolrExampleJettyTest-seed#[69078053919685D4]-worker]: applyDeletes: no deletes; skipping
   [junit4]   2> 120273 T225 C74 oasu.LoggingInfoStream.message [BD][SUITE-SolrExampleJettyTest-seed#[69078053919685D4]-worker]: prune sis=segments_1u: _1b(4.11.0):C1 minGen=283 packetCount=0
   [junit4]   2> 120274 T225 C74 oasu.LoggingInfoStream.message [CMS][SUITE-SolrExampleJettyTest-seed#[69078053919685D4]-worker]: now merge
   [junit4]   2> 120274 T225 C74 oasu.LoggingInfoStream.message [CMS][SUITE-SolrExampleJettyTest-seed#[69078053919685D4]-worker]:   index: _1b(4.11.0):C1
   [junit4]   2> 120274 T225 C74 oasu.LoggingInfoStream.message [CMS][SUITE-SolrExampleJettyTest-seed#[69078053919685D4]-worker]:   no more merges pending; now return
   [junit4]   2> 120275 T225 C74 oasu.LoggingInfoStream.message [IW][SUITE-SolrExampleJettyTest-seed#[69078053919685D4]-worker]: waitForMerges
   [junit4]   2> 120275 T225 C74 oasu.LoggingInfoStream.message [IW][SUITE-SolrExampleJettyTest-seed#[69078053919685D4]-worker]: waitForMerges done
   [junit4]   2> 120276 T225 C74 oasu.LoggingInfoStream.message [IW][SUITE-SolrExampleJettyTest-seed#[69078053919685D4]-worker]: commit: start
   [junit4]   2> 120276 T225 C74 oasu.LoggingInfoStream.message [IW][SUITE-SolrExampleJettyTest-seed#[69078053919685D4]-worker]: commit: enter lock
   [junit4]   2> 120276 T225 C74 oasu.LoggingInfoStream.message [IW][SUITE-SolrExampleJettyTest-seed#[69078053919685D4]-worker]: commit: now prepare
   [junit4]   2> 120277 T225 C74 oasu.LoggingInfoStream.message [IW][SUITE-SolrExampleJettyTest-seed#[69078053919685D4]-worker]: prepareCommit: flush
   [junit4]   2> 120277 T225 C74 oasu.LoggingInfoStream.message [IW][SUITE-SolrExampleJettyTest-seed#[69078053919685D4]-worker]:   index before flush _1b(4.11.0):C1
   [junit4]   2> 120277 T225 C74 oasu.LoggingInfoStream.message [DW][SUITE-SolrExampleJettyTest-seed#[69078053919685D4]-worker]: startFullFlush
   [junit4]   2> 120278 T225 C74 oasu.LoggingInfoStream.message [DW][SUITE-SolrExampleJettyTest-seed#[69078053919685D4]-worker]: anyChanges? numDocsInRam=0 deletes=false hasTickets:false pendingChangesInFullFlush: false
   [junit4]   2> 120278 T225 C74 oasu.LoggingInfoStream.message [IW][SUITE-SolrExampleJettyTest-seed#[69078053919685D4]-worker]: apply all deletes during flush
   [junit4]   2> 120279 T225 C74 oasu.LoggingInfoStream.message [BD][SUITE-SolrExampleJettyTest-seed#[69078053919685D4]-worker]: applyDeletes: no deletes; skipping
   [junit4]   2> 120279 T225 C74 oasu.LoggingInfoStream.message [BD][SUITE-SolrExampleJettyTest-seed#[69078053919685D4]-worker]: prune sis=segments_1u: _1b(4.11.0):C1 minGen=283 packetCount=0
   [junit4]   2> 120280 T225 C74 oasu.LoggingInfoStream.message [DW][SUITE-SolrExampleJettyTest-seed#[69078053919685D4]-worker]: SUITE-SolrExampleJettyTest-seed#[69078053919685D4]-worker finishFullFlush success=true
   [junit4]   2> 120280 T225 C74 oasu.LoggingInfoStream.message [IW][SUITE-SolrExampleJettyTest-seed#[69078053919685D4]-worker]: startCommit(): start
   [junit4]   2> 120280 T225 C74 oasu.LoggingInfoStream.message [IW][SUITE-SolrExampleJettyTest-seed#[69078053919685D4]-worker]:   skip startCommit(): no changes pending
   [junit4]   2> 120280 T225 C74 oasu.LoggingInfoStream.message [IW][SUITE-SolrExampleJettyTest-seed#[69078053919685D4]-worker]: commit: pendingCommit == null; skip
   [junit4]   2> 120280 T225 C74 oasu.LoggingInfoStream.message [IW][SUITE-SolrExampleJettyTest-seed#[69078053919685D4]-worker]: commit: done
   [junit4]   2> 120281 T225 C74 oasu.LoggingInfoStream.message [IW][SUITE-SolrExampleJettyTest-seed#[69078053919685D4]-worker]: rollback
   [junit4]   2> 120281 T225 C74 oasu.LoggingInfoStream.message [IW][SUITE-SolrExampleJettyTest-seed#[69078053919685D4]-worker]: all running merges have aborted
   [junit4]   2> 120281 T225 C74 oasu.LoggingInfoStream.message [IW][SUITE-SolrExampleJettyTest-seed#[69078053919685D4]-worker]: rollback: done finish merges
   [junit4]   2> 120281 T225 C74 oasu.LoggingInfoStream.message [DW][SUITE-SolrExampleJettyTest-seed#[69078053919685D4]-worker]: abort
   [junit4]   2> 120281 T225 C74 oasu.LoggingInfoStream.message [DW][SUITE-SolrExampleJettyTest-seed#[69078053919685D4]-worker]: done abort; abortedFiles=[] success=true
   [junit4]   2> 120281 T225 C74 oasu.LoggingInfoStream.message [IW][SUITE-SolrExampleJettyTest-seed#[69078053919685D4]-worker]: rollback: infos=_1b(4.11.0):C1
   [junit4]   2> 120282 T225 C74 oasu.LoggingInfoStream.message [IFD][SUITE-SolrExampleJettyTest-seed#[69078053919685D4]-worker]: now checkpoint "_1b(4.11.0):C1" [1 segments ; isCommit = false]
   [junit4]   2> 120282 T225 C74 oasu.LoggingInfoStream.message [IFD][SUITE-SolrExampleJettyTest-seed#[69078053919685D4]-worker]: 0 msec to checkpoint
   [junit4]   2> 120283 T225 oasc.SolrCore.closeSearcher [collection1] Closing main searcher on request.
   [junit4]   2> 120283 T225 oasc.CachingDirectoryFactory.close Closing MockDirectoryFactory - 2 directories currently being tracked
   [junit4]   2> 120284 T225 oasc.CachingDirectoryFactory.closeCacheValue looking to close /mnt/ssd/jenkins/workspace/Lucene-Solr-4.x-Linux/solr/build/solr-solrj/test/J1/temp/solr.client.solrj.embedded.SolrExampleJettyTest-69078053919685D4-001/tempDir-001/index [CachedDir<<refCount=0;path=/mnt/ssd/jenkins/workspace/Lucene-Solr-4.x-Linux/solr/build/solr-solrj/test/J1/temp/solr.client.solrj.embedded.SolrExampleJettyTest-69078053919685D4-001/tempDir-001/index;done=false>>]
   [junit4]   2> 120284 T225 oasc.CachingDirectoryFactory.close Closing directory: /mnt/ssd/jenkins/workspace/Lucene-Solr-4.x-Linux/solr/build/solr-solrj/test/J1/temp/solr.client.solrj.embedded.SolrExampleJettyTest-69078053919685D4-001/tempDir-001/index
   [junit4]   2> 120284 T225 oasc.CachingDirectoryFactory.closeCacheValue looking to close /mnt/ssd/jenkins/workspace/Lucene-Solr-4.x-Linux/solr/build/solr-solrj/test/J1/temp/solr.client.solrj.embedded.SolrExampleJettyTest-69078053919685D4-001/tempDir-001 [CachedDir<<refCount=0;path=/mnt/ssd/jenkins/workspace/Lucene-Solr-4.x-Linux/solr/build/solr-solrj/test/J1/temp/solr.client.solrj.embedded.SolrExampleJettyTest-69078053919685D4-001/tempDir-001;done=false>>]
   [junit4]   2> 120284 T225 oasc.CachingDirectoryFactory.close Closing directory: /mnt/ssd/jenkins/workspace/Lucene-Solr-4.x-Linux/solr/build/solr-solrj/test/J1/temp/solr.client.solrj.embedded.SolrExampleJettyTest-69078053919685D4-001/tempDir-001
   [junit4]   2> 120285 T225 oejsh.ContextHandler.doStop stopped o.e.j.s.ServletContextHandler{/solr,null}
   [junit4]   2> 125253 T225 oas.SolrTestCaseJ4.deleteCore ###deleteCore
   [junit4]   2> NOTE: leaving temporary files on disk at: /mnt/ssd/jenkins/workspace/Lucene-Solr-4.x-Linux/solr/build/solr-solrj/test/J1/./temp/solr.client.solrj.embedded.SolrExampleJettyTest-69078053919685D4-001
   [junit4]   2> NOTE: test params are: codec=Lucene40, sim=DefaultSimilarity, locale=sr_ME_#Latn, timezone=PST8PDT
   [junit4]   2> NOTE: Linux 3.13.0-35-generic amd64/Oracle Corporation 1.7.0_67 (64-bit)/cpus=8,threads=1,free=56190960,total=126550016
   [junit4]   2> NOTE: All tests run in this JVM: [TestSolrProperties, TestHash, NoOpResponseParserTest, TestFastInputStream, TestSpellCheckResponse, MultiCoreEmbeddedTest, TestBatchUpdate, SolrExampleStreamingTest, MultiCoreExampleJettyTest, SolrExampleBinaryTest, SolrDocumentTest, SolrExampleStreamingBinaryTest, SolrExampleXMLTest, SolrExampleJettyTest]
   [junit4] Completed on J1 in 12.17s, 28 tests, 1 error <<< FAILURES!

[...truncated 81 lines...]
BUILD FAILED
/mnt/ssd/jenkins/workspace/Lucene-Solr-4.x-Linux/build.xml:491: The following error occurred while executing this line:
/mnt/ssd/jenkins/workspace/Lucene-Solr-4.x-Linux/build.xml:471: The following error occurred while executing this line:
/mnt/ssd/jenkins/workspace/Lucene-Solr-4.x-Linux/build.xml:60: The following error occurred while executing this line:
/mnt/ssd/jenkins/workspace/Lucene-Solr-4.x-Linux/extra-targets.xml:39: The following error occurred while executing this line:
/mnt/ssd/jenkins/workspace/Lucene-Solr-4.x-Linux/solr/build.xml:202: The following error occurred while executing this line:
/mnt/ssd/jenkins/workspace/Lucene-Solr-4.x-Linux/solr/common-build.xml:494: The following error occurred while executing this line:
/mnt/ssd/jenkins/workspace/Lucene-Solr-4.x-Linux/lucene/common-build.xml:1337: The following error occurred while executing this line:
/mnt/ssd/jenkins/workspace/Lucene-Solr-4.x-Linux/lucene/common-build.xml:952: There were test failures: 52 suites, 302 tests, 5 errors, 1 failure

Total time: 94 minutes 24 seconds
Build step 'Invoke Ant' marked build as failure
[description-setter] Description set: Java: 64bit/jdk1.7.0_67 -XX:+UseCompressedOops -XX:+UseSerialGC
Archiving artifacts
Recording test results
Email was triggered for: Failure - Any
Sending email for trigger: Failure - Any



Mime
View raw message