lucene-dev mailing list archives

Site index · List index
Message view « Date » · « Thread »
Top « Date » · « Thread »
From Apache Jenkins Server <jenk...@builds.apache.org>
Subject [JENKINS-MAVEN] Lucene-Solr-Maven-5.x #719: POMs out of sync
Date Tue, 30 Sep 2014 20:11:16 GMT
Build: https://builds.apache.org/job/Lucene-Solr-Maven-5.x/719/

4 tests failed.
REGRESSION:  org.apache.solr.cloud.CollectionsAPIDistributedZkTest.testDistribSearch

Error Message:
Error CREATEing SolrCore 'halfcollection_shard1_replica1': Unable to create core [halfcollection_shard1_replica1]
Caused by: Could not get shard id for core: halfcollection_shard1_replica1

Stack Trace:
org.apache.solr.client.solrj.impl.HttpSolrServer$RemoteSolrException: Error CREATEing SolrCore
'halfcollection_shard1_replica1': Unable to create core [halfcollection_shard1_replica1] Caused
by: Could not get shard id for core: halfcollection_shard1_replica1
	at __randomizedtesting.SeedInfo.seed([28F080AEF013FF18:A9160EB6874C9F24]:0)
	at org.apache.solr.client.solrj.impl.HttpSolrServer.executeMethod(HttpSolrServer.java:568)
	at org.apache.solr.client.solrj.impl.HttpSolrServer.request(HttpSolrServer.java:215)
	at org.apache.solr.client.solrj.impl.HttpSolrServer.request(HttpSolrServer.java:211)
	at org.apache.solr.cloud.CollectionsAPIDistributedZkTest.testErrorHandling(CollectionsAPIDistributedZkTest.java:583)
	at org.apache.solr.cloud.CollectionsAPIDistributedZkTest.doTest(CollectionsAPIDistributedZkTest.java:205)


REGRESSION:  org.apache.solr.cloud.DeleteReplicaTest.testDistribSearch

Error Message:
No live SolrServers available to handle this request:[http://127.0.0.1:61534, http://127.0.0.1:61525,
http://127.0.0.1:61531, http://127.0.0.1:61520, http://127.0.0.1:61528]

Stack Trace:
org.apache.solr.client.solrj.SolrServerException: No live SolrServers available to handle
this request:[http://127.0.0.1:61534, http://127.0.0.1:61525, http://127.0.0.1:61531, http://127.0.0.1:61520,
http://127.0.0.1:61528]
	at org.apache.solr.client.solrj.impl.HttpSolrServer.executeMethod(HttpSolrServer.java:568)
	at org.apache.solr.client.solrj.impl.HttpSolrServer.request(HttpSolrServer.java:215)
	at org.apache.solr.client.solrj.impl.HttpSolrServer.request(HttpSolrServer.java:211)
	at org.apache.solr.client.solrj.impl.LBHttpSolrServer.doRequest(LBHttpSolrServer.java:343)
	at org.apache.solr.client.solrj.impl.LBHttpSolrServer.request(LBHttpSolrServer.java:304)
	at org.apache.solr.client.solrj.impl.CloudSolrServer.sendRequest(CloudSolrServer.java:880)
	at org.apache.solr.client.solrj.impl.CloudSolrServer.requestWithRetryOnStaleState(CloudSolrServer.java:658)
	at org.apache.solr.client.solrj.impl.CloudSolrServer.request(CloudSolrServer.java:601)
	at org.apache.solr.cloud.DeleteReplicaTest.removeAndWaitForReplicaGone(DeleteReplicaTest.java:171)
	at org.apache.solr.cloud.DeleteReplicaTest.deleteLiveReplicaTest(DeleteReplicaTest.java:144)
	at org.apache.solr.cloud.DeleteReplicaTest.doTest(DeleteReplicaTest.java:88)


REGRESSION:  org.apache.solr.core.ExitableDirectoryReaderTest.testPrefixQuery

Error Message:
null

Stack Trace:
java.lang.AssertionError: 
	at __randomizedtesting.SeedInfo.seed([E81A07C7AA63E0DE:5B4D3385CEBE045B]:0)
	at org.junit.Assert.fail(Assert.java:93)
	at org.apache.solr.SolrTestCaseJ4.assertQEx(SolrTestCaseJ4.java:850)
	at org.apache.solr.core.ExitableDirectoryReaderTest.testPrefixQuery(ExitableDirectoryReaderTest.java:67)


REGRESSION:  org.apache.solr.core.ExitableDirectoryReaderTest.testQueriesOnDocsWithMultipleTerms

Error Message:
null

Stack Trace:
java.lang.AssertionError: 
	at __randomizedtesting.SeedInfo.seed([E81A07C7AA63E0DE:86DA341686169BF1]:0)
	at org.junit.Assert.fail(Assert.java:93)
	at org.apache.solr.SolrTestCaseJ4.assertQEx(SolrTestCaseJ4.java:850)
	at org.apache.solr.core.ExitableDirectoryReaderTest.testQueriesOnDocsWithMultipleTerms(ExitableDirectoryReaderTest.java:88)




Build Log:
[...truncated 53058 lines...]
BUILD FAILED
/usr/home/jenkins/jenkins-slave/workspace/Lucene-Solr-Maven-5.x/build.xml:547: The following
error occurred while executing this line:
/usr/home/jenkins/jenkins-slave/workspace/Lucene-Solr-Maven-5.x/build.xml:199: The following
error occurred while executing this line:
: Java returned: 1

Total time: 236 minutes 25 seconds
Build step 'Invoke Ant' marked build as failure
Recording test results
Email was triggered for: Failure
Sending email for trigger: Failure



Mime
View raw message