lucene-dev mailing list archives

Site index · List index
Message view « Date » · « Thread »
Top « Date » · « Thread »
From Apache Jenkins Server <jenk...@builds.apache.org>
Subject [JENKINS-MAVEN] Lucene-Solr-Maven-trunk #1216: POMs out of sync
Date Tue, 23 Sep 2014 05:45:25 GMT
Build: https://builds.apache.org/job/Lucene-Solr-Maven-trunk/1216/

3 tests failed.
FAILED:  org.apache.solr.handler.TestReplicationHandlerBackup.org.apache.solr.handler.TestReplicationHandlerBackup

Error Message:
1 thread leaked from SUITE scope at org.apache.solr.handler.TestReplicationHandlerBackup:

   1) Thread[id=16828, name=Thread-3321, state=RUNNABLE, group=TGRP-TestReplicationHandlerBackup]
        at java.net.PlainSocketImpl.socketConnect(Native Method)
        at java.net.AbstractPlainSocketImpl.doConnect(AbstractPlainSocketImpl.java:339)
        at java.net.AbstractPlainSocketImpl.connectToAddress(AbstractPlainSocketImpl.java:200)
        at java.net.AbstractPlainSocketImpl.connect(AbstractPlainSocketImpl.java:182)
        at java.net.SocksSocketImpl.connect(SocksSocketImpl.java:392)
        at java.net.Socket.connect(Socket.java:579)
        at java.net.Socket.connect(Socket.java:528)
        at sun.net.NetworkClient.doConnect(NetworkClient.java:180)
        at sun.net.www.http.HttpClient.openServer(HttpClient.java:432)
        at sun.net.www.http.HttpClient.openServer(HttpClient.java:527)
        at sun.net.www.http.HttpClient.parseHTTP(HttpClient.java:652)
        at sun.net.www.protocol.http.HttpURLConnection.getInputStream(HttpURLConnection.java:1323)
        at java.net.URL.openStream(URL.java:1037)
        at org.apache.solr.handler.TestReplicationHandlerBackup$BackupThread.run(TestReplicationHandlerBackup.java:318)

Stack Trace:
com.carrotsearch.randomizedtesting.ThreadLeakError: 1 thread leaked from SUITE scope at org.apache.solr.handler.TestReplicationHandlerBackup:

   1) Thread[id=16828, name=Thread-3321, state=RUNNABLE, group=TGRP-TestReplicationHandlerBackup]
        at java.net.PlainSocketImpl.socketConnect(Native Method)
        at java.net.AbstractPlainSocketImpl.doConnect(AbstractPlainSocketImpl.java:339)
        at java.net.AbstractPlainSocketImpl.connectToAddress(AbstractPlainSocketImpl.java:200)
        at java.net.AbstractPlainSocketImpl.connect(AbstractPlainSocketImpl.java:182)
        at java.net.SocksSocketImpl.connect(SocksSocketImpl.java:392)
        at java.net.Socket.connect(Socket.java:579)
        at java.net.Socket.connect(Socket.java:528)
        at sun.net.NetworkClient.doConnect(NetworkClient.java:180)
        at sun.net.www.http.HttpClient.openServer(HttpClient.java:432)
        at sun.net.www.http.HttpClient.openServer(HttpClient.java:527)
        at sun.net.www.http.HttpClient.parseHTTP(HttpClient.java:652)
        at sun.net.www.protocol.http.HttpURLConnection.getInputStream(HttpURLConnection.java:1323)
        at java.net.URL.openStream(URL.java:1037)
        at org.apache.solr.handler.TestReplicationHandlerBackup$BackupThread.run(TestReplicationHandlerBackup.java:318)
	at __randomizedtesting.SeedInfo.seed([5598A23A5D63E154]:0)


FAILED:  org.apache.solr.handler.TestReplicationHandlerBackup.org.apache.solr.handler.TestReplicationHandlerBackup

Error Message:
There are still zombie threads that couldn't be terminated:
   1) Thread[id=16828, name=Thread-3321, state=RUNNABLE, group=TGRP-TestReplicationHandlerBackup]
        at java.net.PlainSocketImpl.socketConnect(Native Method)
        at java.net.AbstractPlainSocketImpl.doConnect(AbstractPlainSocketImpl.java:339)
        at java.net.AbstractPlainSocketImpl.connectToAddress(AbstractPlainSocketImpl.java:200)
        at java.net.AbstractPlainSocketImpl.connect(AbstractPlainSocketImpl.java:182)
        at java.net.SocksSocketImpl.connect(SocksSocketImpl.java:392)
        at java.net.Socket.connect(Socket.java:579)
        at java.net.Socket.connect(Socket.java:528)
        at sun.net.NetworkClient.doConnect(NetworkClient.java:180)
        at sun.net.www.http.HttpClient.openServer(HttpClient.java:432)
        at sun.net.www.http.HttpClient.openServer(HttpClient.java:527)
        at sun.net.www.http.HttpClient.parseHTTP(HttpClient.java:652)
        at sun.net.www.protocol.http.HttpURLConnection.getInputStream(HttpURLConnection.java:1323)
        at java.net.URL.openStream(URL.java:1037)
        at org.apache.solr.handler.TestReplicationHandlerBackup$BackupThread.run(TestReplicationHandlerBackup.java:318)

Stack Trace:
com.carrotsearch.randomizedtesting.ThreadLeakError: There are still zombie threads that couldn't
be terminated:
   1) Thread[id=16828, name=Thread-3321, state=RUNNABLE, group=TGRP-TestReplicationHandlerBackup]
        at java.net.PlainSocketImpl.socketConnect(Native Method)
        at java.net.AbstractPlainSocketImpl.doConnect(AbstractPlainSocketImpl.java:339)
        at java.net.AbstractPlainSocketImpl.connectToAddress(AbstractPlainSocketImpl.java:200)
        at java.net.AbstractPlainSocketImpl.connect(AbstractPlainSocketImpl.java:182)
        at java.net.SocksSocketImpl.connect(SocksSocketImpl.java:392)
        at java.net.Socket.connect(Socket.java:579)
        at java.net.Socket.connect(Socket.java:528)
        at sun.net.NetworkClient.doConnect(NetworkClient.java:180)
        at sun.net.www.http.HttpClient.openServer(HttpClient.java:432)
        at sun.net.www.http.HttpClient.openServer(HttpClient.java:527)
        at sun.net.www.http.HttpClient.parseHTTP(HttpClient.java:652)
        at sun.net.www.protocol.http.HttpURLConnection.getInputStream(HttpURLConnection.java:1323)
        at java.net.URL.openStream(URL.java:1037)
        at org.apache.solr.handler.TestReplicationHandlerBackup$BackupThread.run(TestReplicationHandlerBackup.java:318)
	at __randomizedtesting.SeedInfo.seed([5598A23A5D63E154]:0)


REGRESSION:  org.apache.solr.client.solrj.SolrExampleXMLTest.testChildDoctransformer

Error Message:
java.lang.AssertionError

Stack Trace:
org.apache.solr.client.solrj.impl.HttpSolrServer$RemoteSolrException: java.lang.AssertionError
	at __randomizedtesting.SeedInfo.seed([402F2B3F5C65B0C6:33F534A5D07DC7C0]:0)
	at org.apache.solr.client.solrj.impl.HttpSolrServer.executeMethod(HttpSolrServer.java:550)
	at org.apache.solr.client.solrj.impl.HttpSolrServer.request(HttpSolrServer.java:210)
	at org.apache.solr.client.solrj.impl.HttpSolrServer.request(HttpSolrServer.java:206)
	at org.apache.solr.client.solrj.request.QueryRequest.process(QueryRequest.java:91)
	at org.apache.solr.client.solrj.SolrServer.query(SolrServer.java:301)
	at org.apache.solr.client.solrj.SolrExampleTests.testChildDoctransformer(SolrExampleTests.java:1373)
	at sun.reflect.NativeMethodAccessorImpl.invoke0(Native Method)
	at sun.reflect.NativeMethodAccessorImpl.invoke(NativeMethodAccessorImpl.java:57)
	at sun.reflect.DelegatingMethodAccessorImpl.invoke(DelegatingMethodAccessorImpl.java:43)
	at java.lang.reflect.Method.invoke(Method.java:606)
	at com.carrotsearch.randomizedtesting.RandomizedRunner.invoke(RandomizedRunner.java:1618)
	at com.carrotsearch.randomizedtesting.RandomizedRunner$6.evaluate(RandomizedRunner.java:827)
	at com.carrotsearch.randomizedtesting.RandomizedRunner$7.evaluate(RandomizedRunner.java:863)
	at com.carrotsearch.randomizedtesting.RandomizedRunner$8.evaluate(RandomizedRunner.java:877)
	at com.carrotsearch.randomizedtesting.rules.SystemPropertiesRestoreRule$1.evaluate(SystemPropertiesRestoreRule.java:53)
	at org.apache.lucene.util.TestRuleSetupTeardownChained$1.evaluate(TestRuleSetupTeardownChained.java:50)
	at org.apache.lucene.util.AbstractBeforeAfterRule$1.evaluate(AbstractBeforeAfterRule.java:46)
	at com.carrotsearch.randomizedtesting.rules.SystemPropertiesInvariantRule$1.evaluate(SystemPropertiesInvariantRule.java:55)
	at org.apache.lucene.util.TestRuleThreadAndTestName$1.evaluate(TestRuleThreadAndTestName.java:49)
	at org.apache.lucene.util.TestRuleIgnoreAfterMaxFailures$1.evaluate(TestRuleIgnoreAfterMaxFailures.java:65)
	at org.apache.lucene.util.TestRuleMarkFailure$1.evaluate(TestRuleMarkFailure.java:48)
	at com.carrotsearch.randomizedtesting.rules.StatementAdapter.evaluate(StatementAdapter.java:36)
	at com.carrotsearch.randomizedtesting.ThreadLeakControl$StatementRunner.run(ThreadLeakControl.java:365)
	at com.carrotsearch.randomizedtesting.ThreadLeakControl.forkTimeoutingTask(ThreadLeakControl.java:798)
	at com.carrotsearch.randomizedtesting.ThreadLeakControl$3.evaluate(ThreadLeakControl.java:458)
	at com.carrotsearch.randomizedtesting.RandomizedRunner.runSingleTest(RandomizedRunner.java:836)
	at com.carrotsearch.randomizedtesting.RandomizedRunner$3.evaluate(RandomizedRunner.java:738)
	at com.carrotsearch.randomizedtesting.RandomizedRunner$4.evaluate(RandomizedRunner.java:772)
	at com.carrotsearch.randomizedtesting.RandomizedRunner$5.evaluate(RandomizedRunner.java:783)
	at com.carrotsearch.randomizedtesting.rules.StatementAdapter.evaluate(StatementAdapter.java:36)
	at com.carrotsearch.randomizedtesting.rules.SystemPropertiesRestoreRule$1.evaluate(SystemPropertiesRestoreRule.java:53)
	at org.apache.lucene.util.AbstractBeforeAfterRule$1.evaluate(AbstractBeforeAfterRule.java:46)
	at org.apache.lucene.util.TestRuleStoreClassName$1.evaluate(TestRuleStoreClassName.java:42)
	at com.carrotsearch.randomizedtesting.rules.SystemPropertiesInvariantRule$1.evaluate(SystemPropertiesInvariantRule.java:55)
	at com.carrotsearch.randomizedtesting.rules.NoShadowingOrOverridesOnMethodsRule$1.evaluate(NoShadowingOrOverridesOnMethodsRule.java:39)
	at com.carrotsearch.randomizedtesting.rules.NoShadowingOrOverridesOnMethodsRule$1.evaluate(NoShadowingOrOverridesOnMethodsRule.java:39)
	at com.carrotsearch.randomizedtesting.rules.StatementAdapter.evaluate(StatementAdapter.java:36)
	at com.carrotsearch.randomizedtesting.rules.StatementAdapter.evaluate(StatementAdapter.java:36)
	at com.carrotsearch.randomizedtesting.rules.StatementAdapter.evaluate(StatementAdapter.java:36)
	at org.apache.lucene.util.TestRuleAssertionsRequired$1.evaluate(TestRuleAssertionsRequired.java:43)
	at org.apache.lucene.util.TestRuleMarkFailure$1.evaluate(TestRuleMarkFailure.java:48)
	at org.apache.lucene.util.TestRuleIgnoreAfterMaxFailures$1.evaluate(TestRuleIgnoreAfterMaxFailures.java:65)
	at org.apache.lucene.util.TestRuleIgnoreTestSuites$1.evaluate(TestRuleIgnoreTestSuites.java:55)
	at com.carrotsearch.randomizedtesting.rules.StatementAdapter.evaluate(StatementAdapter.java:36)
	at com.carrotsearch.randomizedtesting.ThreadLeakControl$StatementRunner.run(ThreadLeakControl.java:365)
	at java.lang.Thread.run(Thread.java:745)




Build Log:
[...truncated 53306 lines...]
BUILD FAILED
/usr/home/jenkins/jenkins-slave/workspace/Lucene-Solr-Maven-trunk/build.xml:514: The following
error occurred while executing this line:
/usr/home/jenkins/jenkins-slave/workspace/Lucene-Solr-Maven-trunk/build.xml:198: The following
error occurred while executing this line:
: Java returned: 1

Total time: 123 minutes 54 seconds
Build step 'Invoke Ant' marked build as failure
Recording test results
Email was triggered for: Failure
Sending email for trigger: Failure



Mime
View raw message