lucene-dev mailing list archives

Site index · List index
Message view « Date » · « Thread »
Top « Date » · « Thread »
From Policeman Jenkins Server <jenk...@thetaphi.de>
Subject [JENKINS] Lucene-Solr-trunk-Windows (32bit/jdk1.8.0_20) - Build # 4311 - Still Failing!
Date Sun, 14 Sep 2014 11:13:16 GMT
Build: http://jenkins.thetaphi.de/job/Lucene-Solr-trunk-Windows/4311/
Java: 32bit/jdk1.8.0_20 -server -XX:+UseSerialGC

1 tests failed.
FAILED:  junit.framework.TestSuite.org.apache.lucene.benchmark.byTask.TestPerfTasksParse

Error Message:
Could not remove the following files (in the order of attempts):    C:\Users\JenkinsSlave\workspace\Lucene-Solr-trunk-Windows\lucene\build\benchmark\test\J0\temp\lucene.benchmark.byTask.TestPerfTasksParse-EBB0DBD1FB2CCFE9-001\linefile-001.txt:
java.nio.file.AccessDeniedException: C:\Users\JenkinsSlave\workspace\Lucene-Solr-trunk-Windows\lucene\build\benchmark\test\J0\temp\lucene.benchmark.byTask.TestPerfTasksParse-EBB0DBD1FB2CCFE9-001\linefile-001.txt
   C:\Users\JenkinsSlave\workspace\Lucene-Solr-trunk-Windows\lucene\build\benchmark\test\J0\temp\lucene.benchmark.byTask.TestPerfTasksParse-EBB0DBD1FB2CCFE9-001\linefile-002.txt:
java.nio.file.AccessDeniedException: C:\Users\JenkinsSlave\workspace\Lucene-Solr-trunk-Windows\lucene\build\benchmark\test\J0\temp\lucene.benchmark.byTask.TestPerfTasksParse-EBB0DBD1FB2CCFE9-001\linefile-002.txt
   C:\Users\JenkinsSlave\workspace\Lucene-Solr-trunk-Windows\lucene\build\benchmark\test\J0\temp\lucene.benchmark.byTask.TestPerfTasksParse-EBB0DBD1FB2CCFE9-001:
java.nio.file.DirectoryNotEmptyException: C:\Users\JenkinsSlave\workspace\Lucene-Solr-trunk-Windows\lucene\build\benchmark\test\J0\temp\lucene.benchmark.byTask.TestPerfTasksParse-EBB0DBD1FB2CCFE9-001


Stack Trace:
java.io.IOException: Could not remove the following files (in the order of attempts):
   C:\Users\JenkinsSlave\workspace\Lucene-Solr-trunk-Windows\lucene\build\benchmark\test\J0\temp\lucene.benchmark.byTask.TestPerfTasksParse-EBB0DBD1FB2CCFE9-001\linefile-001.txt:
java.nio.file.AccessDeniedException: C:\Users\JenkinsSlave\workspace\Lucene-Solr-trunk-Windows\lucene\build\benchmark\test\J0\temp\lucene.benchmark.byTask.TestPerfTasksParse-EBB0DBD1FB2CCFE9-001\linefile-001.txt
   C:\Users\JenkinsSlave\workspace\Lucene-Solr-trunk-Windows\lucene\build\benchmark\test\J0\temp\lucene.benchmark.byTask.TestPerfTasksParse-EBB0DBD1FB2CCFE9-001\linefile-002.txt:
java.nio.file.AccessDeniedException: C:\Users\JenkinsSlave\workspace\Lucene-Solr-trunk-Windows\lucene\build\benchmark\test\J0\temp\lucene.benchmark.byTask.TestPerfTasksParse-EBB0DBD1FB2CCFE9-001\linefile-002.txt
   C:\Users\JenkinsSlave\workspace\Lucene-Solr-trunk-Windows\lucene\build\benchmark\test\J0\temp\lucene.benchmark.byTask.TestPerfTasksParse-EBB0DBD1FB2CCFE9-001:
java.nio.file.DirectoryNotEmptyException: C:\Users\JenkinsSlave\workspace\Lucene-Solr-trunk-Windows\lucene\build\benchmark\test\J0\temp\lucene.benchmark.byTask.TestPerfTasksParse-EBB0DBD1FB2CCFE9-001

	at __randomizedtesting.SeedInfo.seed([EBB0DBD1FB2CCFE9]:0)
	at org.apache.lucene.util.IOUtils.rm(IOUtils.java:288)
	at org.apache.lucene.util.TestRuleTemporaryFilesCleanup.afterAlways(TestRuleTemporaryFilesCleanup.java:126)
	at com.carrotsearch.randomizedtesting.rules.TestRuleAdapter$1.afterAlways(TestRuleAdapter.java:31)
	at com.carrotsearch.randomizedtesting.rules.StatementAdapter.evaluate(StatementAdapter.java:43)
	at com.carrotsearch.randomizedtesting.rules.StatementAdapter.evaluate(StatementAdapter.java:36)
	at org.apache.lucene.util.TestRuleAssertionsRequired$1.evaluate(TestRuleAssertionsRequired.java:43)
	at org.apache.lucene.util.TestRuleMarkFailure$1.evaluate(TestRuleMarkFailure.java:48)
	at org.apache.lucene.util.TestRuleIgnoreAfterMaxFailures$1.evaluate(TestRuleIgnoreAfterMaxFailures.java:65)
	at org.apache.lucene.util.TestRuleIgnoreTestSuites$1.evaluate(TestRuleIgnoreTestSuites.java:55)
	at com.carrotsearch.randomizedtesting.rules.StatementAdapter.evaluate(StatementAdapter.java:36)
	at com.carrotsearch.randomizedtesting.ThreadLeakControl$StatementRunner.run(ThreadLeakControl.java:365)
	at java.lang.Thread.run(Thread.java:745)




Build Log:
[...truncated 7125 lines...]
   [junit4] Suite: org.apache.lucene.benchmark.byTask.TestPerfTasksParse
   [junit4]   1> ------------> queries:
   [junit4]   1> 
   [junit4]   1> ------------> queries:
   [junit4]   1> 
   [junit4]   1> ------------> queries:
   [junit4]   1> 
   [junit4]   1> ------------> queries:
   [junit4]   1> 
   [junit4]   1> ------------> queries:
   [junit4]   1> 
   [junit4]   1> ------------> queries:
   [junit4]   1> 
   [junit4]   1> ------------> queries:
   [junit4]   1> 
   [junit4]   1> ------------> queries:
   [junit4]   1> 
   [junit4]   1> ------------> queries:
   [junit4]   1> 
   [junit4]   1> ------------> queries:
   [junit4]   1> 
   [junit4]   1> ------------> queries:
   [junit4]   1> 
   [junit4]   1> ------------> queries:
   [junit4]   1> 
   [junit4]   1> ------------> queries:
   [junit4]   1> 
   [junit4]   1> Spatial Strategy: RecursivePrefixTreeStrategy(SPG:(QuadPrefixTree(maxLevels:26,ctx:SpatialContext{geo=true,
calculator=Haversine, worldBounds=Rect(minX=-180.0,maxX=180.0,minY=-90.0,maxY=90.0)})),pointsOnly,pruneLeafyBranches)
   [junit4]   1> ------------> queries:
   [junit4]   1> 
   [junit4]   1> ------------> queries:
   [junit4]   1> 
   [junit4]   1> ------------> queries:
   [junit4]   1> 
   [junit4]   1> ------------> queries:
   [junit4]   1> 
   [junit4]   1> ------------> queries:
   [junit4]   1> 
   [junit4]   2> NOTE: test params are: codec=Lucene410: {}, docValues:{}, sim=RandomSimilarityProvider(queryNorm=false,coord=yes):
{}, locale=ro_RO, timezone=Europe/Minsk
   [junit4]   2> NOTE: Windows 7 6.1 x86/Oracle Corporation 1.8.0_20 (32-bit)/cpus=2,threads=1,free=21303776,total=32571392
   [junit4]   2> NOTE: All tests run in this JVM: [TestPerfTasksParse]
   [junit4]   2> NOTE: reproduce with: ant test  -Dtestcase=TestPerfTasksParse -Dtests.seed=EBB0DBD1FB2CCFE9
-Dtests.slow=true -Dtests.locale=ro_RO -Dtests.timezone=Europe/Minsk -Dtests.file.encoding=ISO-8859-1
   [junit4] ERROR   0.00s | TestPerfTasksParse (suite) <<<
   [junit4]    > Throwable #1: java.io.IOException: Could not remove the following files
(in the order of attempts):
   [junit4]    >    C:\Users\JenkinsSlave\workspace\Lucene-Solr-trunk-Windows\lucene\build\benchmark\test\J0\temp\lucene.benchmark.byTask.TestPerfTasksParse-EBB0DBD1FB2CCFE9-001\linefile-001.txt:
java.nio.file.AccessDeniedException: C:\Users\JenkinsSlave\workspace\Lucene-Solr-trunk-Windows\lucene\build\benchmark\test\J0\temp\lucene.benchmark.byTask.TestPerfTasksParse-EBB0DBD1FB2CCFE9-001\linefile-001.txt
   [junit4]    >    C:\Users\JenkinsSlave\workspace\Lucene-Solr-trunk-Windows\lucene\build\benchmark\test\J0\temp\lucene.benchmark.byTask.TestPerfTasksParse-EBB0DBD1FB2CCFE9-001\linefile-002.txt:
java.nio.file.AccessDeniedException: C:\Users\JenkinsSlave\workspace\Lucene-Solr-trunk-Windows\lucene\build\benchmark\test\J0\temp\lucene.benchmark.byTask.TestPerfTasksParse-EBB0DBD1FB2CCFE9-001\linefile-002.txt
   [junit4]    >    C:\Users\JenkinsSlave\workspace\Lucene-Solr-trunk-Windows\lucene\build\benchmark\test\J0\temp\lucene.benchmark.byTask.TestPerfTasksParse-EBB0DBD1FB2CCFE9-001:
java.nio.file.DirectoryNotEmptyException: C:\Users\JenkinsSlave\workspace\Lucene-Solr-trunk-Windows\lucene\build\benchmark\test\J0\temp\lucene.benchmark.byTask.TestPerfTasksParse-EBB0DBD1FB2CCFE9-001
   [junit4]    > 	at __randomizedtesting.SeedInfo.seed([EBB0DBD1FB2CCFE9]:0)
   [junit4]    > 	at org.apache.lucene.util.IOUtils.rm(IOUtils.java:288)
   [junit4]    > 	at java.lang.Thread.run(Thread.java:745)
   [junit4] Completed in 3.21s, 3 tests, 1 error <<< FAILURES!

[...truncated 60 lines...]
BUILD FAILED
C:\Users\JenkinsSlave\workspace\Lucene-Solr-trunk-Windows\build.xml:491: The following error
occurred while executing this line:
C:\Users\JenkinsSlave\workspace\Lucene-Solr-trunk-Windows\build.xml:471: The following error
occurred while executing this line:
C:\Users\JenkinsSlave\workspace\Lucene-Solr-trunk-Windows\build.xml:60: The following error
occurred while executing this line:
C:\Users\JenkinsSlave\workspace\Lucene-Solr-trunk-Windows\extra-targets.xml:39: The following
error occurred while executing this line:
C:\Users\JenkinsSlave\workspace\Lucene-Solr-trunk-Windows\lucene\build.xml:462: The following
error occurred while executing this line:
C:\Users\JenkinsSlave\workspace\Lucene-Solr-trunk-Windows\lucene\common-build.xml:2140: The
following error occurred while executing this line:
C:\Users\JenkinsSlave\workspace\Lucene-Solr-trunk-Windows\lucene\module-build.xml:58: The
following error occurred while executing this line:
C:\Users\JenkinsSlave\workspace\Lucene-Solr-trunk-Windows\lucene\common-build.xml:1358: The
following error occurred while executing this line:
C:\Users\JenkinsSlave\workspace\Lucene-Solr-trunk-Windows\lucene\common-build.xml:961: There
were test failures: 18 suites, 93 tests, 1 suite-level error

Total time: 30 minutes 23 seconds
Build step 'Invoke Ant' marked build as failure
[description-setter] Description set: Java: 32bit/jdk1.8.0_20 -server -XX:+UseSerialGC
Archiving artifacts
Recording test results
Email was triggered for: Failure - Any
Sending email for trigger: Failure - Any



Mime
View raw message