lucene-dev mailing list archives

Site index · List index
Message view « Date » · « Thread »
Top « Date » · « Thread »
From Apache Jenkins Server <jenk...@builds.apache.org>
Subject [JENKINS-MAVEN] Lucene-Solr-Maven-trunk #1218: POMs out of sync
Date Thu, 25 Sep 2014 00:37:04 GMT
Build: https://builds.apache.org/job/Lucene-Solr-Maven-trunk/1218/

2 tests failed.
FAILED:  org.apache.solr.handler.TestReplicationHandlerBackup.org.apache.solr.handler.TestReplicationHandlerBackup

Error Message:
1 thread leaked from SUITE scope at org.apache.solr.handler.TestReplicationHandlerBackup:

   1) Thread[id=16228, name=Thread-5704, state=RUNNABLE, group=TGRP-TestReplicationHandlerBackup]
        at java.net.PlainSocketImpl.socketConnect(Native Method)
        at java.net.AbstractPlainSocketImpl.doConnect(AbstractPlainSocketImpl.java:339)
        at java.net.AbstractPlainSocketImpl.connectToAddress(AbstractPlainSocketImpl.java:200)
        at java.net.AbstractPlainSocketImpl.connect(AbstractPlainSocketImpl.java:182)
        at java.net.SocksSocketImpl.connect(SocksSocketImpl.java:392)
        at java.net.Socket.connect(Socket.java:579)
        at java.net.Socket.connect(Socket.java:528)
        at sun.net.NetworkClient.doConnect(NetworkClient.java:180)
        at sun.net.www.http.HttpClient.openServer(HttpClient.java:432)
        at sun.net.www.http.HttpClient.openServer(HttpClient.java:527)
        at sun.net.www.http.HttpClient.parseHTTP(HttpClient.java:652)
        at sun.net.www.protocol.http.HttpURLConnection.getInputStream(HttpURLConnection.java:1323)
        at java.net.URL.openStream(URL.java:1037)
        at org.apache.solr.handler.TestReplicationHandlerBackup$BackupThread.run(TestReplicationHandlerBackup.java:318)

Stack Trace:
com.carrotsearch.randomizedtesting.ThreadLeakError: 1 thread leaked from SUITE scope at org.apache.solr.handler.TestReplicationHandlerBackup:

   1) Thread[id=16228, name=Thread-5704, state=RUNNABLE, group=TGRP-TestReplicationHandlerBackup]
        at java.net.PlainSocketImpl.socketConnect(Native Method)
        at java.net.AbstractPlainSocketImpl.doConnect(AbstractPlainSocketImpl.java:339)
        at java.net.AbstractPlainSocketImpl.connectToAddress(AbstractPlainSocketImpl.java:200)
        at java.net.AbstractPlainSocketImpl.connect(AbstractPlainSocketImpl.java:182)
        at java.net.SocksSocketImpl.connect(SocksSocketImpl.java:392)
        at java.net.Socket.connect(Socket.java:579)
        at java.net.Socket.connect(Socket.java:528)
        at sun.net.NetworkClient.doConnect(NetworkClient.java:180)
        at sun.net.www.http.HttpClient.openServer(HttpClient.java:432)
        at sun.net.www.http.HttpClient.openServer(HttpClient.java:527)
        at sun.net.www.http.HttpClient.parseHTTP(HttpClient.java:652)
        at sun.net.www.protocol.http.HttpURLConnection.getInputStream(HttpURLConnection.java:1323)
        at java.net.URL.openStream(URL.java:1037)
        at org.apache.solr.handler.TestReplicationHandlerBackup$BackupThread.run(TestReplicationHandlerBackup.java:318)
	at __randomizedtesting.SeedInfo.seed([CEE1D420BFBCA9BF]:0)


FAILED:  org.apache.solr.handler.TestReplicationHandlerBackup.org.apache.solr.handler.TestReplicationHandlerBackup

Error Message:
There are still zombie threads that couldn't be terminated:
   1) Thread[id=16228, name=Thread-5704, state=RUNNABLE, group=TGRP-TestReplicationHandlerBackup]
        at java.net.PlainSocketImpl.socketConnect(Native Method)
        at java.net.AbstractPlainSocketImpl.doConnect(AbstractPlainSocketImpl.java:339)
        at java.net.AbstractPlainSocketImpl.connectToAddress(AbstractPlainSocketImpl.java:200)
        at java.net.AbstractPlainSocketImpl.connect(AbstractPlainSocketImpl.java:182)
        at java.net.SocksSocketImpl.connect(SocksSocketImpl.java:392)
        at java.net.Socket.connect(Socket.java:579)
        at java.net.Socket.connect(Socket.java:528)
        at sun.net.NetworkClient.doConnect(NetworkClient.java:180)
        at sun.net.www.http.HttpClient.openServer(HttpClient.java:432)
        at sun.net.www.http.HttpClient.openServer(HttpClient.java:527)
        at sun.net.www.http.HttpClient.parseHTTP(HttpClient.java:652)
        at sun.net.www.protocol.http.HttpURLConnection.getInputStream(HttpURLConnection.java:1323)
        at java.net.URL.openStream(URL.java:1037)
        at org.apache.solr.handler.TestReplicationHandlerBackup$BackupThread.run(TestReplicationHandlerBackup.java:318)

Stack Trace:
com.carrotsearch.randomizedtesting.ThreadLeakError: There are still zombie threads that couldn't
be terminated:
   1) Thread[id=16228, name=Thread-5704, state=RUNNABLE, group=TGRP-TestReplicationHandlerBackup]
        at java.net.PlainSocketImpl.socketConnect(Native Method)
        at java.net.AbstractPlainSocketImpl.doConnect(AbstractPlainSocketImpl.java:339)
        at java.net.AbstractPlainSocketImpl.connectToAddress(AbstractPlainSocketImpl.java:200)
        at java.net.AbstractPlainSocketImpl.connect(AbstractPlainSocketImpl.java:182)
        at java.net.SocksSocketImpl.connect(SocksSocketImpl.java:392)
        at java.net.Socket.connect(Socket.java:579)
        at java.net.Socket.connect(Socket.java:528)
        at sun.net.NetworkClient.doConnect(NetworkClient.java:180)
        at sun.net.www.http.HttpClient.openServer(HttpClient.java:432)
        at sun.net.www.http.HttpClient.openServer(HttpClient.java:527)
        at sun.net.www.http.HttpClient.parseHTTP(HttpClient.java:652)
        at sun.net.www.protocol.http.HttpURLConnection.getInputStream(HttpURLConnection.java:1323)
        at java.net.URL.openStream(URL.java:1037)
        at org.apache.solr.handler.TestReplicationHandlerBackup$BackupThread.run(TestReplicationHandlerBackup.java:318)
	at __randomizedtesting.SeedInfo.seed([CEE1D420BFBCA9BF]:0)




Build Log:
[...truncated 53347 lines...]
BUILD FAILED
/usr/home/jenkins/jenkins-slave/workspace/Lucene-Solr-Maven-trunk/build.xml:514: The following
error occurred while executing this line:
/usr/home/jenkins/jenkins-slave/workspace/Lucene-Solr-Maven-trunk/build.xml:198: The following
error occurred while executing this line:
: Java returned: 1

Total time: 172 minutes 39 seconds
Build step 'Invoke Ant' marked build as failure
Recording test results
Email was triggered for: Failure
Sending email for trigger: Failure



Mime
View raw message