lucene-dev mailing list archives

Site index · List index
Message view « Date » · « Thread »
Top « Date » · « Thread »
From Shalin Shekhar Mangar <shalinman...@gmail.com>
Subject Re: [JENKINS] Lucene-Solr-NightlyTests-trunk - Build # 595 - Still Failing
Date Sat, 02 Aug 2014 04:51:18 GMT
I can reproduce this failure.


On Sat, Aug 2, 2014 at 7:34 AM, Apache Jenkins Server <
jenkins@builds.apache.org> wrote:

> Build: https://builds.apache.org/job/Lucene-Solr-NightlyTests-trunk/595/
>
> 1 tests failed.
> REGRESSION:
>  org.apache.lucene.codecs.idversion.TestIDVersionPostingsFormat.testRandom
>
> Error Message:
> String index out of range: -1
>
> Stack Trace:
> java.lang.StringIndexOutOfBoundsException: String index out of range: -1
>         at
> __randomizedtesting.SeedInfo.seed([2E117A0408B6514F:5C5D5F0BB9D6E73C]:0)
>         at java.lang.String.substring(String.java:1871)
>         at
> org.apache.lucene.codecs.idversion.TestIDVersionPostingsFormat$4.next(TestIDVersionPostingsFormat.java:148)
>         at
> org.apache.lucene.codecs.idversion.TestIDVersionPostingsFormat.testRandom(TestIDVersionPostingsFormat.java:283)
>         at sun.reflect.NativeMethodAccessorImpl.invoke0(Native Method)
>         at
> sun.reflect.NativeMethodAccessorImpl.invoke(NativeMethodAccessorImpl.java:57)
>         at
> sun.reflect.DelegatingMethodAccessorImpl.invoke(DelegatingMethodAccessorImpl.java:43)
>         at java.lang.reflect.Method.invoke(Method.java:606)
>         at
> com.carrotsearch.randomizedtesting.RandomizedRunner.invoke(RandomizedRunner.java:1618)
>         at
> com.carrotsearch.randomizedtesting.RandomizedRunner$6.evaluate(RandomizedRunner.java:827)
>         at
> com.carrotsearch.randomizedtesting.RandomizedRunner$7.evaluate(RandomizedRunner.java:863)
>         at
> com.carrotsearch.randomizedtesting.RandomizedRunner$8.evaluate(RandomizedRunner.java:877)
>         at
> org.apache.lucene.util.TestRuleSetupTeardownChained$1.evaluate(TestRuleSetupTeardownChained.java:50)
>         at
> org.apache.lucene.util.AbstractBeforeAfterRule$1.evaluate(AbstractBeforeAfterRule.java:46)
>         at
> com.carrotsearch.randomizedtesting.rules.SystemPropertiesInvariantRule$1.evaluate(SystemPropertiesInvariantRule.java:55)
>         at
> org.apache.lucene.util.TestRuleThreadAndTestName$1.evaluate(TestRuleThreadAndTestName.java:49)
>         at
> org.apache.lucene.util.TestRuleIgnoreAfterMaxFailures$1.evaluate(TestRuleIgnoreAfterMaxFailures.java:65)
>         at
> org.apache.lucene.util.TestRuleMarkFailure$1.evaluate(TestRuleMarkFailure.java:48)
>         at
> com.carrotsearch.randomizedtesting.rules.StatementAdapter.evaluate(StatementAdapter.java:36)
>         at
> com.carrotsearch.randomizedtesting.ThreadLeakControl$StatementRunner.run(ThreadLeakControl.java:365)
>         at
> com.carrotsearch.randomizedtesting.ThreadLeakControl.forkTimeoutingTask(ThreadLeakControl.java:798)
>         at
> com.carrotsearch.randomizedtesting.ThreadLeakControl$3.evaluate(ThreadLeakControl.java:458)
>         at
> com.carrotsearch.randomizedtesting.RandomizedRunner.runSingleTest(RandomizedRunner.java:836)
>         at
> com.carrotsearch.randomizedtesting.RandomizedRunner$3.evaluate(RandomizedRunner.java:738)
>         at
> com.carrotsearch.randomizedtesting.RandomizedRunner$4.evaluate(RandomizedRunner.java:772)
>         at
> com.carrotsearch.randomizedtesting.RandomizedRunner$5.evaluate(RandomizedRunner.java:783)
>         at
> org.apache.lucene.util.AbstractBeforeAfterRule$1.evaluate(AbstractBeforeAfterRule.java:46)
>         at
> org.apache.lucene.util.TestRuleStoreClassName$1.evaluate(TestRuleStoreClassName.java:42)
>         at
> com.carrotsearch.randomizedtesting.rules.SystemPropertiesInvariantRule$1.evaluate(SystemPropertiesInvariantRule.java:55)
>         at
> com.carrotsearch.randomizedtesting.rules.NoShadowingOrOverridesOnMethodsRule$1.evaluate(NoShadowingOrOverridesOnMethodsRule.java:39)
>         at
> com.carrotsearch.randomizedtesting.rules.NoShadowingOrOverridesOnMethodsRule$1.evaluate(NoShadowingOrOverridesOnMethodsRule.java:39)
>         at
> com.carrotsearch.randomizedtesting.rules.StatementAdapter.evaluate(StatementAdapter.java:36)
>         at
> com.carrotsearch.randomizedtesting.rules.StatementAdapter.evaluate(StatementAdapter.java:36)
>         at
> com.carrotsearch.randomizedtesting.rules.StatementAdapter.evaluate(StatementAdapter.java:36)
>         at
> org.apache.lucene.util.TestRuleAssertionsRequired$1.evaluate(TestRuleAssertionsRequired.java:43)
>         at
> org.apache.lucene.util.TestRuleMarkFailure$1.evaluate(TestRuleMarkFailure.java:48)
>         at
> org.apache.lucene.util.TestRuleIgnoreAfterMaxFailures$1.evaluate(TestRuleIgnoreAfterMaxFailures.java:65)
>         at
> org.apache.lucene.util.TestRuleIgnoreTestSuites$1.evaluate(TestRuleIgnoreTestSuites.java:55)
>         at
> com.carrotsearch.randomizedtesting.rules.StatementAdapter.evaluate(StatementAdapter.java:36)
>         at
> com.carrotsearch.randomizedtesting.ThreadLeakControl$StatementRunner.run(ThreadLeakControl.java:365)
>         at java.lang.Thread.run(Thread.java:745)
>
>
>
>
> Build Log:
> [...truncated 10211 lines...]
>    [junit4] Suite:
> org.apache.lucene.codecs.idversion.TestIDVersionPostingsFormat
>    [junit4]   2> NOTE: download the large Jenkins line-docs file by
> running 'ant get-jenkins-line-docs' in the lucene directory.
>    [junit4]   2> NOTE: reproduce with: ant test
>  -Dtestcase=TestIDVersionPostingsFormat -Dtests.method=testRandom
> -Dtests.seed=2E117A0408B6514F -Dtests.multiplier=2 -Dtests.nightly=true
> -Dtests.slow=true
> -Dtests.linedocsfile=/home/hudson/lucene-data/enwiki.random.lines.txt
> -Dtests.locale=es_PE -Dtests.timezone=America/Santarem
> -Dtests.file.encoding=ISO-8859-1
>    [junit4] ERROR   3.15s J0 | TestIDVersionPostingsFormat.testRandom <<<
>    [junit4]    > Throwable #1: java.lang.StringIndexOutOfBoundsException:
> String index out of range: -1
>    [junit4]    >        at
> __randomizedtesting.SeedInfo.seed([2E117A0408B6514F:5C5D5F0BB9D6E73C]:0)
>    [junit4]    >        at java.lang.String.substring(String.java:1871)
>    [junit4]    >        at
> org.apache.lucene.codecs.idversion.TestIDVersionPostingsFormat$4.next(TestIDVersionPostingsFormat.java:148)
>    [junit4]    >        at
> org.apache.lucene.codecs.idversion.TestIDVersionPostingsFormat.testRandom(TestIDVersionPostingsFormat.java:283)
>    [junit4]    >        at java.lang.Thread.run(Thread.java:745)
>    [junit4]   2> NOTE: leaving temporary files on disk at:
> /usr/home/hudson/hudson-slave/workspace/Lucene-Solr-NightlyTests-trunk/lucene/build/sandbox/test/J0/./temp/lucene.codecs.idversion.TestIDVersionPostingsFormat-2E117A0408B6514F-001
>    [junit4]   2> NOTE: test params are: codec=Lucene40,
> sim=RandomSimilarityProvider(queryNorm=false,coord=no): {id=IB
> SPL-D3(800.0)}, locale=es_PE, timezone=America/Santarem
>    [junit4]   2> NOTE: FreeBSD 9.1-RELEASE-p3 amd64/Oracle Corporation
> 1.7.0_60 (64-bit)/cpus=16,threads=1,free=145323792,total=184549376
>    [junit4]   2> NOTE: All tests run in this JVM:
> [TestJakartaRegexpCapabilities, TestSlowFuzzyQuery2, TestRegexQuery,
> TestSpanRegexQuery, TestIDVersionPostingsFormat]
>    [junit4] Completed on J0 in 63.56s, 14 tests, 1 error <<< FAILURES!
>
> [...truncated 10 lines...]
> BUILD FAILED
> /usr/home/hudson/hudson-slave/workspace/Lucene-Solr-NightlyTests-trunk/build.xml:474:
> The following error occurred while executing this line:
> /usr/home/hudson/hudson-slave/workspace/Lucene-Solr-NightlyTests-trunk/build.xml:447:
> The following error occurred while executing this line:
> /usr/home/hudson/hudson-slave/workspace/Lucene-Solr-NightlyTests-trunk/build.xml:45:
> The following error occurred while executing this line:
> /usr/home/hudson/hudson-slave/workspace/Lucene-Solr-NightlyTests-trunk/extra-targets.xml:37:
> The following error occurred while executing this line:
> /usr/home/hudson/hudson-slave/workspace/Lucene-Solr-NightlyTests-trunk/lucene/build.xml:544:
> The following error occurred while executing this line:
> /usr/home/hudson/hudson-slave/workspace/Lucene-Solr-NightlyTests-trunk/lucene/common-build.xml:2028:
> The following error occurred while executing this line:
> /usr/home/hudson/hudson-slave/workspace/Lucene-Solr-NightlyTests-trunk/lucene/module-build.xml:60:
> The following error occurred while executing this line:
> /usr/home/hudson/hudson-slave/workspace/Lucene-Solr-NightlyTests-trunk/lucene/common-build.xml:1298:
> The following error occurred while executing this line:
> /usr/home/hudson/hudson-slave/workspace/Lucene-Solr-NightlyTests-trunk/lucene/common-build.xml:922:
> There were test failures: 10 suites, 62 tests, 1 error
>
> Total time: 118 minutes 28 seconds
> Build step 'Invoke Ant' marked build as failure
> Archiving artifacts
> Sending artifact delta relative to Lucene-Solr-NightlyTests-trunk #592
> Archived 3 artifacts
> Archive block size is 32768
> Received 0 blocks and 98786 bytes
> Compression is 0.0%
> Took 66 ms
> Recording test results
> Email was triggered for: Failure
> Sending email for trigger: Failure
>
>
>
>
> ---------------------------------------------------------------------
> To unsubscribe, e-mail: dev-unsubscribe@lucene.apache.org
> For additional commands, e-mail: dev-help@lucene.apache.org
>



-- 
Regards,
Shalin Shekhar Mangar.

Mime
View raw message