lucene-dev mailing list archives

Site index · List index
Message view « Date » · « Thread »
Top « Date » · « Thread »
From Michael McCandless <luc...@mikemccandless.com>
Subject Re: [JENKINS] Lucene-Solr-NightlyTests-trunk - Build # 608 - Still Failing
Date Thu, 21 Aug 2014 21:48:50 GMT
I dug a bit on this, I think it's just that we are missing a try /
finally in the new SegmentDocValuesProducer to close all producers
that had been opened if we hit an exc.

Mike McCandless

http://blog.mikemccandless.com


On Thu, Aug 21, 2014 at 3:47 PM, Apache Jenkins Server
<jenkins@builds.apache.org> wrote:
> Build: https://builds.apache.org/job/Lucene-Solr-NightlyTests-trunk/608/
>
> 1 tests failed.
> REGRESSION:  org.apache.lucene.index.TestIndexWriterOutOfMemory.testBasics
>
> Error Message:
> MockDirectoryWrapper: cannot close: there are still open files: {_1_1.dvd=1}
>
> Stack Trace:
> java.lang.RuntimeException: MockDirectoryWrapper: cannot close: there are still open files: {_1_1.dvd=1}
>         at __randomizedtesting.SeedInfo.seed([3C3A06BDFCB270AC:1E2A891C45C2EDC]:0)
>         at org.apache.lucene.store.MockDirectoryWrapper.close(MockDirectoryWrapper.java:672)
>         at org.apache.lucene.index.TestIndexWriterOutOfMemory.testBasics(TestIndexWriterOutOfMemory.java:85)
>         at sun.reflect.NativeMethodAccessorImpl.invoke0(Native Method)
>         at sun.reflect.NativeMethodAccessorImpl.invoke(NativeMethodAccessorImpl.java:57)
>         at sun.reflect.DelegatingMethodAccessorImpl.invoke(DelegatingMethodAccessorImpl.java:43)
>         at java.lang.reflect.Method.invoke(Method.java:606)
>         at com.carrotsearch.randomizedtesting.RandomizedRunner.invoke(RandomizedRunner.java:1618)
>         at com.carrotsearch.randomizedtesting.RandomizedRunner$6.evaluate(RandomizedRunner.java:827)
>         at com.carrotsearch.randomizedtesting.RandomizedRunner$7.evaluate(RandomizedRunner.java:863)
>         at com.carrotsearch.randomizedtesting.RandomizedRunner$8.evaluate(RandomizedRunner.java:877)
>         at org.apache.lucene.util.TestRuleSetupTeardownChained$1.evaluate(TestRuleSetupTeardownChained.java:50)
>         at org.apache.lucene.util.AbstractBeforeAfterRule$1.evaluate(AbstractBeforeAfterRule.java:46)
>         at com.carrotsearch.randomizedtesting.rules.SystemPropertiesInvariantRule$1.evaluate(SystemPropertiesInvariantRule.java:55)
>         at org.apache.lucene.util.TestRuleThreadAndTestName$1.evaluate(TestRuleThreadAndTestName.java:49)
>         at org.apache.lucene.util.TestRuleIgnoreAfterMaxFailures$1.evaluate(TestRuleIgnoreAfterMaxFailures.java:65)
>         at org.apache.lucene.util.TestRuleMarkFailure$1.evaluate(TestRuleMarkFailure.java:48)
>         at com.carrotsearch.randomizedtesting.rules.StatementAdapter.evaluate(StatementAdapter.java:36)
>         at com.carrotsearch.randomizedtesting.ThreadLeakControl$StatementRunner.run(ThreadLeakControl.java:365)
>         at com.carrotsearch.randomizedtesting.ThreadLeakControl.forkTimeoutingTask(ThreadLeakControl.java:798)
>         at com.carrotsearch.randomizedtesting.ThreadLeakControl$3.evaluate(ThreadLeakControl.java:458)
>         at com.carrotsearch.randomizedtesting.RandomizedRunner.runSingleTest(RandomizedRunner.java:836)
>         at com.carrotsearch.randomizedtesting.RandomizedRunner$3.evaluate(RandomizedRunner.java:738)
>         at com.carrotsearch.randomizedtesting.RandomizedRunner$4.evaluate(RandomizedRunner.java:772)
>         at com.carrotsearch.randomizedtesting.RandomizedRunner$5.evaluate(RandomizedRunner.java:783)
>         at org.apache.lucene.util.AbstractBeforeAfterRule$1.evaluate(AbstractBeforeAfterRule.java:46)
>         at org.apache.lucene.util.TestRuleStoreClassName$1.evaluate(TestRuleStoreClassName.java:42)
>         at com.carrotsearch.randomizedtesting.rules.SystemPropertiesInvariantRule$1.evaluate(SystemPropertiesInvariantRule.java:55)
>         at com.carrotsearch.randomizedtesting.rules.NoShadowingOrOverridesOnMethodsRule$1.evaluate(NoShadowingOrOverridesOnMethodsRule.java:39)
>         at com.carrotsearch.randomizedtesting.rules.NoShadowingOrOverridesOnMethodsRule$1.evaluate(NoShadowingOrOverridesOnMethodsRule.java:39)
>         at com.carrotsearch.randomizedtesting.rules.StatementAdapter.evaluate(StatementAdapter.java:36)
>         at com.carrotsearch.randomizedtesting.rules.StatementAdapter.evaluate(StatementAdapter.java:36)
>         at com.carrotsearch.randomizedtesting.rules.StatementAdapter.evaluate(StatementAdapter.java:36)
>         at org.apache.lucene.util.TestRuleAssertionsRequired$1.evaluate(TestRuleAssertionsRequired.java:43)
>         at org.apache.lucene.util.TestRuleMarkFailure$1.evaluate(TestRuleMarkFailure.java:48)
>         at org.apache.lucene.util.TestRuleIgnoreAfterMaxFailures$1.evaluate(TestRuleIgnoreAfterMaxFailures.java:65)
>         at org.apache.lucene.util.TestRuleIgnoreTestSuites$1.evaluate(TestRuleIgnoreTestSuites.java:55)
>         at com.carrotsearch.randomizedtesting.rules.StatementAdapter.evaluate(StatementAdapter.java:36)
>         at com.carrotsearch.randomizedtesting.ThreadLeakControl$StatementRunner.run(ThreadLeakControl.java:365)
>         at java.lang.Thread.run(Thread.java:745)
> Caused by: java.lang.RuntimeException: unclosed IndexInput: _1_1.dvd
>         at org.apache.lucene.store.MockDirectoryWrapper.addFileHandle(MockDirectoryWrapper.java:559)
>         at org.apache.lucene.store.MockDirectoryWrapper.openInput(MockDirectoryWrapper.java:603)
>         at org.apache.lucene.codecs.lucene410.Lucene410DocValuesProducer.<init>(Lucene410DocValuesProducer.java:120)
>         at org.apache.lucene.codecs.lucene410.Lucene410DocValuesFormat.fieldsProducer(Lucene410DocValuesFormat.java:181)
>         at org.apache.lucene.index.SegmentDocValues.newDocValuesProducer(SegmentDocValues.java:51)
>         at org.apache.lucene.index.SegmentDocValues.getDocValuesProducer(SegmentDocValues.java:68)
>         at org.apache.lucene.index.SegmentDocValuesProducer.<init>(SegmentDocValuesProducer.java:67)
>         at org.apache.lucene.index.SegmentReader.initDocValuesProducer(SegmentReader.java:187)
>         at org.apache.lucene.index.SegmentReader.<init>(SegmentReader.java:166)
>         at org.apache.lucene.index.ReadersAndUpdates.writeFieldUpdates(ReadersAndUpdates.java:587)
>         at org.apache.lucene.index.BufferedUpdatesStream.applyDeletesAndUpdates(BufferedUpdatesStream.java:233)
>         at org.apache.lucene.index.IndexWriter.applyAllDeletesAndUpdates(IndexWriter.java:3100)
>         at org.apache.lucene.index.IndexWriter.maybeApplyDeletes(IndexWriter.java:3091)
>         at org.apache.lucene.index.IndexWriter.prepareCommitInternal(IndexWriter.java:2805)
>         at org.apache.lucene.index.IndexWriter.commitInternal(IndexWriter.java:2954)
>         at org.apache.lucene.index.IndexWriter.commit(IndexWriter.java:2921)
>         at org.apache.lucene.index.TestIndexWriterOutOfMemory.testBasics(TestIndexWriterOutOfMemory.java:214)
>         ... 37 more
>
>
>
>
> Build Log:
> [...truncated 1694 lines...]
>    [junit4] Suite: org.apache.lucene.index.TestIndexWriterOutOfMemory
>    [junit4]   1> Unexpected exception: dumping fake-exception-log:...
>    [junit4]   1>
>    [junit4]   1> TEST: got expected fake exc:Fake OutOfMemoryError
>    [junit4]   1> java.lang.OutOfMemoryError: Fake OutOfMemoryError
>    [junit4]   1>        at org.apache.lucene.index.TestIndexWriterOutOfMemory$2.eval(TestIndexWriterOutOfMemory.java:118)
>    [junit4]   1>        at org.apache.lucene.store.MockDirectoryWrapper.maybeThrowDeterministicException(MockDirectoryWrapper.java:887)
>    [junit4]   1>        at org.apache.lucene.store.MockIndexOutputWrapper.writeBytes(MockIndexOutputWrapper.java:128)
>    [junit4]   1>        at org.apache.lucene.store.DataOutput.writeBytes(DataOutput.java:53)
>    [junit4]   1>        at org.apache.lucene.util.packed.DirectWriter.flush(DirectWriter.java:86)
>    [junit4]   1>        at org.apache.lucene.util.packed.DirectWriter.finish(DirectWriter.java:97)
>    [junit4]   1>        at org.apache.lucene.codecs.lucene410.Lucene410DocValuesConsumer.addNumericField(Lucene410DocValuesConsumer.java:218)
>    [junit4]   1>        at org.apache.lucene.codecs.lucene410.Lucene410DocValuesConsumer.addSortedField(Lucene410DocValuesConsumer.java:472)
>    [junit4]   1>        at org.apache.lucene.index.SortedDocValuesWriter.flush(SortedDocValuesWriter.java:124)
>    [junit4]   1>        at org.apache.lucene.index.DefaultIndexingChain.writeDocValues(DefaultIndexingChain.java:142)
>    [junit4]   1>        at org.apache.lucene.index.DefaultIndexingChain.flush(DefaultIndexingChain.java:96)
>    [junit4]   1>        at org.apache.lucene.index.DocumentsWriterPerThread.flush(DocumentsWriterPerThread.java:441)
>    [junit4]   1>        at org.apache.lucene.index.DocumentsWriter.doFlush(DocumentsWriter.java:510)
>    [junit4]   1>        at org.apache.lucene.index.DocumentsWriter.flushAllThreads(DocumentsWriter.java:621)
>    [junit4]   1>        at org.apache.lucene.index.IndexWriter.getReader(IndexWriter.java:412)
>    [junit4]   1>        at org.apache.lucene.index.DirectoryReader.open(DirectoryReader.java:87)
>    [junit4]   1>        at org.apache.lucene.index.TestIndexWriterOutOfMemory.testBasics(TestIndexWriterOutOfMemory.java:208)
>    [junit4]   1>        at sun.reflect.NativeMethodAccessorImpl.invoke0(Native Method)
>    [junit4]   1>        at sun.reflect.NativeMethodAccessorImpl.invoke(NativeMethodAccessorImpl.java:57)
>    [junit4]   1>        at sun.reflect.DelegatingMethodAccessorImpl.invoke(DelegatingMethodAccessorImpl.java:43)
>    [junit4]   1>        at java.lang.reflect.Method.invoke(Method.java:606)
>    [junit4]   1>        at com.carrotsearch.randomizedtesting.RandomizedRunner.invoke(RandomizedRunner.java:1618)
>    [junit4]   1>        at com.carrotsearch.randomizedtesting.RandomizedRunner$6.evaluate(RandomizedRunner.java:827)
>    [junit4]   1>        at com.carrotsearch.randomizedtesting.RandomizedRunner$7.evaluate(RandomizedRunner.java:863)
>    [junit4]   1>        at com.carrotsearch.randomizedtesting.RandomizedRunner$8.evaluate(RandomizedRunner.java:877)
>    [junit4]   1>        at org.apache.lucene.util.TestRuleSetupTeardownChained$1.evaluate(TestRuleSetupTeardownChained.java:50)
>    [junit4]   1>        at org.apache.lucene.util.AbstractBeforeAfterRule$1.evaluate(AbstractBeforeAfterRule.java:46)
>    [junit4]   1>        at com.carrotsearch.randomizedtesting.rules.SystemPropertiesInvariantRule$1.evaluate(SystemPropertiesInvariantRule.java:55)
>    [junit4]   1>        at org.apache.lucene.util.TestRuleThreadAndTestName$1.evaluate(TestRuleThreadAndTestName.java:49)
>    [junit4]   1>        at org.apache.lucene.util.TestRuleIgnoreAfterMaxFailures$1.evaluate(TestRuleIgnoreAfterMaxFailures.java:65)
>    [junit4]   1>        at org.apache.lucene.util.TestRuleMarkFailure$1.evaluate(TestRuleMarkFailure.java:48)
>    [junit4]   1>        at com.carrotsearch.randomizedtesting.rules.StatementAdapter.evaluate(StatementAdapter.java:36)
>    [junit4]   1>        at com.carrotsearch.randomizedtesting.ThreadLeakControl$StatementRunner.run(ThreadLeakControl.java:365)
>    [junit4]   1>        at com.carrotsearch.randomizedtesting.ThreadLeakControl.forkTimeoutingTask(ThreadLeakControl.java:798)
>    [junit4]   1>        at com.carrotsearch.randomizedtesting.ThreadLeakControl$3.evaluate(ThreadLeakControl.java:458)
>    [junit4]   1>        at com.carrotsearch.randomizedtesting.RandomizedRunner.runSingleTest(RandomizedRunner.java:836)
>    [junit4]   1>        at com.carrotsearch.randomizedtesting.RandomizedRunner$3.evaluate(RandomizedRunner.java:738)
>    [junit4]   1>        at com.carrotsearch.randomizedtesting.RandomizedRunner$4.evaluate(RandomizedRunner.java:772)
>    [junit4]   1>        at com.carrotsearch.randomizedtesting.RandomizedRunner$5.evaluate(RandomizedRunner.java:783)
>    [junit4]   1>        at org.apache.lucene.util.AbstractBeforeAfterRule$1.evaluate(AbstractBeforeAfterRule.java:46)
>    [junit4]   1>        at org.apache.lucene.util.TestRuleStoreClassName$1.evaluate(TestRuleStoreClassName.java:42)
>    [junit4]   1>        at com.carrotsearch.randomizedtesting.rules.SystemPropertiesInvariantRule$1.evaluate(SystemPropertiesInvariantRule.java:55)
>    [junit4]   1>        at com.carrotsearch.randomizedtesting.rules.NoShadowingOrOverridesOnMethodsRule$1.evaluate(NoShadowingOrOverridesOnMethodsRule.java:39)
>    [junit4]   1>        at com.carrotsearch.randomizedtesting.rules.NoShadowingOrOverridesOnMethodsRule$1.evaluate(NoShadowingOrOverridesOnMethodsRule.java:39)
>    [junit4]   1>        at com.carrotsearch.randomizedtesting.rules.StatementAdapter.evaluate(StatementAdapter.java:36)
>    [junit4]   1>        at com.carrotsearch.randomizedtesting.rules.StatementAdapter.evaluate(StatementAdapter.java:36)
>    [junit4]   1>        at com.carrotsearch.randomizedtesting.rules.StatementAdapter.evaluate(StatementAdapter.java:36)
>    [junit4]   1>        at org.apache.lucene.util.TestRuleAssertionsRequired$1.evaluate(TestRuleAssertionsRequired.java:43)
>    [junit4]   1>        at org.apache.lucene.util.TestRuleMarkFailure$1.evaluate(TestRuleMarkFailure.java:48)
>    [junit4]   1>        at org.apache.lucene.util.TestRuleIgnoreAfterMaxFailures$1.evaluate(TestRuleIgnoreAfterMaxFailures.java:65)
>    [junit4]   1>        at org.apache.lucene.util.TestRuleIgnoreTestSuites$1.evaluate(TestRuleIgnoreTestSuites.java:55)
>    [junit4]   1>        at com.carrotsearch.randomizedtesting.rules.StatementAdapter.evaluate(StatementAdapter.java:36)
>    [junit4]   1>        at com.carrotsearch.randomizedtesting.ThreadLeakControl$StatementRunner.run(ThreadLeakControl.java:365)
>    [junit4]   1>        at java.lang.Thread.run(Thread.java:745)
>    [junit4]   1>
>    [junit4]   1> TEST: got expected fake exc:Fake OutOfMemoryError
>    [junit4]   1> java.lang.OutOfMemoryError: Fake OutOfMemoryError
>    [junit4]   1>        at org.apache.lucene.index.TestIndexWriterOutOfMemory$2.eval(TestIndexWriterOutOfMemory.java:118)
>    [junit4]   1>        at org.apache.lucene.store.MockDirectoryWrapper.maybeThrowDeterministicException(MockDirectoryWrapper.java:887)
>    [junit4]   1>        at org.apache.lucene.store.MockIndexOutputWrapper.writeBytes(MockIndexOutputWrapper.java:128)
>    [junit4]   1>        at org.apache.lucene.store.MockIndexOutputWrapper.writeByte(MockIndexOutputWrapper.java:111)
>    [junit4]   1>        at org.apache.lucene.store.DataOutput.writeInt(DataOutput.java:74)
>    [junit4]   1>        at org.apache.lucene.store.DataOutput.writeLong(DataOutput.java:218)
>    [junit4]   1>        at org.apache.lucene.codecs.lucene49.Lucene49NormsConsumer.addNormsField(Lucene49NormsConsumer.java:138)
>    [junit4]   1>        at org.apache.lucene.index.NormValuesWriter.flush(NormValuesWriter.java:72)
>    [junit4]   1>        at org.apache.lucene.index.DefaultIndexingChain.writeNorms(DefaultIndexingChain.java:191)
>    [junit4]   1>        at org.apache.lucene.index.DefaultIndexingChain.flush(DefaultIndexingChain.java:95)
>    [junit4]   1>        at org.apache.lucene.index.DocumentsWriterPerThread.flush(DocumentsWriterPerThread.java:441)
>    [junit4]   1>        at org.apache.lucene.index.DocumentsWriter.doFlush(DocumentsWriter.java:510)
>    [junit4]   1>        at org.apache.lucene.index.DocumentsWriter.flushAllThreads(DocumentsWriter.java:621)
>    [junit4]   1>        at org.apache.lucene.index.IndexWriter.getReader(IndexWriter.java:412)
>    [junit4]   1>        at org.apache.lucene.index.DirectoryReader.open(DirectoryReader.java:87)
>    [junit4]   1>        at org.apache.lucene.index.TestIndexWriterOutOfMemory.testBasics(TestIndexWriterOutOfMemory.java:208)
>    [junit4]   1>        at sun.reflect.NativeMethodAccessorImpl.invoke0(Native Method)
>    [junit4]   1>        at sun.reflect.NativeMethodAccessorImpl.invoke(NativeMethodAccessorImpl.java:57)
>    [junit4]   1>        at sun.reflect.DelegatingMethodAccessorImpl.invoke(DelegatingMethodAccessorImpl.java:43)
>    [junit4]   1>        at java.lang.reflect.Method.invoke(Method.java:606)
>    [junit4]   1>        at com.carrotsearch.randomizedtesting.RandomizedRunner.invoke(RandomizedRunner.java:1618)
>    [junit4]   1>        at com.carrotsearch.randomizedtesting.RandomizedRunner$6.evaluate(RandomizedRunner.java:827)
>    [junit4]   1>        at com.carrotsearch.randomizedtesting.RandomizedRunner$7.evaluate(RandomizedRunner.java:863)
>    [junit4]   1>        at com.carrotsearch.randomizedtesting.RandomizedRunner$8.evaluate(RandomizedRunner.java:877)
>    [junit4]   1>        at org.apache.lucene.util.TestRuleSetupTeardownChained$1.evaluate(TestRuleSetupTeardownChained.java:50)
>    [junit4]   1>        at org.apache.lucene.util.AbstractBeforeAfterRule$1.evaluate(AbstractBeforeAfterRule.java:46)
>    [junit4]   1>        at com.carrotsearch.randomizedtesting.rules.SystemPropertiesInvariantRule$1.evaluate(SystemPropertiesInvariantRule.java:55)
>    [junit4]   1>        at org.apache.lucene.util.TestRuleThreadAndTestName$1.evaluate(TestRuleThreadAndTestName.java:49)
>    [junit4]   1>        at org.apache.lucene.util.TestRuleIgnoreAfterMaxFailures$1.evaluate(TestRuleIgnoreAfterMaxFailures.java:65)
>    [junit4]   1>        at org.apache.lucene.util.TestRuleMarkFailure$1.evaluate(TestRuleMarkFailure.java:48)
>    [junit4]   1>        at com.carrotsearch.randomizedtesting.rules.StatementAdapter.evaluate(StatementAdapter.java:36)
>    [junit4]   1>        at com.carrotsearch.randomizedtesting.ThreadLeakControl$StatementRunner.run(ThreadLeakControl.java:365)
>    [junit4]   1>        at com.carrotsearch.randomizedtesting.ThreadLeakControl.forkTimeoutingTask(ThreadLeakControl.java:798)
>    [junit4]   1>        at com.carrotsearch.randomizedtesting.ThreadLeakControl$3.evaluate(ThreadLeakControl.java:458)
>    [junit4]   1>        at com.carrotsearch.randomizedtesting.RandomizedRunner.runSingleTest(RandomizedRunner.java:836)
>    [junit4]   1>        at com.carrotsearch.randomizedtesting.RandomizedRunner$3.evaluate(RandomizedRunner.java:738)
>    [junit4]   1>        at com.carrotsearch.randomizedtesting.RandomizedRunner$4.evaluate(RandomizedRunner.java:772)
>    [junit4]   1>        at com.carrotsearch.randomizedtesting.RandomizedRunner$5.evaluate(RandomizedRunner.java:783)
>    [junit4]   1>        at org.apache.lucene.util.AbstractBeforeAfterRule$1.evaluate(AbstractBeforeAfterRule.java:46)
>    [junit4]   1>        at org.apache.lucene.util.TestRuleStoreClassName$1.evaluate(TestRuleStoreClassName.java:42)
>    [junit4]   1>        at com.carrotsearch.randomizedtesting.rules.SystemPropertiesInvariantRule$1.evaluate(SystemPropertiesInvariantRule.java:55)
>    [junit4]   1>        at com.carrotsearch.randomizedtesting.rules.NoShadowingOrOverridesOnMethodsRule$1.evaluate(NoShadowingOrOverridesOnMethodsRule.java:39)
>    [junit4]   1>        at com.carrotsearch.randomizedtesting.rules.NoShadowingOrOverridesOnMethodsRule$1.evaluate(NoShadowingOrOverridesOnMethodsRule.java:39)
>    [junit4]   1>        at com.carrotsearch.randomizedtesting.rules.StatementAdapter.evaluate(StatementAdapter.java:36)
>    [junit4]   1>        at com.carrotsearch.randomizedtesting.rules.StatementAdapter.evaluate(StatementAdapter.java:36)
>    [junit4]   1>        at com.carrotsearch.randomizedtesting.rules.StatementAdapter.evaluate(StatementAdapter.java:36)
>    [junit4]   1>        at org.apache.lucene.util.TestRuleAssertionsRequired$1.evaluate(TestRuleAssertionsRequired.java:43)
>    [junit4]   1>        at org.apache.lucene.util.TestRuleMarkFailure$1.evaluate(TestRuleMarkFailure.java:48)
>    [junit4]   1>        at org.apache.lucene.util.TestRuleIgnoreAfterMaxFailures$1.evaluate(TestRuleIgnoreAfterMaxFailures.java:65)
>    [junit4]   1>        at org.apache.lucene.util.TestRuleIgnoreTestSuites$1.evaluate(TestRuleIgnoreTestSuites.java:55)
>    [junit4]   1>        at com.carrotsearch.randomizedtesting.rules.StatementAdapter.evaluate(StatementAdapter.java:36)
>    [junit4]   1>        at com.carrotsearch.randomizedtesting.ThreadLeakControl$StatementRunner.run(ThreadLeakControl.java:365)
>    [junit4]   1>        at java.lang.Thread.run(Thread.java:745)
>    [junit4]   1>
>    [junit4]   1> TEST: got expected fake exc:Fake OutOfMemoryError
>    [junit4]   1> java.lang.OutOfMemoryError: Fake OutOfMemoryError
>    [junit4]   1>        at org.apache.lucene.index.TestIndexWriterOutOfMemory$2.eval(TestIndexWriterOutOfMemory.java:118)
>    [junit4]   1>        at org.apache.lucene.store.MockDirectoryWrapper.maybeThrowDeterministicException(MockDirectoryWrapper.java:887)
>    [junit4]   1>        at org.apache.lucene.store.MockIndexOutputWrapper.writeBytes(MockIndexOutputWrapper.java:128)
>    [junit4]   1>        at org.apache.lucene.store.MockIndexOutputWrapper.writeByte(MockIndexOutputWrapper.java:111)
>    [junit4]   1>        at org.apache.lucene.store.DataOutput.writeInt(DataOutput.java:73)
>    [junit4]   1>        at org.apache.lucene.codecs.CodecUtil.writeFooter(CodecUtil.java:185)
>    [junit4]   1>        at org.apache.lucene.codecs.lucene49.Lucene49NormsConsumer.close(Lucene49NormsConsumer.java:173)
>    [junit4]   1>        at org.apache.lucene.util.IOUtils.close(IOUtils.java:77)
>    [junit4]   1>        at org.apache.lucene.index.DefaultIndexingChain.writeNorms(DefaultIndexingChain.java:202)
>    [junit4]   1>        at org.apache.lucene.index.DefaultIndexingChain.flush(DefaultIndexingChain.java:95)
>    [junit4]   1>        at org.apache.lucene.index.DocumentsWriterPerThread.flush(DocumentsWriterPerThread.java:441)
>    [junit4]   1>        at org.apache.lucene.index.DocumentsWriter.doFlush(DocumentsWriter.java:510)
>    [junit4]   1>        at org.apache.lucene.index.DocumentsWriter.flushAllThreads(DocumentsWriter.java:621)
>    [junit4]   1>        at org.apache.lucene.index.IndexWriter.prepareCommitInternal(IndexWriter.java:2795)
>    [junit4]   1>        at org.apache.lucene.index.IndexWriter.commitInternal(IndexWriter.java:2954)
>    [junit4]   1>        at org.apache.lucene.index.IndexWriter.commit(IndexWriter.java:2921)
>    [junit4]   1>        at org.apache.lucene.index.TestIndexWriterOutOfMemory.testBasics(TestIndexWriterOutOfMemory.java:214)
>    [junit4]   1>        at sun.reflect.NativeMethodAccessorImpl.invoke0(Native Method)
>    [junit4]   1>        at sun.reflect.NativeMethodAccessorImpl.invoke(NativeMethodAccessorImpl.java:57)
>    [junit4]   1>        at sun.reflect.DelegatingMethodAccessorImpl.invoke(DelegatingMethodAccessorImpl.java:43)
>    [junit4]   1>        at java.lang.reflect.Method.invoke(Method.java:606)
>    [junit4]   1>        at com.carrotsearch.randomizedtesting.RandomizedRunner.invoke(RandomizedRunner.java:1618)
>    [junit4]   1>        at com.carrotsearch.randomizedtesting.RandomizedRunner$6.evaluate(RandomizedRunner.java:827)
>    [junit4]   1>        at com.carrotsearch.randomizedtesting.RandomizedRunner$7.evaluate(RandomizedRunner.java:863)
>    [junit4]   1>        at com.carrotsearch.randomizedtesting.RandomizedRunner$8.evaluate(RandomizedRunner.java:877)
>    [junit4]   1>        at org.apache.lucene.util.TestRuleSetupTeardownChained$1.evaluate(TestRuleSetupTeardownChained.java:50)
>    [junit4]   1>        at org.apache.lucene.util.AbstractBeforeAfterRule$1.evaluate(AbstractBeforeAfterRule.java:46)
>    [junit4]   1>        at com.carrotsearch.randomizedtesting.rules.SystemPropertiesInvariantRule$1.evaluate(SystemPropertiesInvariantRule.java:55)
>    [junit4]   1>        at org.apache.lucene.util.TestRuleThreadAndTestName$1.evaluate(TestRuleThreadAndTestName.java:49)
>    [junit4]   1>        at org.apache.lucene.util.TestRuleIgnoreAfterMaxFailures$1.evaluate(TestRuleIgnoreAfterMaxFailures.java:65)
>    [junit4]   1>        at org.apache.lucene.util.TestRuleMarkFailure$1.evaluate(TestRuleMarkFailure.java:48)
>    [junit4]   1>        at com.carrotsearch.randomizedtesting.rules.StatementAdapter.evaluate(StatementAdapter.java:36)
>    [junit4]   1>        at com.carrotsearch.randomizedtesting.ThreadLeakControl$StatementRunner.run(ThreadLeakControl.java:365)
>    [junit4]   1>        at com.carrotsearch.randomizedtesting.ThreadLeakControl.forkTimeoutingTask(ThreadLeakControl.java:798)
>    [junit4]   1>        at com.carrotsearch.randomizedtesting.ThreadLeakControl$3.evaluate(ThreadLeakControl.java:458)
>    [junit4]   1>        at com.carrotsearch.randomizedtesting.RandomizedRunner.runSingleTest(RandomizedRunner.java:836)
>    [junit4]   1>        at com.carrotsearch.randomizedtesting.RandomizedRunner$3.evaluate(RandomizedRunner.java:738)
>    [junit4]   1>        at com.carrotsearch.randomizedtesting.RandomizedRunner$4.evaluate(RandomizedRunner.java:772)
>    [junit4]   1>        at com.carrotsearch.randomizedtesting.RandomizedRunner$5.evaluate(RandomizedRunner.java:783)
>    [junit4]   1>        at org.apache.lucene.util.AbstractBeforeAfterRule$1.evaluate(AbstractBeforeAfterRule.java:46)
>    [junit4]   1>        at org.apache.lucene.util.TestRuleStoreClassName$1.evaluate(TestRuleStoreClassName.java:42)
>    [junit4]   1>        at com.carrotsearch.randomizedtesting.rules.SystemPropertiesInvariantRule$1.evaluate(SystemPropertiesInvariantRule.java:55)
>    [junit4]   1>        at com.carrotsearch.randomizedtesting.rules.NoShadowingOrOverridesOnMethodsRule$1.evaluate(NoShadowingOrOverridesOnMethodsRule.java:39)
>    [junit4]   1>        at com.carrotsearch.randomizedtesting.rules.NoShadowingOrOverridesOnMethodsRule$1.evaluate(NoShadowingOrOverridesOnMethodsRule.java:39)
>    [junit4]   1>        at com.carrotsearch.randomizedtesting.rules.StatementAdapter.evaluate(StatementAdapter.java:36)
>    [junit4]   1>        at com.carrotsearch.randomizedtesting.rules.StatementAdapter.evaluate(StatementAdapter.java:36)
>    [junit4]   1>        at com.carrotsearch.randomizedtesting.rules.StatementAdapter.evaluate(StatementAdapter.java:36)
>    [junit4]   1>        at org.apache.lucene.util.TestRuleAssertionsRequired$1.evaluate(TestRuleAssertionsRequired.java:43)
>    [junit4]   1>        at org.apache.lucene.util.TestRuleMarkFailure$1.evaluate(TestRuleMarkFailure.java:48)
>    [junit4]   1>        at org.apache.lucene.util.TestRuleIgnoreAfterMaxFailures$1.evaluate(TestRuleIgnoreAfterMaxFailures.java:65)
>    [junit4]   1>        at org.apache.lucene.util.TestRuleIgnoreTestSuites$1.evaluate(TestRuleIgnoreTestSuites.java:55)
>    [junit4]   1>        at com.carrotsearch.randomizedtesting.rules.StatementAdapter.evaluate(StatementAdapter.java:36)
>    [junit4]   1>        at com.carrotsearch.randomizedtesting.ThreadLeakControl$StatementRunner.run(ThreadLeakControl.java:365)
>    [junit4]   1>        at java.lang.Thread.run(Thread.java:745)
>    [junit4]   1>
>    [junit4]   1> TEST: got expected fake exc:Fake OutOfMemoryError
>    [junit4]   1> java.lang.OutOfMemoryError: Fake OutOfMemoryError
>    [junit4]   1>        at org.apache.lucene.index.TestIndexWriterOutOfMemory$2.eval(TestIndexWriterOutOfMemory.java:118)
>    [junit4]   1>        at org.apache.lucene.store.MockDirectoryWrapper.maybeThrowDeterministicException(MockDirectoryWrapper.java:887)
>    [junit4]   1>        at org.apache.lucene.store.MockIndexOutputWrapper.writeBytes(MockIndexOutputWrapper.java:128)
>    [junit4]   1>        at org.apache.lucene.store.MockIndexOutputWrapper.writeByte(MockIndexOutputWrapper.java:111)
>    [junit4]   1>        at org.apache.lucene.store.DataOutput.writeInt(DataOutput.java:71)
>    [junit4]   1>        at org.apache.lucene.store.DataOutput.writeLong(DataOutput.java:218)
>    [junit4]   1>        at org.apache.lucene.codecs.lucene49.Lucene49NormsConsumer.addNormsField(Lucene49NormsConsumer.java:141)
>    [junit4]   1>        at org.apache.lucene.index.NormValuesWriter.flush(NormValuesWriter.java:72)
>    [junit4]   1>        at org.apache.lucene.index.DefaultIndexingChain.writeNorms(DefaultIndexingChain.java:191)
>    [junit4]   1>        at org.apache.lucene.index.DefaultIndexingChain.flush(DefaultIndexingChain.java:95)
>    [junit4]   1>        at org.apache.lucene.index.DocumentsWriterPerThread.flush(DocumentsWriterPerThread.java:441)
>    [junit4]   1>        at org.apache.lucene.index.DocumentsWriter.doFlush(DocumentsWriter.java:510)
>    [junit4]   1>        at org.apache.lucene.index.DocumentsWriter.flushAllThreads(DocumentsWriter.java:621)
>    [junit4]   1>        at org.apache.lucene.index.IndexWriter.prepareCommitInternal(IndexWriter.java:2795)
>    [junit4]   1>        at org.apache.lucene.index.IndexWriter.commitInternal(IndexWriter.java:2954)
>    [junit4]   1>        at org.apache.lucene.index.IndexWriter.commit(IndexWriter.java:2921)
>    [junit4]   1>        at org.apache.lucene.index.TestIndexWriterOutOfMemory.testBasics(TestIndexWriterOutOfMemory.java:214)
>    [junit4]   1>        at sun.reflect.NativeMethodAccessorImpl.invoke0(Native Method)
>    [junit4]   1>        at sun.reflect.NativeMethodAccessorImpl.invoke(NativeMethodAccessorImpl.java:57)
>    [junit4]   1>        at sun.reflect.DelegatingMethodAccessorImpl.invoke(DelegatingMethodAccessorImpl.java:43)
>    [junit4]   1>        at java.lang.reflect.Method.invoke(Method.java:606)
>    [junit4]   1>        at com.carrotsearch.randomizedtesting.RandomizedRunner.invoke(RandomizedRunner.java:1618)
>    [junit4]   1>        at com.carrotsearch.randomizedtesting.RandomizedRunner$6.evaluate(RandomizedRunner.java:827)
>    [junit4]   1>        at com.carrotsearch.randomizedtesting.RandomizedRunner$7.evaluate(RandomizedRunner.java:863)
>    [junit4]   1>        at com.carrotsearch.randomizedtesting.RandomizedRunner$8.evaluate(RandomizedRunner.java:877)
>    [junit4]   1>        at org.apache.lucene.util.TestRuleSetupTeardownChained$1.evaluate(TestRuleSetupTeardownChained.java:50)
>    [junit4]   1>        at org.apache.lucene.util.AbstractBeforeAfterRule$1.evaluate(AbstractBeforeAfterRule.java:46)
>    [junit4]   1>        at com.carrotsearch.randomizedtesting.rules.SystemPropertiesInvariantRule$1.evaluate(SystemPropertiesInvariantRule.java:55)
>    [junit4]   1>        at org.apache.lucene.util.TestRuleThreadAndTestName$1.evaluate(TestRuleThreadAndTestName.java:49)
>    [junit4]   1>        at org.apache.lucene.util.TestRuleIgnoreAfterMaxFailures$1.evaluate(TestRuleIgnoreAfterMaxFailures.java:65)
>    [junit4]   1>        at org.apache.lucene.util.TestRuleMarkFailure$1.evaluate(TestRuleMarkFailure.java:48)
>    [junit4]   1>        at com.carrotsearch.randomizedtesting.rules.StatementAdapter.evaluate(StatementAdapter.java:36)
>    [junit4]   1>        at com.carrotsearch.randomizedtesting.ThreadLeakControl$StatementRunner.run(ThreadLeakControl.java:365)
>    [junit4]   1>        at com.carrotsearch.randomizedtesting.ThreadLeakControl.forkTimeoutingTask(ThreadLeakControl.java:798)
>    [junit4]   1>        at com.carrotsearch.randomizedtesting.ThreadLeakControl$3.evaluate(ThreadLeakControl.java:458)
>    [junit4]   1>        at com.carrotsearch.randomizedtesting.RandomizedRunner.runSingleTest(RandomizedRunner.java:836)
>    [junit4]   1>        at com.carrotsearch.randomizedtesting.RandomizedRunner$3.evaluate(RandomizedRunner.java:738)
>    [junit4]   1>        at com.carrotsearch.randomizedtesting.RandomizedRunner$4.evaluate(RandomizedRunner.java:772)
>    [junit4]   1>        at com.carrotsearch.randomizedtesting.RandomizedRunner$5.evaluate(RandomizedRunner.java:783)
>    [junit4]   1>        at org.apache.lucene.util.AbstractBeforeAfterRule$1.evaluate(AbstractBeforeAfterRule.java:46)
>    [junit4]   1>        at org.apache.lucene.util.TestRuleStoreClassName$1.evaluate(TestRuleStoreClassName.java:42)
>    [junit4]   1>        at com.carrotsearch.randomizedtesting.rules.SystemPropertiesInvariantRule$1.evaluate(SystemPropertiesInvariantRule.java:55)
>    [junit4]   1>        at com.carrotsearch.randomizedtesting.rules.NoShadowingOrOverridesOnMethodsRule$1.evaluate(NoShadowingOrOverridesOnMethodsRule.java:39)
>    [junit4]   1>        at com.carrotsearch.randomizedtesting.rules.NoShadowingOrOverridesOnMethodsRule$1.evaluate(NoShadowingOrOverridesOnMethodsRule.java:39)
>    [junit4]   1>        at com.carrotsearch.randomizedtesting.rules.StatementAdapter.evaluate(StatementAdapter.java:36)
>    [junit4]   1>        at com.carrotsearch.randomizedtesting.rules.StatementAdapter.evaluate(StatementAdapter.java:36)
>    [junit4]   1>        at com.carrotsearch.randomizedtesting.rules.StatementAdapter.evaluate(StatementAdapter.java:36)
>    [junit4]   1>        at org.apache.lucene.util.TestRuleAssertionsRequired$1.evaluate(TestRuleAssertionsRequired.java:43)
>    [junit4]   1>        at org.apache.lucene.util.TestRuleMarkFailure$1.evaluate(TestRuleMarkFailure.java:48)
>    [junit4]   1>        at org.apache.lucene.util.TestRuleIgnoreAfterMaxFailures$1.evaluate(TestRuleIgnoreAfterMaxFailures.java:65)
>    [junit4]   1>        at org.apache.lucene.util.TestRuleIgnoreTestSuites$1.evaluate(TestRuleIgnoreTestSuites.java:55)
>    [junit4]   1>        at com.carrotsearch.randomizedtesting.rules.StatementAdapter.evaluate(StatementAdapter.java:36)
>    [junit4]   1>        at com.carrotsearch.randomizedtesting.ThreadLeakControl$StatementRunner.run(ThreadLeakControl.java:365)
>    [junit4]   1>        at java.lang.Thread.run(Thread.java:745)
>    [junit4]   1>
>    [junit4]   1> TEST: got expected fake exc:Fake OutOfMemoryError
>    [junit4]   1> java.lang.OutOfMemoryError: Fake OutOfMemoryError
>    [junit4]   1>        at org.apache.lucene.index.TestIndexWriterOutOfMemory$2.eval(TestIndexWriterOutOfMemory.java:118)
>    [junit4]   1>        at org.apache.lucene.store.MockDirectoryWrapper.maybeThrowDeterministicException(MockDirectoryWrapper.java:887)
>    [junit4]   1>        at org.apache.lucene.store.MockIndexOutputWrapper.writeBytes(MockIndexOutputWrapper.java:128)
>    [junit4]   1>        at org.apache.lucene.store.MockIndexOutputWrapper.writeByte(MockIndexOutputWrapper.java:111)
>    [junit4]   1>        at org.apache.lucene.store.DataOutput.writeVInt(DataOutput.java:196)
>    [junit4]   1>        at org.apache.lucene.store.DataOutput.writeString(DataOutput.java:261)
>    [junit4]   1>        at org.apache.lucene.codecs.CodecUtil.writeHeader(CodecUtil.java:88)
>    [junit4]   1>        at org.apache.lucene.codecs.compressing.CompressingTermVectorsWriter.<init>(CompressingTermVectorsWriter.java:235)
>    [junit4]   1>        at org.apache.lucene.codecs.compressing.CompressingTermVectorsFormat.vectorsWriter(CompressingTermVectorsFormat.java:92)
>    [junit4]   1>        at org.apache.lucene.index.TermVectorsConsumer.initTermVectorsWriter(TermVectorsConsumer.java:88)
>    [junit4]   1>        at org.apache.lucene.index.TermVectorsConsumer.finishDocument(TermVectorsConsumer.java:105)
>    [junit4]   1>        at org.apache.lucene.index.TermsHash.finishDocument(TermsHash.java:93)
>    [junit4]   1>        at org.apache.lucene.index.DefaultIndexingChain.processDocument(DefaultIndexingChain.java:325)
>    [junit4]   1>        at org.apache.lucene.index.DocumentsWriterPerThread.updateDocument(DocumentsWriterPerThread.java:241)
>    [junit4]   1>        at org.apache.lucene.index.DocumentsWriter.updateDocument(DocumentsWriter.java:454)
>    [junit4]   1>        at org.apache.lucene.index.IndexWriter.updateDocument(IndexWriter.java:1390)
>    [junit4]   1>        at org.apache.lucene.index.IndexWriter.addDocument(IndexWriter.java:1105)
>    [junit4]   1>        at org.apache.lucene.index.IndexWriter.addDocument(IndexWriter.java:1086)
>    [junit4]   1>        at org.apache.lucene.index.TestIndexWriterOutOfMemory.testBasics(TestIndexWriterOutOfMemory.java:151)
>    [junit4]   1>        at sun.reflect.NativeMethodAccessorImpl.invoke0(Native Method)
>    [junit4]   1>        at sun.reflect.NativeMethodAccessorImpl.invoke(NativeMethodAccessorImpl.java:57)
>    [junit4]   1>        at sun.reflect.DelegatingMethodAccessorImpl.invoke(DelegatingMethodAccessorImpl.java:43)
>    [junit4]   1>        at java.lang.reflect.Method.invoke(Method.java:606)
>    [junit4]   1>        at com.carrotsearch.randomizedtesting.RandomizedRunner.invoke(RandomizedRunner.java:1618)
>    [junit4]   1>        at com.carrotsearch.randomizedtesting.RandomizedRunner$6.evaluate(RandomizedRunner.java:827)
>    [junit4]   1>        at com.carrotsearch.randomizedtesting.RandomizedRunner$7.evaluate(RandomizedRunner.java:863)
>    [junit4]   1>        at com.carrotsearch.randomizedtesting.RandomizedRunner$8.evaluate(RandomizedRunner.java:877)
>    [junit4]   1>        at org.apache.lucene.util.TestRuleSetupTeardownChained$1.evaluate(TestRuleSetupTeardownChained.java:50)
>    [junit4]   1>        at org.apache.lucene.util.AbstractBeforeAfterRule$1.evaluate(AbstractBeforeAfterRule.java:46)
>    [junit4]   1>        at com.carrotsearch.randomizedtesting.rules.SystemPropertiesInvariantRule$1.evaluate(SystemPropertiesInvariantRule.java:55)
>    [junit4]   1>        at org.apache.lucene.util.TestRuleThreadAndTestName$1.evaluate(TestRuleThreadAndTestName.java:49)
>    [junit4]   1>        at org.apache.lucene.util.TestRuleIgnoreAfterMaxFailures$1.evaluate(TestRuleIgnoreAfterMaxFailures.java:65)
>    [junit4]   1>        at org.apache.lucene.util.TestRuleMarkFailure$1.evaluate(TestRuleMarkFailure.java:48)
>    [junit4]   1>        at com.carrotsearch.randomizedtesting.rules.StatementAdapter.evaluate(StatementAdapter.java:36)
>    [junit4]   1>        at com.carrotsearch.randomizedtesting.ThreadLeakControl$StatementRunner.run(ThreadLeakControl.java:365)
>    [junit4]   1>        at com.carrotsearch.randomizedtesting.ThreadLeakControl.forkTimeoutingTask(ThreadLeakControl.java:798)
>    [junit4]   1>        at com.carrotsearch.randomizedtesting.ThreadLeakControl$3.evaluate(ThreadLeakControl.java:458)
>    [junit4]   1>        at com.carrotsearch.randomizedtesting.RandomizedRunner.runSingleTest(RandomizedRunner.java:836)
>    [junit4]   1>        at com.carrotsearch.randomizedtesting.RandomizedRunner$3.evaluate(RandomizedRunner.java:738)
>    [junit4]   1>        at com.carrotsearch.randomizedtesting.RandomizedRunner$4.evaluate(RandomizedRunner.java:772)
>    [junit4]   1>        at com.carrotsearch.randomizedtesting.RandomizedRunner$5.evaluate(RandomizedRunner.java:783)
>    [junit4]   1>        at org.apache.lucene.util.AbstractBeforeAfterRule$1.evaluate(AbstractBeforeAfterRule.java:46)
>    [junit4]   1>        at org.apache.lucene.util.TestRuleStoreClassName$1.evaluate(TestRuleStoreClassName.java:42)
>    [junit4]   1>        at com.carrotsearch.randomizedtesting.rules.SystemPropertiesInvariantRule$1.evaluate(SystemPropertiesInvariantRule.java:55)
>    [junit4]   1>        at com.carrotsearch.randomizedtesting.rules.NoShadowingOrOverridesOnMethodsRule$1.evaluate(NoShadowingOrOverridesOnMethodsRule.java:39)
>    [junit4]   1>        at com.carrotsearch.randomizedtesting.rules.NoShadowingOrOverridesOnMethodsRule$1.evaluate(NoShadowingOrOverridesOnMethodsRule.java:39)
>    [junit4]   1>        at com.carrotsearch.randomizedtesting.rules.StatementAdapter.evaluate(StatementAdapter.java:36)
>    [junit4]   1>        at com.carrotsearch.randomizedtesting.rules.StatementAdapter.evaluate(StatementAdapter.java:36)
>    [junit4]   1>        at com.carrotsearch.randomizedtesting.rules.StatementAdapter.evaluate(StatementAdapter.java:36)
>    [junit4]   1>        at org.apache.lucene.util.TestRuleAssertionsRequired$1.evaluate(TestRuleAssertionsRequired.java:43)
>    [junit4]   1>        at org.apache.lucene.util.TestRuleMarkFailure$1.evaluate(TestRuleMarkFailure.java:48)
>    [junit4]   1>        at org.apache.lucene.util.TestRuleIgnoreAfterMaxFailures$1.evaluate(TestRuleIgnoreAfterMaxFailures.java:65)
>    [junit4]   1>        at org.apache.lucene.util.TestRuleIgnoreTestSuites$1.evaluate(TestRuleIgnoreTestSuites.java:55)
>    [junit4]   1>        at com.carrotsearch.randomizedtesting.rules.StatementAdapter.evaluate(StatementAdapter.java:36)
>    [junit4]   1>        at com.carrotsearch.randomizedtesting.ThreadLeakControl$StatementRunner.run(ThreadLeakControl.java:365)
>    [junit4]   1>        at java.lang.Thread.run(Thread.java:745)
>    [junit4]   1>
>    [junit4]   1> TEST: got expected fake exc:Fake OutOfMemoryError
>    [junit4]   1> java.lang.OutOfMemoryError: Fake OutOfMemoryError
>    [junit4]   1>        at org.apache.lucene.index.TestIndexWriterOutOfMemory$2.eval(TestIndexWriterOutOfMemory.java:118)
>    [junit4]   1>        at org.apache.lucene.store.MockDirectoryWrapper.maybeThrowDeterministicException(MockDirectoryWrapper.java:887)
>    [junit4]   1>        at org.apache.lucene.store.MockDirectoryWrapper.deleteFile(MockDirectoryWrapper.java:448)
>    [junit4]   1>        at org.apache.lucene.store.MockDirectoryWrapper.deleteFile(MockDirectoryWrapper.java:421)
>    [junit4]   1>        at org.apache.lucene.index.IndexFileDeleter.deleteFile(IndexFileDeleter.java:595)
>    [junit4]   1>        at org.apache.lucene.index.IndexFileDeleter.deleteNewFiles(IndexFileDeleter.java:582)
>    [junit4]   1>        at org.apache.lucene.index.IndexWriter.deleteNewFiles(IndexWriter.java:4555)
>    [junit4]   1>        at org.apache.lucene.index.DocumentsWriter$DeleteNewFilesEvent.process(DocumentsWriter.java:737)
>    [junit4]   1>        at org.apache.lucene.index.IndexWriter.processEvents(IndexWriter.java:4609)
>    [junit4]   1>        at org.apache.lucene.index.IndexWriter.processEvents(IndexWriter.java:4601)
>    [junit4]   1>        at org.apache.lucene.index.IndexWriter.getReader(IndexWriter.java:441)
>    [junit4]   1>        at org.apache.lucene.index.DirectoryReader.open(DirectoryReader.java:87)
>    [junit4]   1>        at org.apache.lucene.index.TestIndexWriterOutOfMemory.testBasics(TestIndexWriterOutOfMemory.java:208)
>    [junit4]   1>        at sun.reflect.NativeMethodAccessorImpl.invoke0(Native Method)
>    [junit4]   1>        at sun.reflect.NativeMethodAccessorImpl.invoke(NativeMethodAccessorImpl.java:57)
>    [junit4]   1>        at sun.reflect.DelegatingMethodAccessorImpl.invoke(DelegatingMethodAccessorImpl.java:43)
>    [junit4]   1>        at java.lang.reflect.Method.invoke(Method.java:606)
>    [junit4]   1>        at com.carrotsearch.randomizedtesting.RandomizedRunner.invoke(RandomizedRunner.java:1618)
>    [junit4]   1>        at com.carrotsearch.randomizedtesting.RandomizedRunner$6.evaluate(RandomizedRunner.java:827)
>    [junit4]   1>        at com.carrotsearch.randomizedtesting.RandomizedRunner$7.evaluate(RandomizedRunner.java:863)
>    [junit4]   1>        at com.carrotsearch.randomizedtesting.RandomizedRunner$8.evaluate(RandomizedRunner.java:877)
>    [junit4]   1>        at org.apache.lucene.util.TestRuleSetupTeardownChained$1.evaluate(TestRuleSetupTeardownChained.java:50)
>    [junit4]   1>        at org.apache.lucene.util.AbstractBeforeAfterRule$1.evaluate(AbstractBeforeAfterRule.java:46)
>    [junit4]   1>        at com.carrotsearch.randomizedtesting.rules.SystemPropertiesInvariantRule$1.evaluate(SystemPropertiesInvariantRule.java:55)
>    [junit4]   1>        at org.apache.lucene.util.TestRuleThreadAndTestName$1.evaluate(TestRuleThreadAndTestName.java:49)
>    [junit4]   1>        at org.apache.lucene.util.TestRuleIgnoreAfterMaxFailures$1.evaluate(TestRuleIgnoreAfterMaxFailures.java:65)
>    [junit4]   1>        at org.apache.lucene.util.TestRuleMarkFailure$1.evaluate(TestRuleMarkFailure.java:48)
>    [junit4]   1>        at com.carrotsearch.randomizedtesting.rules.StatementAdapter.evaluate(StatementAdapter.java:36)
>    [junit4]   1>        at com.carrotsearch.randomizedtesting.ThreadLeakControl$StatementRunner.run(ThreadLeakControl.java:365)
>    [junit4]   1>        at com.carrotsearch.randomizedtesting.ThreadLeakControl.forkTimeoutingTask(ThreadLeakControl.java:798)
>    [junit4]   1>        at com.carrotsearch.randomizedtesting.ThreadLeakControl$3.evaluate(ThreadLeakControl.java:458)
>    [junit4]   1>        at com.carrotsearch.randomizedtesting.RandomizedRunner.runSingleTest(RandomizedRunner.java:836)
>    [junit4]   1>        at com.carrotsearch.randomizedtesting.RandomizedRunner$3.evaluate(RandomizedRunner.java:738)
>    [junit4]   1>        at com.carrotsearch.randomizedtesting.RandomizedRunner$4.evaluate(RandomizedRunner.java:772)
>    [junit4]   1>        at com.carrotsearch.randomizedtesting.RandomizedRunner$5.evaluate(RandomizedRunner.java:783)
>    [junit4]   1>        at org.apache.lucene.util.AbstractBeforeAfterRule$1.evaluate(AbstractBeforeAfterRule.java:46)
>    [junit4]   1>        at org.apache.lucene.util.TestRuleStoreClassName$1.evaluate(TestRuleStoreClassName.java:42)
>    [junit4]   1>        at com.carrotsearch.randomizedtesting.rules.SystemPropertiesInvariantRule$1.evaluate(SystemPropertiesInvariantRule.java:55)
>    [junit4]   1>        at com.carrotsearch.randomizedtesting.rules.NoShadowingOrOverridesOnMethodsRule$1.evaluate(NoShadowingOrOverridesOnMethodsRule.java:39)
>    [junit4]   1>        at com.carrotsearch.randomizedtesting.rules.NoShadowingOrOverridesOnMethodsRule$1.evaluate(NoShadowingOrOverridesOnMethodsRule.java:39)
>    [junit4]   1>        at com.carrotsearch.randomizedtesting.rules.StatementAdapter.evaluate(StatementAdapter.java:36)
>    [junit4]   1>        at com.carrotsearch.randomizedtesting.rules.StatementAdapter.evaluate(StatementAdapter.java:36)
>    [junit4]   1>        at com.carrotsearch.randomizedtesting.rules.StatementAdapter.evaluate(StatementAdapter.java:36)
>    [junit4]   1>        at org.apache.lucene.util.TestRuleAssertionsRequired$1.evaluate(TestRuleAssertionsRequired.java:43)
>    [junit4]   1>        at org.apache.lucene.util.TestRuleMarkFailure$1.evaluate(TestRuleMarkFailure.java:48)
>    [junit4]   1>        at org.apache.lucene.util.TestRuleIgnoreAfterMaxFailures$1.evaluate(TestRuleIgnoreAfterMaxFailures.java:65)
>    [junit4]   1>        at org.apache.lucene.util.TestRuleIgnoreTestSuites$1.evaluate(TestRuleIgnoreTestSuites.java:55)
>    [junit4]   1>        at com.carrotsearch.randomizedtesting.rules.StatementAdapter.evaluate(StatementAdapter.java:36)
>    [junit4]   1>        at com.carrotsearch.randomizedtesting.ThreadLeakControl$StatementRunner.run(ThreadLeakControl.java:365)
>    [junit4]   1>        at java.lang.Thread.run(Thread.java:745)
>    [junit4]   1>
>    [junit4]   1> TEST: got expected fake exc:Fake OutOfMemoryError
>    [junit4]   1> java.lang.OutOfMemoryError: Fake OutOfMemoryError
>    [junit4]   1>        at org.apache.lucene.index.TestIndexWriterOutOfMemory$2.eval(TestIndexWriterOutOfMemory.java:118)
>    [junit4]   1>        at org.apache.lucene.store.MockDirectoryWrapper.maybeThrowDeterministicException(MockDirectoryWrapper.java:887)
>    [junit4]   1>        at org.apache.lucene.store.MockIndexOutputWrapper.writeBytes(MockIndexOutputWrapper.java:128)
>    [junit4]   1>        at org.apache.lucene.store.MockIndexOutputWrapper.writeByte(MockIndexOutputWrapper.java:111)
>    [junit4]   1>        at org.apache.lucene.store.DataOutput.writeInt(DataOutput.java:72)
>    [junit4]   1>        at org.apache.lucene.codecs.CodecUtil.writeHeader(CodecUtil.java:89)
>    [junit4]   1>        at org.apache.lucene.util.fst.FST.save(FST.java:558)
>    [junit4]   1>        at org.apache.lucene.codecs.blocktree.BlockTreeTermsWriter$TermsWriter.finish(BlockTreeTermsWriter.java:970)
>    [junit4]   1>        at org.apache.lucene.codecs.blocktree.BlockTreeTermsWriter.write(BlockTreeTermsWriter.java:386)
>    [junit4]   1>        at org.apache.lucene.index.FreqProxTermsWriter.flush(FreqProxTermsWriter.java:107)
>    [junit4]   1>        at org.apache.lucene.index.DefaultIndexingChain.flush(DefaultIndexingChain.java:115)
>    [junit4]   1>        at org.apache.lucene.index.DocumentsWriterPerThread.flush(DocumentsWriterPerThread.java:441)
>    [junit4]   1>        at org.apache.lucene.index.DocumentsWriter.doFlush(DocumentsWriter.java:510)
>    [junit4]   1>        at org.apache.lucene.index.DocumentsWriter.flushAllThreads(DocumentsWriter.java:621)
>    [junit4]   1>        at org.apache.lucene.index.IndexWriter.prepareCommitInternal(IndexWriter.java:2795)
>    [junit4]   1>        at org.apache.lucene.index.IndexWriter.commitInternal(IndexWriter.java:2954)
>    [junit4]   1>        at org.apache.lucene.index.IndexWriter.commit(IndexWriter.java:2921)
>    [junit4]   1>        at org.apache.lucene.index.TestIndexWriterOutOfMemory.testBasics(TestIndexWriterOutOfMemory.java:214)
>    [junit4]   1>        at sun.reflect.NativeMethodAccessorImpl.invoke0(Native Method)
>    [junit4]   1>        at sun.reflect.NativeMethodAccessorImpl.invoke(NativeMethodAccessorImpl.java:57)
>    [junit4]   1>        at sun.reflect.DelegatingMethodAccessorImpl.invoke(DelegatingMethodAccessorImpl.java:43)
>    [junit4]   1>        at java.lang.reflect.Method.invoke(Method.java:606)
>    [junit4]   1>        at com.carrotsearch.randomizedtesting.RandomizedRunner.invoke(RandomizedRunner.java:1618)
>    [junit4]   1>        at com.carrotsearch.randomizedtesting.RandomizedRunner$6.evaluate(RandomizedRunner.java:827)
>    [junit4]   1>        at com.carrotsearch.randomizedtesting.RandomizedRunner$7.evaluate(RandomizedRunner.java:863)
>    [junit4]   1>        at com.carrotsearch.randomizedtesting.RandomizedRunner$8.evaluate(RandomizedRunner.java:877)
>    [junit4]   1>        at org.apache.lucene.util.TestRuleSetupTeardownChained$1.evaluate(TestRuleSetupTeardownChained.java:50)
>    [junit4]   1>        at org.apache.lucene.util.AbstractBeforeAfterRule$1.evaluate(AbstractBeforeAfterRule.java:46)
>    [junit4]   1>        at com.carrotsearch.randomizedtesting.rules.SystemPropertiesInvariantRule$1.evaluate(SystemPropertiesInvariantRule.java:55)
>    [junit4]   1>        at org.apache.lucene.util.TestRuleThreadAndTestName$1.evaluate(TestRuleThreadAndTestName.java:49)
>    [junit4]   1>        at org.apache.lucene.util.TestRuleIgnoreAfterMaxFailures$1.evaluate(TestRuleIgnoreAfterMaxFailures.java:65)
>    [junit4]   1>        at org.apache.lucene.util.TestRuleMarkFailure$1.evaluate(TestRuleMarkFailure.java:48)
>    [junit4]   1>        at com.carrotsearch.randomizedtesting.rules.StatementAdapter.evaluate(StatementAdapter.java:36)
>    [junit4]   1>        at com.carrotsearch.randomizedtesting.ThreadLeakControl$StatementRunner.run(ThreadLeakControl.java:365)
>    [junit4]   1>        at com.carrotsearch.randomizedtesting.ThreadLeakControl.forkTimeoutingTask(ThreadLeakControl.java:798)
>    [junit4]   1>        at com.carrotsearch.randomizedtesting.ThreadLeakControl$3.evaluate(ThreadLeakControl.java:458)
>    [junit4]   1>        at com.carrotsearch.randomizedtesting.RandomizedRunner.runSingleTest(RandomizedRunner.java:836)
>    [junit4]   1>        at com.carrotsearch.randomizedtesting.RandomizedRunner$3.evaluate(RandomizedRunner.java:738)
>    [junit4]   1>        at com.carrotsearch.randomizedtesting.RandomizedRunner$4.evaluate(RandomizedRunner.java:772)
>    [junit4]   1>        at com.carrotsearch.randomizedtesting.RandomizedRunner$5.evaluate(RandomizedRunner.java:783)
>    [junit4]   1>        at org.apache.lucene.util.AbstractBeforeAfterRule$1.evaluate(AbstractBeforeAfterRule.java:46)
>    [junit4]   1>        at org.apache.lucene.util.TestRuleStoreClassName$1.evaluate(TestRuleStoreClassName.java:42)
>    [junit4]   1>        at com.carrotsearch.randomizedtesting.rules.SystemPropertiesInvariantRule$1.evaluate(SystemPropertiesInvariantRule.java:55)
>    [junit4]   1>        at com.carrotsearch.randomizedtesting.rules.NoShadowingOrOverridesOnMethodsRule$1.evaluate(NoShadowingOrOverridesOnMethodsRule.java:39)
>    [junit4]   1>        at com.carrotsearch.randomizedtesting.rules.NoShadowingOrOverridesOnMethodsRule$1.evaluate(NoShadowingOrOverridesOnMethodsRule.java:39)
>    [junit4]   1>        at com.carrotsearch.randomizedtesting.rules.StatementAdapter.evaluate(StatementAdapter.java:36)
>    [junit4]   1>        at com.carrotsearch.randomizedtesting.rules.StatementAdapter.evaluate(StatementAdapter.java:36)
>    [junit4]   1>        at com.carrotsearch.randomizedtesting.rules.StatementAdapter.evaluate(StatementAdapter.java:36)
>    [junit4]   1>        at org.apache.lucene.util.TestRuleAssertionsRequired$1.evaluate(TestRuleAssertionsRequired.java:43)
>    [junit4]   1>        at org.apache.lucene.util.TestRuleMarkFailure$1.evaluate(TestRuleMarkFailure.java:48)
>    [junit4]   1>        at org.apache.lucene.util.TestRuleIgnoreAfterMaxFailures$1.evaluate(TestRuleIgnoreAfterMaxFailures.java:65)
>    [junit4]   1>        at org.apache.lucene.util.TestRuleIgnoreTestSuites$1.evaluate(TestRuleIgnoreTestSuites.java:55)
>    [junit4]   1>        at com.carrotsearch.randomizedtesting.rules.StatementAdapter.evaluate(StatementAdapter.java:36)
>    [junit4]   1>        at com.carrotsearch.randomizedtesting.ThreadLeakControl$StatementRunner.run(ThreadLeakControl.java:365)
>    [junit4]   1>        at java.lang.Thread.run(Thread.java:745)
>    [junit4]   1>
>    [junit4]   1> TEST: got expected fake exc:Fake OutOfMemoryError
>    [junit4]   1> java.lang.OutOfMemoryError: Fake OutOfMemoryError
>    [junit4]   1>        at org.apache.lucene.index.TestIndexWriterOutOfMemory$2.eval(TestIndexWriterOutOfMemory.java:118)
>    [junit4]   1>        at org.apache.lucene.store.MockDirectoryWrapper.maybeThrowDeterministicException(MockDirectoryWrapper.java:887)
>    [junit4]   1>        at org.apache.lucene.store.MockIndexOutputWrapper.writeBytes(MockIndexOutputWrapper.java:128)
>    [junit4]   1>        at org.apache.lucene.store.MockIndexOutputWrapper.writeByte(MockIndexOutputWrapper.java:111)
>    [junit4]   1>        at org.apache.lucene.store.DataOutput.writeVInt(DataOutput.java:196)
>    [junit4]   1>        at org.apache.lucene.store.DataOutput.writeString(DataOutput.java:261)
>    [junit4]   1>        at org.apache.lucene.codecs.CodecUtil.writeHeader(CodecUtil.java:88)
>    [junit4]   1>        at org.apache.lucene.codecs.lucene49.Lucene49NormsConsumer.<init>(Lucene49NormsConsumer.java:56)
>    [junit4]   1>        at org.apache.lucene.codecs.lucene49.Lucene49NormsFormat.normsConsumer(Lucene49NormsFormat.java:107)
>    [junit4]   1>        at org.apache.lucene.index.DefaultIndexingChain.writeNorms(DefaultIndexingChain.java:180)
>    [junit4]   1>        at org.apache.lucene.index.DefaultIndexingChain.flush(DefaultIndexingChain.java:95)
>    [junit4]   1>        at org.apache.lucene.index.DocumentsWriterPerThread.flush(DocumentsWriterPerThread.java:441)
>    [junit4]   1>        at org.apache.lucene.index.DocumentsWriter.doFlush(DocumentsWriter.java:510)
>    [junit4]   1>        at org.apache.lucene.index.DocumentsWriter.flushAllThreads(DocumentsWriter.java:621)
>    [junit4]   1>        at org.apache.lucene.index.IndexWriter.getReader(IndexWriter.java:412)
>    [junit4]   1>        at org.apache.lucene.index.DirectoryReader.open(DirectoryReader.java:87)
>    [junit4]   1>        at org.apache.lucene.index.TestIndexWriterOutOfMemory.testBasics(TestIndexWriterOutOfMemory.java:208)
>    [junit4]   1>        at sun.reflect.NativeMethodAccessorImpl.invoke0(Native Method)
>    [junit4]   1>        at sun.reflect.NativeMethodAccessorImpl.invoke(NativeMethodAccessorImpl.java:57)
>    [junit4]   1>        at sun.reflect.DelegatingMethodAccessorImpl.invoke(DelegatingMethodAccessorImpl.java:43)
>    [junit4]   1>        at java.lang.reflect.Method.invoke(Method.java:606)
>    [junit4]   1>        at com.carrotsearch.randomizedtesting.RandomizedRunner.invoke(RandomizedRunner.java:1618)
>    [junit4]   1>        at com.carrotsearch.randomizedtesting.RandomizedRunner$6.evaluate(RandomizedRunner.java:827)
>    [junit4]   1>        at com.carrotsearch.randomizedtesting.RandomizedRunner$7.evaluate(RandomizedRunner.java:863)
>    [junit4]   1>        at com.carrotsearch.randomizedtesting.RandomizedRunner$8.evaluate(RandomizedRunner.java:877)
>    [junit4]   1>        at org.apache.lucene.util.TestRuleSetupTeardownChained$1.evaluate(TestRuleSetupTeardownChained.java:50)
>    [junit4]   1>        at org.apache.lucene.util.AbstractBeforeAfterRule$1.evaluate(AbstractBeforeAfterRule.java:46)
>    [junit4]   1>        at com.carrotsearch.randomizedtesting.rules.SystemPropertiesInvariantRule$1.evaluate(SystemPropertiesInvariantRule.java:55)
>    [junit4]   1>        at org.apache.lucene.util.TestRuleThreadAndTestName$1.evaluate(TestRuleThreadAndTestName.java:49)
>    [junit4]   1>        at org.apache.lucene.util.TestRuleIgnoreAfterMaxFailures$1.evaluate(TestRuleIgnoreAfterMaxFailures.java:65)
>    [junit4]   1>        at org.apache.lucene.util.TestRuleMarkFailure$1.evaluate(TestRuleMarkFailure.java:48)
>    [junit4]   1>        at com.carrotsearch.randomizedtesting.rules.StatementAdapter.evaluate(StatementAdapter.java:36)
>    [junit4]   1>        at com.carrotsearch.randomizedtesting.ThreadLeakControl$StatementRunner.run(ThreadLeakControl.java:365)
>    [junit4]   1>        at com.carrotsearch.randomizedtesting.ThreadLeakControl.forkTimeoutingTask(ThreadLeakControl.java:798)
>    [junit4]   1>        at com.carrotsearch.randomizedtesting.ThreadLeakControl$3.evaluate(ThreadLeakControl.java:458)
>    [junit4]   1>        at com.carrotsearch.randomizedtesting.RandomizedRunner.runSingleTest(RandomizedRunner.java:836)
>    [junit4]   1>        at com.carrotsearch.randomizedtesting.RandomizedRunner$3.evaluate(RandomizedRunner.java:738)
>    [junit4]   1>        at com.carrotsearch.randomizedtesting.RandomizedRunner$4.evaluate(RandomizedRunner.java:772)
>    [junit4]   1>        at com.carrotsearch.randomizedtesting.RandomizedRunner$5.evaluate(RandomizedRunner.java:783)
>    [junit4]   1>        at org.apache.lucene.util.AbstractBeforeAfterRule$1.evaluate(AbstractBeforeAfterRule.java:46)
>    [junit4]   1>        at org.apache.lucene.util.TestRuleStoreClassName$1.evaluate(TestRuleStoreClassName.java:42)
>    [junit4]   1>        at com.carrotsearch.randomizedtesting.rules.SystemPropertiesInvariantRule$1.evaluate(SystemPropertiesInvariantRule.java:55)
>    [junit4]   1>        at com.carrotsearch.randomizedtesting.rules.NoShadowingOrOverridesOnMethodsRule$1.evaluate(NoShadowingOrOverridesOnMethodsRule.java:39)
>    [junit4]   1>        at com.carrotsearch.randomizedtesting.rules.NoShadowingOrOverridesOnMethodsRule$1.evaluate(NoShadowingOrOverridesOnMethodsRule.java:39)
>    [junit4]   1>        at com.carrotsearch.randomizedtesting.rules.StatementAdapter.evaluate(StatementAdapter.java:36)
>    [junit4]   1>        at com.carrotsearch.randomizedtesting.rules.StatementAdapter.evaluate(StatementAdapter.java:36)
>    [junit4]   1>        at com.carrotsearch.randomizedtesting.rules.StatementAdapter.evaluate(StatementAdapter.java:36)
>    [junit4]   1>        at org.apache.lucene.util.TestRuleAssertionsRequired$1.evaluate(TestRuleAssertionsRequired.java:43)
>    [junit4]   1>        at org.apache.lucene.util.TestRuleMarkFailure$1.evaluate(TestRuleMarkFailure.java:48)
>    [junit4]   1>        at org.apache.lucene.util.TestRuleIgnoreAfterMaxFailures$1.evaluate(TestRuleIgnoreAfterMaxFailures.java:65)
>    [junit4]   1>        at org.apache.lucene.util.TestRuleIgnoreTestSuites$1.evaluate(TestRuleIgnoreTestSuites.java:55)
>    [junit4]   1>        at com.carrotsearch.randomizedtesting.rules.StatementAdapter.evaluate(StatementAdapter.java:36)
>    [junit4]   1>        at com.carrotsearch.randomizedtesting.ThreadLeakControl$StatementRunner.run(ThreadLeakControl.java:365)
>    [junit4]   1>        at java.lang.Thread.run(Thread.java:745)
>    [junit4]   1>
>    [junit4]   1> TEST: got expected fake exc:Fake OutOfMemoryError
>    [junit4]   1> java.lang.OutOfMemoryError: Fake OutOfMemoryError
>    [junit4]   1>        at org.apache.lucene.index.TestIndexWriterOutOfMemory$2.eval(TestIndexWriterOutOfMemory.java:118)
>    [junit4]   1>        at org.apache.lucene.store.MockDirectoryWrapper.maybeThrowDeterministicException(MockDirectoryWrapper.java:887)
>    [junit4]   1>        at org.apache.lucene.store.MockIndexOutputWrapper.writeBytes(MockIndexOutputWrapper.java:128)
>    [junit4]   1>        at org.apache.lucene.codecs.lucene410.Lucene410DocValuesConsumer.addBinaryField(Lucene410DocValuesConsumer.java:284)
>    [junit4]   1>        at org.apache.lucene.codecs.lucene410.Lucene410DocValuesConsumer.addTermsDict(Lucene410DocValuesConsumer.java:336)
>    [junit4]   1>        at org.apache.lucene.codecs.lucene410.Lucene410DocValuesConsumer.addSortedSetField(Lucene410DocValuesConsumer.java:505)
>    [junit4]   1>        at org.apache.lucene.index.SortedSetDocValuesWriter.flush(SortedSetDocValuesWriter.java:164)
>    [junit4]   1>        at org.apache.lucene.index.DefaultIndexingChain.writeDocValues(DefaultIndexingChain.java:142)
>    [junit4]   1>        at org.apache.lucene.index.DefaultIndexingChain.flush(DefaultIndexingChain.java:96)
>    [junit4]   1>        at org.apache.lucene.index.DocumentsWriterPerThread.flush(DocumentsWriterPerThread.java:441)
>    [junit4]   1>        at org.apache.lucene.index.DocumentsWriter.doFlush(DocumentsWriter.java:510)
>    [junit4]   1>        at org.apache.lucene.index.DocumentsWriter.flushAllThreads(DocumentsWriter.java:621)
>    [junit4]   1>        at org.apache.lucene.index.IndexWriter.getReader(IndexWriter.java:412)
>    [junit4]   1>        at org.apache.lucene.index.DirectoryReader.open(DirectoryReader.java:87)
>    [junit4]   1>        at org.apache.lucene.index.TestIndexWriterOutOfMemory.testBasics(TestIndexWriterOutOfMemory.java:208)
>    [junit4]   1>        at sun.reflect.NativeMethodAccessorImpl.invoke0(Native Method)
>    [junit4]   1>        at sun.reflect.NativeMethodAccessorImpl.invoke(NativeMethodAccessorImpl.java:57)
>    [junit4]   1>        at sun.reflect.DelegatingMethodAccessorImpl.invoke(DelegatingMethodAccessorImpl.java:43)
>    [junit4]   1>        at java.lang.reflect.Method.invoke(Method.java:606)
>    [junit4]   1>        at com.carrotsearch.randomizedtesting.RandomizedRunner.invoke(RandomizedRunner.java:1618)
>    [junit4]   1>        at com.carrotsearch.randomizedtesting.RandomizedRunner$6.evaluate(RandomizedRunner.java:827)
>    [junit4]   1>        at com.carrotsearch.randomizedtesting.RandomizedRunner$7.evaluate(RandomizedRunner.java:863)
>    [junit4]   1>        at com.carrotsearch.randomizedtesting.RandomizedRunner$8.evaluate(RandomizedRunner.java:877)
>    [junit4]   1>        at org.apache.lucene.util.TestRuleSetupTeardownChained$1.evaluate(TestRuleSetupTeardownChained.java:50)
>    [junit4]   1>        at org.apache.lucene.util.AbstractBeforeAfterRule$1.evaluate(AbstractBeforeAfterRule.java:46)
>    [junit4]   1>        at com.carrotsearch.randomizedtesting.rules.SystemPropertiesInvariantRule$1.evaluate(SystemPropertiesInvariantRule.java:55)
>    [junit4]   1>        at org.apache.lucene.util.TestRuleThreadAndTestName$1.evaluate(TestRuleThreadAndTestName.java:49)
>    [junit4]   1>        at org.apache.lucene.util.TestRuleIgnoreAfterMaxFailures$1.evaluate(TestRuleIgnoreAfterMaxFailures.java:65)
>    [junit4]   1>        at org.apache.lucene.util.TestRuleMarkFailure$1.evaluate(TestRuleMarkFailure.java:48)
>    [junit4]   1>        at com.carrotsearch.randomizedtesting.rules.StatementAdapter.evaluate(StatementAdapter.java:36)
>    [junit4]   1>        at com.carrotsearch.randomizedtesting.ThreadLeakControl$StatementRunner.run(ThreadLeakControl.java:365)
>    [junit4]   1>        at com.carrotsearch.randomizedtesting.ThreadLeakControl.forkTimeoutingTask(ThreadLeakControl.java:798)
>    [junit4]   1>        at com.carrotsearch.randomizedtesting.ThreadLeakControl$3.evaluate(ThreadLeakControl.java:458)
>    [junit4]   1>        at com.carrotsearch.randomizedtesting.RandomizedRunner.runSingleTest(RandomizedRunner.java:836)
>    [junit4]   1>        at com.carrotsearch.randomizedtesting.RandomizedRunner$3.evaluate(RandomizedRunner.java:738)
>    [junit4]   1>        at com.carrotsearch.randomizedtesting.RandomizedRunner$4.evaluate(RandomizedRunner.java:772)
>    [junit4]   1>        at com.carrotsearch.randomizedtesting.RandomizedRunner$5.evaluate(RandomizedRunner.java:783)
>    [junit4]   1>        at org.apache.lucene.util.AbstractBeforeAfterRule$1.evaluate(AbstractBeforeAfterRule.java:46)
>    [junit4]   1>        at org.apache.lucene.util.TestRuleStoreClassName$1.evaluate(TestRuleStoreClassName.java:42)
>    [junit4]   1>        at com.carrotsearch.randomizedtesting.rules.SystemPropertiesInvariantRule$1.evaluate(SystemPropertiesInvariantRule.java:55)
>    [junit4]   1>        at com.carrotsearch.randomizedtesting.rules.NoShadowingOrOverridesOnMethodsRule$1.evaluate(NoShadowingOrOverridesOnMethodsRule.java:39)
>    [junit4]   1>        at com.carrotsearch.randomizedtesting.rules.NoShadowingOrOverridesOnMethodsRule$1.evaluate(NoShadowingOrOverridesOnMethodsRule.java:39)
>    [junit4]   1>        at com.carrotsearch.randomizedtesting.rules.StatementAdapter.evaluate(StatementAdapter.java:36)
>    [junit4]   1>        at com.carrotsearch.randomizedtesting.rules.StatementAdapter.evaluate(StatementAdapter.java:36)
>    [junit4]   1>        at com.carrotsearch.randomizedtesting.rules.StatementAdapter.evaluate(StatementAdapter.java:36)
>    [junit4]   1>        at org.apache.lucene.util.TestRuleAssertionsRequired$1.evaluate(TestRuleAssertionsRequired.java:43)
>    [junit4]   1>        at org.apache.lucene.util.TestRuleMarkFailure$1.evaluate(TestRuleMarkFailure.java:48)
>    [junit4]   1>        at org.apache.lucene.util.TestRuleIgnoreAfterMaxFailures$1.evaluate(TestRuleIgnoreAfterMaxFailures.java:65)
>    [junit4]   1>        at org.apache.lucene.util.TestRuleIgnoreTestSuites$1.evaluate(TestRuleIgnoreTestSuites.java:55)
>    [junit4]   1>        at com.carrotsearch.randomizedtesting.rules.StatementAdapter.evaluate(StatementAdapter.java:36)
>    [junit4]   1>        at com.carrotsearch.randomizedtesting.ThreadLeakControl$StatementRunner.run(ThreadLeakControl.java:365)
>    [junit4]   1>        at java.lang.Thread.run(Thread.java:745)
>    [junit4]   1>
>    [junit4]   1> TEST: got expected fake exc:Fake OutOfMemoryError
>    [junit4]   1> java.lang.OutOfMemoryError: Fake OutOfMemoryError
>    [junit4]   1>        at org.apache.lucene.index.TestIndexWriterOutOfMemory$2.eval(TestIndexWriterOutOfMemory.java:118)
>    [junit4]   1>        at org.apache.lucene.store.MockDirectoryWrapper.maybeThrowDeterministicException(MockDirectoryWrapper.java:887)
>    [junit4]   1>        at org.apache.lucene.store.MockIndexOutputWrapper.writeBytes(MockIndexOutputWrapper.java:128)
>    [junit4]   1>        at org.apache.lucene.store.MockIndexOutputWrapper.writeByte(MockIndexOutputWrapper.java:111)
>    [junit4]   1>        at org.apache.lucene.store.DataOutput.writeInt(DataOutput.java:71)
>    [junit4]   1>        at org.apache.lucene.store.DataOutput.writeLong(DataOutput.java:217)
>    [junit4]   1>        at org.apache.lucene.codecs.CodecUtil.writeFooter(CodecUtil.java:186)
>    [junit4]   1>        at org.apache.lucene.codecs.lucene41.Lucene41PostingsWriter.close(Lucene41PostingsWriter.java:577)
>    [junit4]   1>        at org.apache.lucene.util.IOUtils.close(IOUtils.java:77)
>    [junit4]   1>        at org.apache.lucene.codecs.blocktree.BlockTreeTermsWriter.close(BlockTreeTermsWriter.java:1045)
>    [junit4]   1>        at org.apache.lucene.util.IOUtils.close(IOUtils.java:77)
>    [junit4]   1>        at org.apache.lucene.index.FreqProxTermsWriter.flush(FreqProxTermsWriter.java:111)
>    [junit4]   1>        at org.apache.lucene.index.DefaultIndexingChain.flush(DefaultIndexingChain.java:115)
>    [junit4]   1>        at org.apache.lucene.index.DocumentsWriterPerThread.flush(DocumentsWriterPerThread.java:441)
>    [junit4]   1>        at org.apache.lucene.index.DocumentsWriter.doFlush(DocumentsWriter.java:510)
>    [junit4]   1>        at org.apache.lucene.index.DocumentsWriter.flushAllThreads(DocumentsWriter.java:621)
>    [junit4]   1>        at org.apache.lucene.index.IndexWriter.getReader(IndexWriter.java:412)
>    [junit4]   1>        at org.apache.lucene.index.DirectoryReader.open(DirectoryReader.java:87)
>    [junit4]   1>        at org.apache.lucene.index.TestIndexWriterOutOfMemory.testBasics(TestIndexWriterOutOfMemory.java:208)
>    [junit4]   1>        at sun.reflect.NativeMethodAccessorImpl.invoke0(Native Method)
>    [junit4]   1>        at sun.reflect.NativeMethodAccessorImpl.invoke(NativeMethodAccessorImpl.java:57)
>    [junit4]   1>        at sun.reflect.DelegatingMethodAccessorImpl.invoke(DelegatingMethodAccessorImpl.java:43)
>    [junit4]   1>        at java.lang.reflect.Method.invoke(Method.java:606)
>    [junit4]   1>        at com.carrotsearch.randomizedtesting.RandomizedRunner.invoke(RandomizedRunner.java:1618)
>    [junit4]   1>        at com.carrotsearch.randomizedtesting.RandomizedRunner$6.evaluate(RandomizedRunner.java:827)
>    [junit4]   1>        at com.carrotsearch.randomizedtesting.RandomizedRunner$7.evaluate(RandomizedRunner.java:863)
>    [junit4]   1>        at com.carrotsearch.randomizedtesting.RandomizedRunner$8.evaluate(RandomizedRunner.java:877)
>    [junit4]   1>        at org.apache.lucene.util.TestRuleSetupTeardownChained$1.evaluate(TestRuleSetupTeardownChained.java:50)
>    [junit4]   1>        at org.apache.lucene.util.AbstractBeforeAfterRule$1.evaluate(AbstractBeforeAfterRule.java:46)
>    [junit4]   1>        at com.carrotsearch.randomizedtesting.rules.SystemPropertiesInvariantRule$1.evaluate(SystemPropertiesInvariantRule.java:55)
>    [junit4]   1>        at org.apache.lucene.util.TestRuleThreadAndTestName$1.evaluate(TestRuleThreadAndTestName.java:49)
>    [junit4]   1>        at org.apache.lucene.util.TestRuleIgnoreAfterMaxFailures$1.evaluate(TestRuleIgnoreAfterMaxFailures.java:65)
>    [junit4]   1>        at org.apache.lucene.util.TestRuleMarkFailure$1.evaluate(TestRuleMarkFailure.java:48)
>    [junit4]   1>        at com.carrotsearch.randomizedtesting.rules.StatementAdapter.evaluate(StatementAdapter.java:36)
>    [junit4]   1>        at com.carrotsearch.randomizedtesting.ThreadLeakControl$StatementRunner.run(ThreadLeakControl.java:365)
>    [junit4]   1>        at com.carrotsearch.randomizedtesting.ThreadLeakControl.forkTimeoutingTask(ThreadLeakControl.java:798)
>    [junit4]   1>        at com.carrotsearch.randomizedtesting.ThreadLeakControl$3.evaluate(ThreadLeakControl.java:458)
>    [junit4]   1>        at com.carrotsearch.randomizedtesting.RandomizedRunner.runSingleTest(RandomizedRunner.java:836)
>    [junit4]   1>        at com.carrotsearch.randomizedtesting.RandomizedRunner$3.evaluate(RandomizedRunner.java:738)
>    [junit4]   1>        at com.carrotsearch.randomizedtesting.RandomizedRunner$4.evaluate(RandomizedRunner.java:772)
>    [junit4]   1>        at com.carrotsearch.randomizedtesting.RandomizedRunner$5.evaluate(RandomizedRunner.java:783)
>    [junit4]   1>        at org.apache.lucene.util.AbstractBeforeAfterRule$1.evaluate(AbstractBeforeAfterRule.java:46)
>    [junit4]   1>        at org.apache.lucene.util.TestRuleStoreClassName$1.evaluate(TestRuleStoreClassName.java:42)
>    [junit4]   1>        at com.carrotsearch.randomizedtesting.rules.SystemPropertiesInvariantRule$1.evaluate(SystemPropertiesInvariantRule.java:55)
>    [junit4]   1>        at com.carrotsearch.randomizedtesting.rules.NoShadowingOrOverridesOnMethodsRule$1.evaluate(NoShadowingOrOverridesOnMethodsRule.java:39)
>    [junit4]   1>        at com.carrotsearch.randomizedtesting.rules.NoShadowingOrOverridesOnMethodsRule$1.evaluate(NoShadowingOrOverridesOnMethodsRule.java:39)
>    [junit4]   1>        at com.carrotsearch.randomizedtesting.rules.StatementAdapter.evaluate(StatementAdapter.java:36)
>    [junit4]   1>        at com.carrotsearch.randomizedtesting.rules.StatementAdapter.evaluate(StatementAdapter.java:36)
>    [junit4]   1>        at com.carrotsearch.randomizedtesting.rules.StatementAdapter.evaluate(StatementAdapter.java:36)
>    [junit4]   1>        at org.apache.lucene.util.TestRuleAssertionsRequired$1.evaluate(TestRuleAssertionsRequired.java:43)
>    [junit4]   1>        at org.apache.lucene.util.TestRuleMarkFailure$1.evaluate(TestRuleMarkFailure.java:48)
>    [junit4]   1>        at org.apache.lucene.util.TestRuleIgnoreAfterMaxFailures$1.evaluate(TestRuleIgnoreAfterMaxFailures.java:65)
>    [junit4]   1>        at org.apache.lucene.util.TestRuleIgnoreTestSuites$1.evaluate(TestRuleIgnoreTestSuites.java:55)
>    [junit4]   1>        at com.carrotsearch.randomizedtesting.rules.StatementAdapter.evaluate(StatementAdapter.java:36)
>    [junit4]   1>        at com.carrotsearch.randomizedtesting.ThreadLeakControl$StatementRunner.run(ThreadLeakControl.java:365)
>    [junit4]   1>        at java.lang.Thread.run(Thread.java:745)
>    [junit4]   1>
>    [junit4]   1> TEST: got expected fake exc:Fake OutOfMemoryError
>    [junit4]   1> java.lang.OutOfMemoryError: Fake OutOfMemoryError
>    [junit4]   1>        at org.apache.lucene.index.TestIndexWriterOutOfMemory$2.eval(TestIndexWriterOutOfMemory.java:118)
>    [junit4]   1>        at org.apache.lucene.store.MockDirectoryWrapper.maybeThrowDeterministicException(MockDirectoryWrapper.java:887)
>    [junit4]   1>        at org.apache.lucene.store.MockIndexOutputWrapper.writeBytes(MockIndexOutputWrapper.java:128)
>    [junit4]   1>        at org.apache.lucene.store.MockIndexOutputWrapper.writeByte(MockIndexOutputWrapper.java:111)
>    [junit4]   1>        at org.apache.lucene.store.DataOutput.writeInt(DataOutput.java:74)
>    [junit4]   1>        at org.apache.lucene.store.DataOutput.writeStringStringMap(DataOutput.java:297)
>    [junit4]   1>        at org.apache.lucene.codecs.lucene46.Lucene46FieldInfosWriter.write(Lucene46FieldInfosWriter.java:82)
>    [junit4]   1>        at org.apache.lucene.index.DefaultIndexingChain.flush(DefaultIndexingChain.java:122)
>    [junit4]   1>        at org.apache.lucene.index.DocumentsWriterPerThread.flush(DocumentsWriterPerThread.java:441)
>    [junit4]   1>        at org.apache.lucene.index.DocumentsWriter.doFlush(DocumentsWriter.java:510)
>    [junit4]   1>        at org.apache.lucene.index.DocumentsWriter.flushAllThreads(DocumentsWriter.java:621)
>    [junit4]   1>        at org.apache.lucene.index.IndexWriter.prepareCommitInternal(IndexWriter.java:2795)
>    [junit4]   1>        at org.apache.lucene.index.IndexWriter.commitInternal(IndexWriter.java:2954)
>    [junit4]   1>        at org.apache.lucene.index.IndexWriter.commit(IndexWriter.java:2921)
>    [junit4]   1>        at org.apache.lucene.index.TestIndexWriterOutOfMemory.testBasics(TestIndexWriterOutOfMemory.java:214)
>    [junit4]   1>        at sun.reflect.NativeMethodAccessorImpl.invoke0(Native Method)
>    [junit4]   1>        at sun.reflect.NativeMethodAccessorImpl.invoke(NativeMethodAccessorImpl.java:57)
>    [junit4]   1>        at sun.reflect.DelegatingMethodAccessorImpl.invoke(DelegatingMethodAccessorImpl.java:43)
>    [junit4]   1>        at java.lang.reflect.Method.invoke(Method.java:606)
>    [junit4]   1>        at com.carrotsearch.randomizedtesting.RandomizedRunner.invoke(RandomizedRunner.java:1618)
>    [junit4]   1>        at com.carrotsearch.randomizedtesting.RandomizedRunner$6.evaluate(RandomizedRunner.java:827)
>    [junit4]   1>        at com.carrotsearch.randomizedtesting.RandomizedRunner$7.evaluate(RandomizedRunner.java:863)
>    [junit4]   1>        at com.carrotsearch.randomizedtesting.RandomizedRunner$8.evaluate(RandomizedRunner.java:877)
>    [junit4]   1>        at org.apache.lucene.util.TestRuleSetupTeardownChained$1.evaluate(TestRuleSetupTeardownChained.java:50)
>    [junit4]   1>        at org.apache.lucene.util.AbstractBeforeAfterRule$1.evaluate(AbstractBeforeAfterRule.java:46)
>    [junit4]   1>        at com.carrotsearch.randomizedtesting.rules.SystemPropertiesInvariantRule$1.evaluate(SystemPropertiesInvariantRule.java:55)
>    [junit4]   1>        at org.apache.lucene.util.TestRuleThreadAndTestName$1.evaluate(TestRuleThreadAndTestName.java:49)
>    [junit4]   1>        at org.apache.lucene.util.TestRuleIgnoreAfterMaxFailures$1.evaluate(TestRuleIgnoreAfterMaxFailures.java:65)
>    [junit4]   1>        at org.apache.lucene.util.TestRuleMarkFailure$1.evaluate(TestRuleMarkFailure.java:48)
>    [junit4]   1>        at com.carrotsearch.randomizedtesting.rules.StatementAdapter.evaluate(StatementAdapter.java:36)
>    [junit4]   1>        at com.carrotsearch.randomizedtesting.ThreadLeakControl$StatementRunner.run(ThreadLeakControl.java:365)
>    [junit4]   1>        at com.carrotsearch.randomizedtesting.ThreadLeakControl.forkTimeoutingTask(ThreadLeakControl.java:798)
>    [junit4]   1>        at com.carrotsearch.randomizedtesting.ThreadLeakControl$3.evaluate(ThreadLeakControl.java:458)
>    [junit4]   1>        at com.carrotsearch.randomizedtesting.RandomizedRunner.runSingleTest(RandomizedRunner.java:836)
>    [junit4]   1>        at com.carrotsearch.randomizedtesting.RandomizedRunner$3.evaluate(RandomizedRunner.java:738)
>    [junit4]   1>        at com.carrotsearch.randomizedtesting.RandomizedRunner$4.evaluate(RandomizedRunner.java:772)
>    [junit4]   1>        at com.carrotsearch.randomizedtesting.RandomizedRunner$5.evaluate(RandomizedRunner.java:783)
>    [junit4]   1>        at org.apache.lucene.util.AbstractBeforeAfterRule$1.evaluate(AbstractBeforeAfterRule.java:46)
>    [junit4]   1>        at org.apache.lucene.util.TestRuleStoreClassName$1.evaluate(TestRuleStoreClassName.java:42)
>    [junit4]   1>        at com.carrotsearch.randomizedtesting.rules.SystemPropertiesInvariantRule$1.evaluate(SystemPropertiesInvariantRule.java:55)
>    [junit4]   1>        at com.carrotsearch.randomizedtesting.rules.NoShadowingOrOverridesOnMethodsRule$1.evaluate(NoShadowingOrOverridesOnMethodsRule.java:39)
>    [junit4]   1>        at com.carrotsearch.randomizedtesting.rules.NoShadowingOrOverridesOnMethodsRule$1.evaluate(NoShadowingOrOverridesOnMethodsRule.java:39)
>    [junit4]   1>        at com.carrotsearch.randomizedtesting.rules.StatementAdapter.evaluate(StatementAdapter.java:36)
>    [junit4]   1>        at com.carrotsearch.randomizedtesting.rules.StatementAdapter.evaluate(StatementAdapter.java:36)
>    [junit4]   1>        at com.carrotsearch.randomizedtesting.rules.StatementAdapter.evaluate(StatementAdapter.java:36)
>    [junit4]   1>        at org.apache.lucene.util.TestRuleAssertionsRequired$1.evaluate(TestRuleAssertionsRequired.java:43)
>    [junit4]   1>        at org.apache.lucene.util.TestRuleMarkFailure$1.evaluate(TestRuleMarkFailure.java:48)
>    [junit4]   1>        at org.apache.lucene.util.TestRuleIgnoreAfterMaxFailures$1.evaluate(TestRuleIgnoreAfterMaxFailures.java:65)
>    [junit4]   1>        at org.apache.lucene.util.TestRuleIgnoreTestSuites$1.evaluate(TestRuleIgnoreTestSuites.java:55)
>    [junit4]   1>        at com.carrotsearch.randomizedtesting.rules.StatementAdapter.evaluate(StatementAdapter.java:36)
>    [junit4]   1>        at com.carrotsearch.randomizedtesting.ThreadLeakControl$StatementRunner.run(ThreadLeakControl.java:365)
>    [junit4]   1>        at java.lang.Thread.run(Thread.java:745)
>    [junit4]   1>
>    [junit4]   1> TEST: got expected fake exc:Fake OutOfMemoryError
>    [junit4]   1> java.lang.OutOfMemoryError: Fake OutOfMemoryError
>    [junit4]   1>        at org.apache.lucene.index.TestIndexWriterOutOfMemory$2.eval(TestIndexWriterOutOfMemory.java:118)
>    [junit4]   1>        at org.apache.lucene.store.MockDirectoryWrapper.maybeThrowDeterministicException(MockDirectoryWrapper.java:887)
>    [junit4]   1>        at org.apache.lucene.store.MockIndexOutputWrapper.writeBytes(MockIndexOutputWrapper.java:128)
>    [junit4]   1>        at org.apache.lucene.store.MockIndexOutputWrapper.writeByte(MockIndexOutputWrapper.java:111)
>    [junit4]   1>        at org.apache.lucene.store.DataOutput.writeInt(DataOutput.java:72)
>    [junit4]   1>        at org.apache.lucene.codecs.CodecUtil.writeFooter(CodecUtil.java:185)
>    [junit4]   1>        at org.apache.lucene.codecs.lucene410.Lucene410DocValuesConsumer.close(Lucene410DocValuesConsumer.java:544)
>    [junit4]   1>        at org.apache.lucene.util.IOUtils.close(IOUtils.java:77)
>    [junit4]   1>        at org.apache.lucene.index.DefaultIndexingChain.writeDocValues(DefaultIndexingChain.java:156)
>    [junit4]   1>        at org.apache.lucene.index.DefaultIndexingChain.flush(DefaultIndexingChain.java:96)
>    [junit4]   1>        at org.apache.lucene.index.DocumentsWriterPerThread.flush(DocumentsWriterPerThread.java:441)
>    [junit4]   1>        at org.apache.lucene.index.DocumentsWriter.doFlush(DocumentsWriter.java:510)
>    [junit4]   1>        at org.apache.lucene.index.DocumentsWriter.flushAllThreads(DocumentsWriter.java:621)
>    [junit4]   1>        at org.apache.lucene.index.IndexWriter.getReader(IndexWriter.java:412)
>    [junit4]   1>        at org.apache.lucene.index.DirectoryReader.open(DirectoryReader.java:87)
>    [junit4]   1>        at org.apache.lucene.index.TestIndexWriterOutOfMemory.testBasics(TestIndexWriterOutOfMemory.java:208)
>    [junit4]   1>        at sun.reflect.NativeMethodAccessorImpl.invoke0(Native Method)
>    [junit4]   1>        at sun.reflect.NativeMethodAccessorImpl.invoke(NativeMethodAccessorImpl.java:57)
>    [junit4]   1>        at sun.reflect.DelegatingMethodAccessorImpl.invoke(DelegatingMethodAccessorImpl.java:43)
>    [junit4]   1>        at java.lang.reflect.Method.invoke(Method.java:606)
>    [junit4]   1>        at com.carrotsearch.randomizedtesting.RandomizedRunner.invoke(RandomizedRunner.java:1618)
>    [junit4]   1>        at com.carrotsearch.randomizedtesting.RandomizedRunner$6.evaluate(RandomizedRunner.java:827)
>    [junit4]   1>        at com.carrotsearch.randomizedtesting.RandomizedRunner$7.evaluate(RandomizedRunner.java:863)
>    [junit4]   1>        at com.carrotsearch.randomizedtesting.RandomizedRunner$8.evaluate(RandomizedRunner.java:877)
>    [junit4]   1>        at org.apache.lucene.util.TestRuleSetupTeardownChained$1.evaluate(TestRuleSetupTeardownChained.java:50)
>    [junit4]   1>        at org.apache.lucene.util.AbstractBeforeAfterRule$1.evaluate(AbstractBeforeAfterRule.java:46)
>    [junit4]   1>        at com.carrotsearch.randomizedtesting.rules.SystemPropertiesInvariantRule$1.evaluate(SystemPropertiesInvariantRule.java:55)
>    [junit4]   1>        at org.apache.lucene.util.TestRuleThreadAndTestName$1.evaluate(TestRuleThreadAndTestName.java:49)
>    [junit4]   1>        at org.apache.lucene.util.TestRuleIgnoreAfterMaxFailures$1.evaluate(TestRuleIgnoreAfterMaxFailures.java:65)
>    [junit4]   1>        at org.apache.lucene.util.TestRuleMarkFailure$1.evaluate(TestRuleMarkFailure.java:48)
>    [junit4]   1>        at com.carrotsearch.randomizedtesting.rules.StatementAdapter.evaluate(StatementAdapter.java:36)
>    [junit4]   1>        at com.carrotsearch.randomizedtesting.ThreadLeakControl$StatementRunner.run(ThreadLeakControl.java:365)
>    [junit4]   1>        at com.carrotsearch.randomizedtesting.ThreadLeakControl.forkTimeoutingTask(ThreadLeakControl.java:798)
>    [junit4]   1>        at com.carrotsearch.randomizedtesting.ThreadLeakControl$3.evaluate(ThreadLeakControl.java:458)
>    [junit4]   1>        at com.carrotsearch.randomizedtesting.RandomizedRunner.runSingleTest(RandomizedRunner.java:836)
>    [junit4]   1>        at com.carrotsearch.randomizedtesting.RandomizedRunner$3.evaluate(RandomizedRunner.java:738)
>    [junit4]   1>        at com.carrotsearch.randomizedtesting.RandomizedRunner$4.evaluate(RandomizedRunner.java:772)
>    [junit4]   1>        at com.carrotsearch.randomizedtesting.RandomizedRunner$5.evaluate(RandomizedRunner.java:783)
>    [junit4]   1>        at org.apache.lucene.util.AbstractBeforeAfterRule$1.evaluate(AbstractBeforeAfterRule.java:46)
>    [junit4]   1>        at org.apache.lucene.util.TestRuleStoreClassName$1.evaluate(TestRuleStoreClassName.java:42)
>    [junit4]   1>        at com.carrotsearch.randomizedtesting.rules.SystemPropertiesInvariantRule$1.evaluate(SystemPropertiesInvariantRule.java:55)
>    [junit4]   1>        at com.carrotsearch.randomizedtesting.rules.NoShadowingOrOverridesOnMethodsRule$1.evaluate(NoShadowingOrOverridesOnMethodsRule.java:39)
>    [junit4]   1>        at com.carrotsearch.randomizedtesting.rules.NoShadowingOrOverridesOnMethodsRule$1.evaluate(NoShadowingOrOverridesOnMethodsRule.java:39)
>    [junit4]   1>        at com.carrotsearch.randomizedtesting.rules.StatementAdapter.evaluate(StatementAdapter.java:36)
>    [junit4]   1>        at com.carrotsearch.randomizedtesting.rules.StatementAdapter.evaluate(StatementAdapter.java:36)
>    [junit4]   1>        at com.carrotsearch.randomizedtesting.rules.StatementAdapter.evaluate(StatementAdapter.java:36)
>    [junit4]   1>        at org.apache.lucene.util.TestRuleAssertionsRequired$1.evaluate(TestRuleAssertionsRequired.java:43)
>    [junit4]   1>        at org.apache.lucene.util.TestRuleMarkFailure$1.evaluate(TestRuleMarkFailure.java:48)
>    [junit4]   1>        at org.apache.lucene.util.TestRuleIgnoreAfterMaxFailures$1.evaluate(TestRuleIgnoreAfterMaxFailures.java:65)
>    [junit4]   1>        at org.apache.lucene.util.TestRuleIgnoreTestSuites$1.evaluate(TestRuleIgnoreTestSuites.java:55)
>    [junit4]   1>        at com.carrotsearch.randomizedtesting.rules.StatementAdapter.evaluate(StatementAdapter.java:36)
>    [junit4]   1>        at com.carrotsearch.randomizedtesting.ThreadLeakControl$StatementRunner.run(ThreadLeakControl.java:365)
>    [junit4]   1>        at java.lang.Thread.run(Thread.java:745)
>    [junit4]   1>
>    [junit4]   1> TEST: got expected fake exc:Fake OutOfMemoryError
>    [junit4]   1> java.lang.OutOfMemoryError: Fake OutOfMemoryError
>    [junit4]   1>        at org.apache.lucene.index.TestIndexWriterOutOfMemory$2.eval(TestIndexWriterOutOfMemory.java:118)
>    [junit4]   1>        at org.apache.lucene.store.MockDirectoryWrapper.maybeThrowDeterministicException(MockDirectoryWrapper.java:887)
>    [junit4]   1>        at org.apache.lucene.store.MockIndexOutputWrapper.writeBytes(MockIndexOutputWrapper.java:128)
>    [junit4]   1>        at org.apache.lucene.store.MockIndexOutputWrapper.writeByte(MockIndexOutputWrapper.java:111)
>    [junit4]   1>        at org.apache.lucene.store.DataOutput.writeInt(DataOutput.java:71)
>    [junit4]   1>        at org.apache.lucene.store.DataOutput.writeLong(DataOutput.java:217)
>    [junit4]   1>        at org.apache.lucene.codecs.lucene49.Lucene49NormsConsumer.addNormsField(Lucene49NormsConsumer.java:110)
>    [junit4]   1>        at org.apache.lucene.index.NormValuesWriter.flush(NormValuesWriter.java:72)
>    [junit4]   1>        at org.apache.lucene.index.DefaultIndexingChain.writeNorms(DefaultIndexingChain.java:191)
>    [junit4]   1>        at org.apache.lucene.index.DefaultIndexingChain.flush(DefaultIndexingChain.java:95)
>    [junit4]   1>        at org.apache.lucene.index.DocumentsWriterPerThread.flush(DocumentsWriterPerThread.java:441)
>    [junit4]   1>        at org.apache.lucene.index.DocumentsWriter.doFlush(DocumentsWriter.java:510)
>    [junit4]   1>        at org.apache.lucene.index.DocumentsWriter.flushAllThreads(DocumentsWriter.java:621)
>    [junit4]   1>        at org.apache.lucene.index.IndexWriter.prepareCommitInternal(IndexWriter.java:2795)
>    [junit4]   1>        at org.apache.lucene.index.IndexWriter.commitInternal(IndexWriter.java:2954)
>    [junit4]   1>        at org.apache.lucene.index.IndexWriter.commit(IndexWriter.java:2921)
>    [junit4]   1>        at org.apache.lucene.index.TestIndexWriterOutOfMemory.testBasics(TestIndexWriterOutOfMemory.java:214)
>    [junit4]   1>        at sun.reflect.NativeMethodAccessorImpl.invoke0(Native Method)
>    [junit4]   1>        at sun.reflect.NativeMethodAccessorImpl.invoke(NativeMethodAccessorImpl.java:57)
>    [junit4]   1>        at sun.reflect.DelegatingMethodAccessorImpl.invoke(DelegatingMethodAccessorImpl.java:43)
>    [junit4]   1>        at java.lang.reflect.Method.invoke(Method.java:606)
>    [junit4]   1>        at com.carrotsearch.randomizedtesting.RandomizedRunner.invoke(RandomizedRunner.java:1618)
>    [junit4]   1>        at com.carrotsearch.randomizedtesting.RandomizedRunner$6.evaluate(RandomizedRunner.java:827)
>    [junit4]   1>        at com.carrotsearch.randomizedtesting.RandomizedRunner$7.evaluate(RandomizedRunner.java:863)
>    [junit4]   1>        at com.carrotsearch.randomizedtesting.RandomizedRunner$8.evaluate(RandomizedRunner.java:877)
>    [junit4]   1>        at org.apache.lucene.util.TestRuleSetupTeardownChained$1.evaluate(TestRuleSetupTeardownChained.java:50)
>    [junit4]   1>        at org.apache.lucene.util.AbstractBeforeAfterRule$1.evaluate(AbstractBeforeAfterRule.java:46)
>    [junit4]   1>        at com.carrotsearch.randomizedtesting.rules.SystemPropertiesInvariantRule$1.evaluate(SystemPropertiesInvariantRule.java:55)
>    [junit4]   1>        at org.apache.lucene.util.TestRuleThreadAndTestName$1.evaluate(TestRuleThreadAndTestName.java:49)
>    [junit4]   1>        at org.apache.lucene.util.TestRuleIgnoreAfterMaxFailures$1.evaluate(TestRuleIgnoreAfterMaxFailures.java:65)
>    [junit4]   1>        at org.apache.lucene.util.TestRuleMarkFailure$1.evaluate(TestRuleMarkFailure.java:48)
>    [junit4]   1>        at com.carrotsearch.randomizedtesting.rules.StatementAdapter.evaluate(StatementAdapter.java:36)
>    [junit4]   1>        at com.carrotsearch.randomizedtesting.ThreadLeakControl$StatementRunner.run(ThreadLeakControl.java:365)
>    [junit4]   1>        at com.carrotsearch.randomizedtesting.ThreadLeakControl.forkTimeoutingTask(ThreadLeakControl.java:798)
>    [junit4]   1>        at com.carrotsearch.randomizedtesting.ThreadLeakControl$3.evaluate(ThreadLeakControl.java:458)
>    [junit4]   1>        at com.carrotsearch.randomizedtesting.RandomizedRunner.runSingleTest(RandomizedRunner.java:836)
>    [junit4]   1>        at com.carrotsearch.randomizedtesting.RandomizedRunner$3.evaluate(RandomizedRunner.java:738)
>    [junit4]   1>        at com.carrotsearch.randomizedtesting.RandomizedRunner$4.evaluate(RandomizedRunner.java:772)
>    [junit4]   1>        at com.carrotsearch.randomizedtesting.RandomizedRunner$5.evaluate(RandomizedRunner.java:783)
>    [junit4]   1>        at org.apache.lucene.util.AbstractBeforeAfterRule$1.evaluate(AbstractBeforeAfterRule.java:46)
>    [junit4]   1>        at org.apache.lucene.util.TestRuleStoreClassName$1.evaluate(TestRuleStoreClassName.java:42)
>    [junit4]   1>        at com.carrotsearch.randomizedtesting.rules.SystemPropertiesInvariantRule$1.evaluate(SystemPropertiesInvariantRule.java:55)
>    [junit4]   1>        at com.carrotsearch.randomizedtesting.rules.NoShadowingOrOverridesOnMethodsRule$1.evaluate(NoShadowingOrOverridesOnMethodsRule.java:39)
>    [junit4]   1>        at com.carrotsearch.randomizedtesting.rules.NoShadowingOrOverridesOnMethodsRule$1.evaluate(NoShadowingOrOverridesOnMethodsRule.java:39)
>    [junit4]   1>        at com.carrotsearch.randomizedtesting.rules.StatementAdapter.evaluate(StatementAdapter.java:36)
>    [junit4]   1>        at com.carrotsearch.randomizedtesting.rules.StatementAdapter.evaluate(StatementAdapter.java:36)
>    [junit4]   1>        at com.carrotsearch.randomizedtesting.rules.StatementAdapter.evaluate(StatementAdapter.java:36)
>    [junit4]   1>        at org.apache.lucene.util.TestRuleAssertionsRequired$1.evaluate(TestRuleAssertionsRequired.java:43)
>    [junit4]   1>        at org.apache.lucene.util.TestRuleMarkFailure$1.evaluate(TestRuleMarkFailure.java:48)
>    [junit4]   1>        at org.apache.lucene.util.TestRuleIgnoreAfterMaxFailures$1.evaluate(TestRuleIgnoreAfterMaxFailures.java:65)
>    [junit4]   1>        at org.apache.lucene.util.TestRuleIgnoreTestSuites$1.evaluate(TestRuleIgnoreTestSuites.java:55)
>    [junit4]   1>        at com.carrotsearch.randomizedtesting.rules.StatementAdapter.evaluate(StatementAdapter.java:36)
>    [junit4]   1>        at com.carrotsearch.randomizedtesting.ThreadLeakControl$StatementRunner.run(ThreadLeakControl.java:365)
>    [junit4]   1>        at java.lang.Thread.run(Thread.java:745)
>    [junit4]   1>
>    [junit4]   1> TEST: got expected fake exc:Fake OutOfMemoryError
>    [junit4]   1> java.lang.OutOfMemoryError: Fake OutOfMemoryError
>    [junit4]   1>        at org.apache.lucene.index.TestIndexWriterOutOfMemory$2.eval(TestIndexWriterOutOfMemory.java:118)
>    [junit4]   1>        at org.apache.lucene.store.MockDirectoryWrapper.maybeThrowDeterministicException(MockDirectoryWrapper.java:887)
>    [junit4]   1>        at org.apache.lucene.store.MockIndexOutputWrapper.writeBytes(MockIndexOutputWrapper.java:128)
>    [junit4]   1>        at org.apache.lucene.store.MockIndexOutputWrapper.writeByte(MockIndexOutputWrapper.java:111)
>    [junit4]   1>        at org.apache.lucene.store.DataOutput.writeNegativeVLong(DataOutput.java:239)
>    [junit4]   1>        at org.apache.lucene.store.DataOutput.writeVLong(DataOutput.java:230)
>    [junit4]   1>        at org.apache.lucene.codecs.blocktree.BlockTreeTermsWriter.close(BlockTreeTermsWriter.java:1029)
>    [junit4]   1>        at org.apache.lucene.util.IOUtils.close(IOUtils.java:77)
>    [junit4]   1>        at org.apache.lucene.index.FreqProxTermsWriter.flush(FreqProxTermsWriter.java:111)
>    [junit4]   1>        at org.apache.lucene.index.DefaultIndexingChain.flush(DefaultIndexingChain.java:115)
>    [junit4]   1>        at org.apache.lucene.index.DocumentsWriterPerThread.flush(DocumentsWriterPerThread.java:441)
>    [junit4]   1>        at org.apache.lucene.index.DocumentsWriter.doFlush(DocumentsWriter.java:510)
>    [junit4]   1>        at org.apache.lucene.index.DocumentsWriter.flushAllThreads(DocumentsWriter.java:621)
>    [junit4]   1>        at org.apache.lucene.index.IndexWriter.prepareCommitInternal(IndexWriter.java:2795)
>    [junit4]   1>        at org.apache.lucene.index.IndexWriter.commitInternal(IndexWriter.java:2954)
>    [junit4]   1>        at org.apache.lucene.index.IndexWriter.commit(IndexWriter.java:2921)
>    [junit4]   1>        at org.apache.lucene.index.TestIndexWriterOutOfMemory.testBasics(TestIndexWriterOutOfMemory.java:214)
>    [junit4]   1>        at sun.reflect.NativeMethodAccessorImpl.invoke0(Native Method)
>    [junit4]   1>        at sun.reflect.NativeMethodAccessorImpl.invoke(NativeMethodAccessorImpl.java:57)
>    [junit4]   1>        at sun.reflect.DelegatingMethodAccessorImpl.invoke(DelegatingMethodAccessorImpl.java:43)
>    [junit4]   1>        at java.lang.reflect.Method.invoke(Method.java:606)
>    [junit4]   1>        at com.carrotsearch.randomizedtesting.RandomizedRunner.invoke(RandomizedRunner.java:1618)
>    [junit4]   1>        at com.carrotsearch.randomizedtesting.RandomizedRunner$6.evaluate(RandomizedRunner.java:827)
>    [junit4]   1>        at com.carrotsearch.randomizedtesting.RandomizedRunner$7.evaluate(RandomizedRunner.java:863)
>    [junit4]   1>        at com.carrotsearch.randomizedtesting.RandomizedRunner$8.evaluate(RandomizedRunner.java:877)
>    [junit4]   1>        at org.apache.lucene.util.TestRuleSetupTeardownChained$1.evaluate(TestRuleSetupTeardownChained.java:50)
>    [junit4]   1>        at org.apache.lucene.util.AbstractBeforeAfterRule$1.evaluate(AbstractBeforeAfterRule.java:46)
>    [junit4]   1>        at com.carrotsearch.randomizedtesting.rules.SystemPropertiesInvariantRule$1.evaluate(SystemPropertiesInvariantRule.java:55)
>    [junit4]   1>        at org.apache.lucene.util.TestRuleThreadAndTestName$1.evaluate(TestRuleThreadAndTestName.java:49)
>    [junit4]   1>        at org.apache.lucene.util.TestRuleIgnoreAfterMaxFailures$1.evaluate(TestRuleIgnoreAfterMaxFailures.java:65)
>    [junit4]   1>        at org.apache.lucene.util.TestRuleMarkFailure$1.evaluate(TestRuleMarkFailure.java:48)
>    [junit4]   1>        at com.carrotsearch.randomizedtesting.rules.StatementAdapter.evaluate(StatementAdapter.java:36)
>    [junit4]   1>        at com.carrotsearch.randomizedtesting.ThreadLeakControl$StatementRunner.run(ThreadLeakControl.java:365)
>    [junit4]   1>        at com.carrotsearch.randomizedtesting.ThreadLeakControl.forkTimeoutingTask(ThreadLeakControl.java:798)
>    [junit4]   1>        at com.carrotsearch.randomizedtesting.ThreadLeakControl$3.evaluate(ThreadLeakControl.java:458)
>    [junit4]   1>        at com.carrotsearch.randomizedtesting.RandomizedRunner.runSingleTest(RandomizedRunner.java:836)
>    [junit4]   1>        at com.carrotsearch.randomizedtesting.RandomizedRunner$3.evaluate(RandomizedRunner.java:738)
>    [junit4]   1>        at com.carrotsearch.randomizedtesting.RandomizedRunner$4.evaluate(RandomizedRunner.java:772)
>    [junit4]   1>        at com.carrotsearch.randomizedtesting.RandomizedRunner$5.evaluate(RandomizedRunner.java:783)
>    [junit4]   1>        at org.apache.lucene.util.AbstractBeforeAfterRule$1.evaluate(AbstractBeforeAfterRule.java:46)
>    [junit4]   1>        at org.apache.lucene.util.TestRule
>
> [...truncated too long message...]
>
> apter.java:36)
>    [junit4]   1>        at com.carrotsearch.randomizedtesting.rules.StatementAdapter.evaluate(StatementAdapter.java:36)
>    [junit4]   1>        at com.carrotsearch.randomizedtesting.rules.StatementAdapter.evaluate(StatementAdapter.java:36)
>    [junit4]   1>        at org.apache.lucene.util.TestRuleAssertionsRequired$1.evaluate(TestRuleAssertionsRequired.java:43)
>    [junit4]   1>        at org.apache.lucene.util.TestRuleMarkFailure$1.evaluate(TestRuleMarkFailure.java:48)
>    [junit4]   1>        at org.apache.lucene.util.TestRuleIgnoreAfterMaxFailures$1.evaluate(TestRuleIgnoreAfterMaxFailures.java:65)
>    [junit4]   1>        at org.apache.lucene.util.TestRuleIgnoreTestSuites$1.evaluate(TestRuleIgnoreTestSuites.java:55)
>    [junit4]   1>        at com.carrotsearch.randomizedtesting.rules.StatementAdapter.evaluate(StatementAdapter.java:36)
>    [junit4]   1>        at com.carrotsearch.randomizedtesting.ThreadLeakControl$StatementRunner.run(ThreadLeakControl.java:365)
>    [junit4]   1>        at java.lang.Thread.run(Thread.java:745)
>    [junit4]   1>
>    [junit4]   2> NOTE: download the large Jenkins line-docs file by running 'ant get-jenkins-line-docs' in the lucene directory.
>    [junit4]   2> NOTE: reproduce with: ant test  -Dtestcase=TestIndexWriterOutOfMemory -Dtests.method=testBasics -Dtests.seed=3C3A06BDFCB270AC -Dtests.multiplier=2 -Dtests.nightly=true -Dtests.slow=true -Dtests.linedocsfile=/home/jenkins/lucene-data/enwiki.random.lines.txt -Dtests.locale=de -Dtests.timezone=Pacific/Tarawa -Dtests.file.encoding=UTF-8
>    [junit4] ERROR    547s J0 | TestIndexWriterOutOfMemory.testBasics <<<
>    [junit4]    > Throwable #1: java.lang.RuntimeException: MockDirectoryWrapper: cannot close: there are still open files: {_1_1.dvd=1}
>    [junit4]    >        at __randomizedtesting.SeedInfo.seed([3C3A06BDFCB270AC:1E2A891C45C2EDC]:0)
>    [junit4]    >        at org.apache.lucene.store.MockDirectoryWrapper.close(MockDirectoryWrapper.java:672)
>    [junit4]    >        at org.apache.lucene.index.TestIndexWriterOutOfMemory.testBasics(TestIndexWriterOutOfMemory.java:85)
>    [junit4]    >        at java.lang.Thread.run(Thread.java:745)
>    [junit4]    > Caused by: java.lang.RuntimeException: unclosed IndexInput: _1_1.dvd
>    [junit4]    >        at org.apache.lucene.store.MockDirectoryWrapper.addFileHandle(MockDirectoryWrapper.java:559)
>    [junit4]    >        at org.apache.lucene.store.MockDirectoryWrapper.openInput(MockDirectoryWrapper.java:603)
>    [junit4]    >        at org.apache.lucene.codecs.lucene410.Lucene410DocValuesProducer.<init>(Lucene410DocValuesProducer.java:120)
>    [junit4]    >        at org.apache.lucene.codecs.lucene410.Lucene410DocValuesFormat.fieldsProducer(Lucene410DocValuesFormat.java:181)
>    [junit4]    >        at org.apache.lucene.index.SegmentDocValues.newDocValuesProducer(SegmentDocValues.java:51)
>    [junit4]    >        at org.apache.lucene.index.SegmentDocValues.getDocValuesProducer(SegmentDocValues.java:68)
>    [junit4]    >        at org.apache.lucene.index.SegmentDocValuesProducer.<init>(SegmentDocValuesProducer.java:67)
>    [junit4]    >        at org.apache.lucene.index.SegmentReader.initDocValuesProducer(SegmentReader.java:187)
>    [junit4]    >        at org.apache.lucene.index.SegmentReader.<init>(SegmentReader.java:166)
>    [junit4]    >        at org.apache.lucene.index.ReadersAndUpdates.writeFieldUpdates(ReadersAndUpdates.java:587)
>    [junit4]    >        at org.apache.lucene.index.BufferedUpdatesStream.applyDeletesAndUpdates(BufferedUpdatesStream.java:233)
>    [junit4]    >        at org.apache.lucene.index.IndexWriter.applyAllDeletesAndUpdates(IndexWriter.java:3100)
>    [junit4]    >        at org.apache.lucene.index.IndexWriter.maybeApplyDeletes(IndexWriter.java:3091)
>    [junit4]    >        at org.apache.lucene.index.IndexWriter.prepareCommitInternal(IndexWriter.java:2805)
>    [junit4]    >        at org.apache.lucene.index.IndexWriter.commitInternal(IndexWriter.java:2954)
>    [junit4]    >        at org.apache.lucene.index.IndexWriter.commit(IndexWriter.java:2921)
>    [junit4]    >        at org.apache.lucene.index.TestIndexWriterOutOfMemory.testBasics(TestIndexWriterOutOfMemory.java:214)
>    [junit4]    >        ... 37 more
>    [junit4]   2> NOTE: leaving temporary files on disk at: /usr/home/jenkins/jenkins-slave/workspace/Lucene-Solr-NightlyTests-trunk/lucene/build/core/test/J0/./temp/lucene.index.TestIndexWriterOutOfMemory-3C3A06BDFCB270AC-001
>    [junit4]   2> NOTE: test params are: codec=CheapBastard, sim=RandomSimilarityProvider(queryNorm=false,coord=no): {text1=IB LL-D3(800.0), text_payloads=DFR I(F)1, text_vectors=DFR I(n)B2}, locale=de, timezone=Pacific/Tarawa
>    [junit4]   2> NOTE: FreeBSD 9.1-RELEASE-p3 amd64/Oracle Corporation 1.7.0_60 (64-bit)/cpus=16,threads=1,free=181061456,total=344981504
>    [junit4]   2> NOTE: All tests run in this JVM: [TestNumericUtils, TestPhraseQuery, TestDoc, TestBlockPostingsFormat3, TestTimSorter, TestSimpleExplanations, TestAssertions, TestMultiLevelSkipList, TestDocValuesScoring, TestIndexWriter, TestCharFilter, TestBooleanQuery, TestParallelTermEnum, TestLucene40StoredFieldsFormat, TestLiveFieldValues, TestNumericRangeQuery32, Nested1, TestWindowsMMap, TestDocumentsWriterDeleteQueue, TestTermVectorsReader, TestMockCharFilter, Test2BPagedBytes, TestVersion, TestSpanSearchEquivalence, TestTermsEnum, TestQueryRescorer, TestCrashCausesCorruptIndex, TestMultiTermQueryRewrites, TestIntroSorter, TestFilterIterator, TestIndexWriterMerging, TestIndexWriterForceMerge, TestIndexSearcher, TestFieldCacheRewriteMethod, TestLucene40DocValuesFormat, TestRecyclingIntBlockAllocator, TestNoDeletionPolicy, TestIsCurrent, TestSearchAfter, TestParallelAtomicReader, TestBinaryTerms, TestNumericTokenStream, TestIndexCommit, Nested, Nested, TestStressIndexing2, TestSimilarity, TestLucene40PostingsFormat, TestRollingBuffer, TestVirtualMethod, TestLockFactory, TestSegmentTermDocs, TestLucene40PostingsReader, TestMaxTermFrequency, TestSumDocFreq, TestBagOfPositions, TestLucene45DocValuesFormat, TestMutableValues, Test4GBStoredFields, TestBooleanQueryVisitSubscorers, TestMixedDocValuesUpdates, TestMultiValuedNumericRangeQuery, TestTopDocsMerge, TestDirectoryReader, TestBytesRefArray, TestStressIndexing, TestAutomatonQueryUnicode, TestSameTokenSamePosition, TestSpansAdvanced, TestTermdocPerf, TestLogMergePolicy, TestLucene49NormsFormat, TestControlledRealTimeReopenThread, TestPayloadTermQuery, TestPagedBytes, TestRollingUpdates, TestSpans, TestFieldCacheRangeFilter, TestSloppyMath, TestConcurrentMergeScheduler, TestScoreCachingWrappingScorer, TestBooleanScorer, TestComplexExplanations, TestShardSearching, TestIndexInput, TestSizeBoundedForceMerge, TestIndexWriterMaxDocs, TestBooleanUnevenly, TestCachingWrapperFilter, TestPerSegmentDeletes, TestSimpleSearchEquivalence, TestFlushByRamOrCountsPolicy, TestLookaheadTokenFilter, TestReaderClosed, TestStoredFieldsFormat, TestDocValuesIndexing, TestSimpleFSDirectory, Nested1, TestStringHelper, Test2BBinaryDocValues, TestByteSlices, TestCrash, TestFieldValueFilter, TestLucene40TermVectorsFormat, TestNumericRangeQuery64, TestBytesStore, TestLucene42DocValuesFormat, TestDeletionPolicy, TestBooleanOr, TestSloppyPhraseQuery, TestIndexWriterDelete, TestIndexWriterMergePolicy, TestNRTThreads, TestNeverDelete, TestCompoundFile, TestLongPostings, TestMinimize, TestDocTermOrdsRewriteMethod, TestIndexWriterUnicode, TestNRTReaderWithThreads, TestPerFieldPostingsFormat, TestArrayUtil, TestLevenshteinAutomata, TestDocTermOrdsRangeFilter, TestSegmentMerger, TestCollectionUtil, TestFixedBitSet, TestMockAnalyzer, TestToken, TestCustomSearcherSort, TestSpanExplanations, TestRAMDirectory, TestMultiPhraseQuery, TestLazyProxSkipping, TestDocsAndPositions, TestTermVectorsWriter, TestCodecs, TestCharTermAttributeImpl, TestPayloadExplanations, TestBytesRefHash, TestThreadedForceMerge, TestSloppyPhraseQuery2, TestDisjunctionMaxQuery, TestForceMergeForever, TestOmitTf, TestNearSpansOrdered, TestSameScoresWithThreads, TestMultiFields, TestFileSwitchDirectory, TestRegexpRandom, TestCheckIndex, TestSearchForDuplicates, InBeforeClass, InAfterClass, InTestMethod, NonStringProperties, TestIndexFileDeleter, TestMatchAllDocsQuery, TestPrefixQuery, Before3, Before3, TestDocIdSet, TestElevationComparator, TestSubScorerFreqs, TestConjunctions, TestField, TestSimilarityProvider, TestSetOnce, TestCachingTokenFilter, TestDateFilter, TestDateTools, TestCharsRef, Test2BPostings, TestLucene42NormsFormat, TestFieldType, TestAllFilesHaveChecksumFooter, TestDocInverterPerFieldErrorInfo, TestIndexWriterOutOfMemory]
>    [junit4] Completed on J0 in 547.06s, 1 test, 1 error <<< FAILURES!
>
> [...truncated 125 lines...]
> BUILD FAILED
> /usr/home/jenkins/jenkins-slave/workspace/Lucene-Solr-NightlyTests-trunk/build.xml:481: The following error occurred while executing this line:
> /usr/home/jenkins/jenkins-slave/workspace/Lucene-Solr-NightlyTests-trunk/build.xml:454: The following error occurred while executing this line:
> /usr/home/jenkins/jenkins-slave/workspace/Lucene-Solr-NightlyTests-trunk/build.xml:45: The following error occurred while executing this line:
> /usr/home/jenkins/jenkins-slave/workspace/Lucene-Solr-NightlyTests-trunk/extra-targets.xml:37: The following error occurred while executing this line:
> /usr/home/jenkins/jenkins-slave/workspace/Lucene-Solr-NightlyTests-trunk/lucene/build.xml:49: The following error occurred while executing this line:
> /usr/home/jenkins/jenkins-slave/workspace/Lucene-Solr-NightlyTests-trunk/lucene/common-build.xml:1350: The following error occurred while executing this line:
> /usr/home/jenkins/jenkins-slave/workspace/Lucene-Solr-NightlyTests-trunk/lucene/common-build.xml:965: There were test failures: 406 suites, 3523 tests, 1 error, 105 ignored (94 assumptions)
>
> Total time: 89 minutes 36 seconds
> Build step 'Invoke Ant' marked build as failure
> Archiving artifacts
> Sending artifact delta relative to Lucene-Solr-NightlyTests-trunk #605
> Archived 3 artifacts
> Archive block size is 32768
> Received 0 blocks and 15276342 bytes
> Compression is 0.0%
> Took 3.1 sec
> Recording test results
> Email was triggered for: Failure
> Sending email for trigger: Failure
>
>
>
>
> ---------------------------------------------------------------------
> To unsubscribe, e-mail: dev-unsubscribe@lucene.apache.org
> For additional commands, e-mail: dev-help@lucene.apache.org

---------------------------------------------------------------------
To unsubscribe, e-mail: dev-unsubscribe@lucene.apache.org
For additional commands, e-mail: dev-help@lucene.apache.org


Mime
View raw message