lucene-dev mailing list archives

Site index · List index
Message view « Date » · « Thread »
Top « Date » · « Thread »
From Ryan Ernst <r...@iernst.net>
Subject Re: [JENKINS] Lucene-4x-Linux-Java7-64-test-only - Build # 29371 - Failure!
Date Thu, 21 Aug 2014 21:10:45 GMT
I fixed this as well.

On Thu, Aug 21, 2014 at 2:02 PM,  <builder@flonkings.com> wrote:
> Build: builds.flonkings.com/job/Lucene-4x-Linux-Java7-64-test-only/29371/
>
> 2 tests failed.
> REGRESSION:  org.apache.lucene.util.TestVersion.testDeprecations
>
> Error Message:
> LUCENE_4_11_0 should be deprecated
>
> Stack Trace:
> java.lang.AssertionError: LUCENE_4_11_0 should be deprecated
>         at __randomizedtesting.SeedInfo.seed([FC4F704819C60CDB:1FE6356F8AB6B42A]:0)
>         at org.junit.Assert.fail(Assert.java:93)
>         at org.junit.Assert.assertTrue(Assert.java:43)
>         at org.apache.lucene.util.TestVersion.testDeprecations(TestVersion.java:179)
>         at sun.reflect.NativeMethodAccessorImpl.invoke0(Native Method)
>         at sun.reflect.NativeMethodAccessorImpl.invoke(NativeMethodAccessorImpl.java:57)
>         at sun.reflect.DelegatingMethodAccessorImpl.invoke(DelegatingMethodAccessorImpl.java:43)
>         at java.lang.reflect.Method.invoke(Method.java:606)
>         at com.carrotsearch.randomizedtesting.RandomizedRunner.invoke(RandomizedRunner.java:1618)
>         at com.carrotsearch.randomizedtesting.RandomizedRunner$6.evaluate(RandomizedRunner.java:827)
>         at com.carrotsearch.randomizedtesting.RandomizedRunner$7.evaluate(RandomizedRunner.java:863)
>         at com.carrotsearch.randomizedtesting.RandomizedRunner$8.evaluate(RandomizedRunner.java:877)
>         at org.apache.lucene.util.TestRuleSetupTeardownChained$1.evaluate(TestRuleSetupTeardownChained.java:50)
>         at org.apache.lucene.util.TestRuleFieldCacheSanity$1.evaluate(TestRuleFieldCacheSanity.java:51)
>         at org.apache.lucene.util.AbstractBeforeAfterRule$1.evaluate(AbstractBeforeAfterRule.java:46)
>         at com.carrotsearch.randomizedtesting.rules.SystemPropertiesInvariantRule$1.evaluate(SystemPropertiesInvariantRule.java:55)
>         at org.apache.lucene.util.TestRuleThreadAndTestName$1.evaluate(TestRuleThreadAndTestName.java:49)
>         at org.apache.lucene.util.TestRuleIgnoreAfterMaxFailures$1.evaluate(TestRuleIgnoreAfterMaxFailures.java:65)
>         at org.apache.lucene.util.TestRuleMarkFailure$1.evaluate(TestRuleMarkFailure.java:48)
>         at com.carrotsearch.randomizedtesting.rules.StatementAdapter.evaluate(StatementAdapter.java:36)
>         at com.carrotsearch.randomizedtesting.ThreadLeakControl$StatementRunner.run(ThreadLeakControl.java:365)
>         at com.carrotsearch.randomizedtesting.ThreadLeakControl.forkTimeoutingTask(ThreadLeakControl.java:798)
>         at com.carrotsearch.randomizedtesting.ThreadLeakControl$3.evaluate(ThreadLeakControl.java:458)
>         at com.carrotsearch.randomizedtesting.RandomizedRunner.runSingleTest(RandomizedRunner.java:836)
>         at com.carrotsearch.randomizedtesting.RandomizedRunner$3.evaluate(RandomizedRunner.java:738)
>         at com.carrotsearch.randomizedtesting.RandomizedRunner$4.evaluate(RandomizedRunner.java:772)
>         at com.carrotsearch.randomizedtesting.RandomizedRunner$5.evaluate(RandomizedRunner.java:783)
>         at org.apache.lucene.util.AbstractBeforeAfterRule$1.evaluate(AbstractBeforeAfterRule.java:46)
>         at org.apache.lucene.util.TestRuleStoreClassName$1.evaluate(TestRuleStoreClassName.java:42)
>         at com.carrotsearch.randomizedtesting.rules.SystemPropertiesInvariantRule$1.evaluate(SystemPropertiesInvariantRule.java:55)
>         at com.carrotsearch.randomizedtesting.rules.NoShadowingOrOverridesOnMethodsRule$1.evaluate(NoShadowingOrOverridesOnMethodsRule.java:39)
>         at com.carrotsearch.randomizedtesting.rules.NoShadowingOrOverridesOnMethodsRule$1.evaluate(NoShadowingOrOverridesOnMethodsRule.java:39)
>         at com.carrotsearch.randomizedtesting.rules.StatementAdapter.evaluate(StatementAdapter.java:36)
>         at com.carrotsearch.randomizedtesting.rules.StatementAdapter.evaluate(StatementAdapter.java:36)
>         at com.carrotsearch.randomizedtesting.rules.StatementAdapter.evaluate(StatementAdapter.java:36)
>         at org.apache.lucene.util.TestRuleAssertionsRequired$1.evaluate(TestRuleAssertionsRequired.java:43)
>         at org.apache.lucene.util.TestRuleMarkFailure$1.evaluate(TestRuleMarkFailure.java:48)
>         at org.apache.lucene.util.TestRuleIgnoreAfterMaxFailures$1.evaluate(TestRuleIgnoreAfterMaxFailures.java:65)
>         at org.apache.lucene.util.TestRuleIgnoreTestSuites$1.evaluate(TestRuleIgnoreTestSuites.java:55)
>         at com.carrotsearch.randomizedtesting.rules.StatementAdapter.evaluate(StatementAdapter.java:36)
>         at com.carrotsearch.randomizedtesting.ThreadLeakControl$StatementRunner.run(ThreadLeakControl.java:365)
>         at java.lang.Thread.run(Thread.java:745)
>
>
> REGRESSION:  org.apache.lucene.util.TestVersion.testOnOrAfter
>
> Error Message:
> LATEST must be always onOrAfter(4.11.0)
>
> Stack Trace:
> java.lang.AssertionError: LATEST must be always onOrAfter(4.11.0)
>         at __randomizedtesting.SeedInfo.seed([FC4F704819C60CDB:E007E76CBDA4369]:0)
>         at org.junit.Assert.fail(Assert.java:93)
>         at org.junit.Assert.assertTrue(Assert.java:43)
>         at org.apache.lucene.util.TestVersion.testOnOrAfter(TestVersion.java:30)
>         at sun.reflect.NativeMethodAccessorImpl.invoke0(Native Method)
>         at sun.reflect.NativeMethodAccessorImpl.invoke(NativeMethodAccessorImpl.java:57)
>         at sun.reflect.DelegatingMethodAccessorImpl.invoke(DelegatingMethodAccessorImpl.java:43)
>         at java.lang.reflect.Method.invoke(Method.java:606)
>         at com.carrotsearch.randomizedtesting.RandomizedRunner.invoke(RandomizedRunner.java:1618)
>         at com.carrotsearch.randomizedtesting.RandomizedRunner$6.evaluate(RandomizedRunner.java:827)
>         at com.carrotsearch.randomizedtesting.RandomizedRunner$7.evaluate(RandomizedRunner.java:863)
>         at com.carrotsearch.randomizedtesting.RandomizedRunner$8.evaluate(RandomizedRunner.java:877)
>         at org.apache.lucene.util.TestRuleSetupTeardownChained$1.evaluate(TestRuleSetupTeardownChained.java:50)
>         at org.apache.lucene.util.TestRuleFieldCacheSanity$1.evaluate(TestRuleFieldCacheSanity.java:51)
>         at org.apache.lucene.util.AbstractBeforeAfterRule$1.evaluate(AbstractBeforeAfterRule.java:46)
>         at com.carrotsearch.randomizedtesting.rules.SystemPropertiesInvariantRule$1.evaluate(SystemPropertiesInvariantRule.java:55)
>         at org.apache.lucene.util.TestRuleThreadAndTestName$1.evaluate(TestRuleThreadAndTestName.java:49)
>         at org.apache.lucene.util.TestRuleIgnoreAfterMaxFailures$1.evaluate(TestRuleIgnoreAfterMaxFailures.java:65)
>         at org.apache.lucene.util.TestRuleMarkFailure$1.evaluate(TestRuleMarkFailure.java:48)
>         at com.carrotsearch.randomizedtesting.rules.StatementAdapter.evaluate(StatementAdapter.java:36)
>         at com.carrotsearch.randomizedtesting.ThreadLeakControl$StatementRunner.run(ThreadLeakControl.java:365)
>         at com.carrotsearch.randomizedtesting.ThreadLeakControl.forkTimeoutingTask(ThreadLeakControl.java:798)
>         at com.carrotsearch.randomizedtesting.ThreadLeakControl$3.evaluate(ThreadLeakControl.java:458)
>         at com.carrotsearch.randomizedtesting.RandomizedRunner.runSingleTest(RandomizedRunner.java:836)
>         at com.carrotsearch.randomizedtesting.RandomizedRunner$3.evaluate(RandomizedRunner.java:738)
>         at com.carrotsearch.randomizedtesting.RandomizedRunner$4.evaluate(RandomizedRunner.java:772)
>         at com.carrotsearch.randomizedtesting.RandomizedRunner$5.evaluate(RandomizedRunner.java:783)
>         at org.apache.lucene.util.AbstractBeforeAfterRule$1.evaluate(AbstractBeforeAfterRule.java:46)
>         at org.apache.lucene.util.TestRuleStoreClassName$1.evaluate(TestRuleStoreClassName.java:42)
>         at com.carrotsearch.randomizedtesting.rules.SystemPropertiesInvariantRule$1.evaluate(SystemPropertiesInvariantRule.java:55)
>         at com.carrotsearch.randomizedtesting.rules.NoShadowingOrOverridesOnMethodsRule$1.evaluate(NoShadowingOrOverridesOnMethodsRule.java:39)
>         at com.carrotsearch.randomizedtesting.rules.NoShadowingOrOverridesOnMethodsRule$1.evaluate(NoShadowingOrOverridesOnMethodsRule.java:39)
>         at com.carrotsearch.randomizedtesting.rules.StatementAdapter.evaluate(StatementAdapter.java:36)
>         at com.carrotsearch.randomizedtesting.rules.StatementAdapter.evaluate(StatementAdapter.java:36)
>         at com.carrotsearch.randomizedtesting.rules.StatementAdapter.evaluate(StatementAdapter.java:36)
>         at org.apache.lucene.util.TestRuleAssertionsRequired$1.evaluate(TestRuleAssertionsRequired.java:43)
>         at org.apache.lucene.util.TestRuleMarkFailure$1.evaluate(TestRuleMarkFailure.java:48)
>         at org.apache.lucene.util.TestRuleIgnoreAfterMaxFailures$1.evaluate(TestRuleIgnoreAfterMaxFailures.java:65)
>         at org.apache.lucene.util.TestRuleIgnoreTestSuites$1.evaluate(TestRuleIgnoreTestSuites.java:55)
>         at com.carrotsearch.randomizedtesting.rules.StatementAdapter.evaluate(StatementAdapter.java:36)
>         at com.carrotsearch.randomizedtesting.ThreadLeakControl$StatementRunner.run(ThreadLeakControl.java:365)
>         at java.lang.Thread.run(Thread.java:745)
>
>
>
>
> Build Log:
> [...truncated 1424 lines...]
>    [junit4] Suite: org.apache.lucene.util.TestVersion
>    [junit4]   2> NOTE: reproduce with: ant test  -Dtestcase=TestVersion -Dtests.method=testDeprecations
-Dtests.seed=FC4F704819C60CDB -Dtests.slow=true -Dtests.locale=lt_LT -Dtests.timezone=Canada/Eastern
-Dtests.file.encoding=ISO-8859-1
>    [junit4] FAILURE 0.02s J3 | TestVersion.testDeprecations <<<
>    [junit4]    > Throwable #1: java.lang.AssertionError: LUCENE_4_11_0 should be deprecated
>    [junit4]    >        at __randomizedtesting.SeedInfo.seed([FC4F704819C60CDB:1FE6356F8AB6B42A]:0)
>    [junit4]    >        at org.apache.lucene.util.TestVersion.testDeprecations(TestVersion.java:179)
>    [junit4]    >        at java.lang.Thread.run(Thread.java:745)
>    [junit4]   2> NOTE: reproduce with: ant test  -Dtestcase=TestVersion -Dtests.method=testOnOrAfter
-Dtests.seed=FC4F704819C60CDB -Dtests.slow=true -Dtests.locale=lt_LT -Dtests.timezone=Canada/Eastern
-Dtests.file.encoding=ISO-8859-1
>    [junit4] FAILURE 0.03s J3 | TestVersion.testOnOrAfter <<<
>    [junit4]    > Throwable #1: java.lang.AssertionError: LATEST must be always onOrAfter(4.11.0)
>    [junit4]    >        at __randomizedtesting.SeedInfo.seed([FC4F704819C60CDB:E007E76CBDA4369]:0)
>    [junit4]    >        at org.apache.lucene.util.TestVersion.testOnOrAfter(TestVersion.java:30)
>    [junit4]    >        at java.lang.Thread.run(Thread.java:745)
>    [junit4]   2> NOTE: test params are: codec=Lucene410: {}, docValues:{}, sim=DefaultSimilarity,
locale=lt_LT, timezone=Canada/Eastern
>    [junit4]   2> NOTE: Linux 3.2.0-26-generic amd64/Oracle Corporation 1.7.0_65 (64-bit)/cpus=8,threads=1,free=190436088,total=245891072
>    [junit4]   2> NOTE: All tests run in this JVM: [TestLucene42DocValuesFormat, TestSortRescorer,
TestEarlyTermination, TestFieldCacheTermsFilter, TestTermdocPerf, TestFilterIterator, TestMockDirectoryWrapper,
TestFieldType, TestIndexReaderClose, TestAutomaton, Nested, Nested, TestTermScorer, TestPhrasePrefixQuery,
TestBooleanQueryVisitSubscorers, TestGraphTokenizers, TestDocCount, Test4GBStoredFields, TestSpans,
TestPackedTokenAttributeImpl, TestLucene40PostingsReader, TestLogMergePolicy, TestWindowsMMap,
TestSimilarityBase, TestLiveFieldValues, TestCustomNorms, TestDocValuesFormat, TestFlushByRamOrCountsPolicy,
TestIndexWriterDelete, TestAtomicUpdate, TestSearchWithThreads, TestSearchAfter, TestIndexWriterUnicode,
TestLockFactory, TestFixedBitSet, TestSegmentTermDocs, TestBooleanMinShouldMatch, TestSortDocValues,
TestDeterminism, TestOmitPositions, TestStressNRT, TestTermRangeQuery, TestCrashCausesCorruptIndex,
TestSpanSearchEquivalence, TestWildcard, TestPerSegmentDeletes, TestTopDocsCollector, TestSegmentTermEnum,
TestBooleanQuery, TestDocument, TestPrefixRandom, TestMatchAllDocsQuery, TestDocIdSet, TestMultiTermQueryRewrites,
TestSmallFloat, TestDateTools, TestRecyclingByteBlockAllocator, TestNamedSPILoader, TestRollback,
TestVersion]
>    [junit4] Completed on J3 in 0.15s, 10 tests, 2 failures <<< FAILURES!
>
> [...truncated 235 lines...]
> BUILD FAILED
> /var/lib/jenkins/workspace/Lucene-4x-Linux-Java7-64-test-only/checkout/lucene/build.xml:49:
The following error occurred while executing this line:
> /var/lib/jenkins/workspace/Lucene-4x-Linux-Java7-64-test-only/checkout/lucene/common-build.xml:1351:
The following error occurred while executing this line:
> /var/lib/jenkins/workspace/Lucene-4x-Linux-Java7-64-test-only/checkout/lucene/common-build.xml:966:
There were test failures: 418 suites, 3716 tests, 2 failures, 142 ignored (131 assumptions)
>
> Total time: 6 minutes 52 seconds
> Build step 'Invoke Ant' marked build as failure
> Archiving artifacts
> Recording test results
> Email was triggered for: Failure
> Sending email for trigger: Failure
>
>
>
>
> ---------------------------------------------------------------------
> To unsubscribe, e-mail: dev-unsubscribe@lucene.apache.org
> For additional commands, e-mail: dev-help@lucene.apache.org

---------------------------------------------------------------------
To unsubscribe, e-mail: dev-unsubscribe@lucene.apache.org
For additional commands, e-mail: dev-help@lucene.apache.org


Mime
View raw message