lucene-dev mailing list archives

Site index · List index
Message view « Date » · « Thread »
Top « Date » · « Thread »
From Apache Jenkins Server <jenk...@builds.apache.org>
Subject [JENKINS] Lucene-Solr-SmokeRelease-4.x - Build # 182 - Failure
Date Sat, 09 Aug 2014 16:47:38 GMT
Build: https://builds.apache.org/job/Lucene-Solr-SmokeRelease-4.x/182/

No tests ran.

Build Log:
[...truncated 51363 lines...]
prepare-release-no-sign:
    [mkdir] Created dir: /usr/home/hudson/hudson-slave/workspace/Lucene-Solr-SmokeRelease-4.x/lucene/build/fakeRelease
     [copy] Copying 431 files to /usr/home/hudson/hudson-slave/workspace/Lucene-Solr-SmokeRelease-4.x/lucene/build/fakeRelease/lucene
     [copy] Copying 239 files to /usr/home/hudson/hudson-slave/workspace/Lucene-Solr-SmokeRelease-4.x/lucene/build/fakeRelease/solr
     [exec] JAVA7_HOME is /home/hudson/tools/java/latest1.7
     [exec] NOTE: output encoding is US-ASCII
     [exec] 
     [exec] Load release URL "file:/usr/home/hudson/hudson-slave/workspace/Lucene-Solr-SmokeRelease-4.x/lucene/build/fakeRelease/"...
     [exec] 
     [exec] Test Lucene...
     [exec]   test basics...
     [exec]   get KEYS
     [exec]     0.1 MB in 0.01 sec (12.1 MB/sec)
     [exec]   check changes HTML...
     [exec]   download lucene-4.10.0-src.tgz...
     [exec]     27.7 MB in 0.03 sec (881.0 MB/sec)
     [exec]     verify md5/sha1 digests
     [exec]   download lucene-4.10.0.tgz...
     [exec]     61.8 MB in 0.13 sec (481.8 MB/sec)
     [exec]     verify md5/sha1 digests
     [exec]   download lucene-4.10.0.zip...
     [exec]     71.6 MB in 0.09 sec (764.8 MB/sec)
     [exec]     verify md5/sha1 digests
     [exec]   unpack lucene-4.10.0.tgz...
     [exec]     verify JAR metadata/identity/no javax.* or java.* classes...
     [exec]     test demo with 1.7...
     [exec]       got 5771 hits for query "lucene"
     [exec]     checkindex with 1.7...
     [exec]     check Lucene's javadoc JAR
     [exec]   unpack lucene-4.10.0.zip...
     [exec]     verify JAR metadata/identity/no javax.* or java.* classes...
     [exec]     test demo with 1.7...
     [exec]       got 5771 hits for query "lucene"
     [exec]     checkindex with 1.7...
     [exec]     check Lucene's javadoc JAR
     [exec]   unpack lucene-4.10.0-src.tgz...
     [exec]     make sure no JARs/WARs in src dist...
     [exec]     run "ant validate"
     [exec]     run tests w/ Java 7 and testArgs='-Dtests.jettyConnector=Socket  -Dtests.disableHdfs=true'...
     [exec]     test demo with 1.7...
     [exec]       got 258 hits for query "lucene"
     [exec]     checkindex with 1.7...
     [exec]     generate javadocs w/ Java 7...
     [exec] 
     [exec] Crawl/parse...
     [exec] 
     [exec] Verify...
     [exec] 
     [exec] Test Solr...
     [exec]   test basics...
     [exec]   get KEYS
     [exec]     0.1 MB in 0.00 sec (74.8 MB/sec)
     [exec]   check changes HTML...
     [exec]   download solr-4.10.0-src.tgz...
     [exec]     33.5 MB in 0.22 sec (149.1 MB/sec)
     [exec]     verify md5/sha1 digests
     [exec]   download solr-4.10.0.tgz...
     [exec]     146.0 MB in 0.33 sec (448.7 MB/sec)
     [exec]     verify md5/sha1 digests
     [exec]   download solr-4.10.0.zip...
     [exec]     151.6 MB in 0.20 sec (739.9 MB/sec)
     [exec]     verify md5/sha1 digests
     [exec]   unpack solr-4.10.0.tgz...
     [exec]     verify JAR metadata/identity/no javax.* or java.* classes...
     [exec]     unpack lucene-4.10.0.tgz...
     [exec]       **WARNING**: skipping check of /usr/home/hudson/hudson-slave/workspace/Lucene-Solr-SmokeRelease-4.x/lucene/build/fakeReleaseTmp/unpack/solr-4.10.0/contrib/dataimporthandler-extras/lib/activation-1.1.1.jar: it has javax.* classes
     [exec]       **WARNING**: skipping check of /usr/home/hudson/hudson-slave/workspace/Lucene-Solr-SmokeRelease-4.x/lucene/build/fakeReleaseTmp/unpack/solr-4.10.0/contrib/dataimporthandler-extras/lib/javax.mail-1.5.1.jar: it has javax.* classes
     [exec]     verify WAR metadata/contained JAR identity/no javax.* or java.* classes...
     [exec]     unpack lucene-4.10.0.tgz...
     [exec]     copying unpacked distribution for Java 7 ...
     [exec]     test solr example w/ Java 7...
     [exec]       start Solr instance (log=/usr/home/hudson/hudson-slave/workspace/Lucene-Solr-SmokeRelease-4.x/lucene/build/fakeReleaseTmp/unpack/solr-4.10.0-java7/solr-example.log)...
     [exec]       startup done
     [exec]       test utf8...
     [exec]       index example docs...
     [exec]       run query...
     [exec]       stop server (SIGINT)...
     [exec]   unpack solr-4.10.0.zip...
     [exec]     verify JAR metadata/identity/no javax.* or java.* classes...
     [exec]     unpack lucene-4.10.0.tgz...
     [exec]       **WARNING**: skipping check of /usr/home/hudson/hudson-slave/workspace/Lucene-Solr-SmokeRelease-4.x/lucene/build/fakeReleaseTmp/unpack/solr-4.10.0/contrib/dataimporthandler-extras/lib/activation-1.1.1.jar: it has javax.* classes
     [exec]       **WARNING**: skipping check of /usr/home/hudson/hudson-slave/workspace/Lucene-Solr-SmokeRelease-4.x/lucene/build/fakeReleaseTmp/unpack/solr-4.10.0/contrib/dataimporthandler-extras/lib/javax.mail-1.5.1.jar: it has javax.* classes
     [exec]     verify WAR metadata/contained JAR identity/no javax.* or java.* classes...
     [exec]     unpack lucene-4.10.0.tgz...
     [exec]     copying unpacked distribution for Java 7 ...
     [exec]     test solr example w/ Java 7...
     [exec]       start Solr instance (log=/usr/home/hudson/hudson-slave/workspace/Lucene-Solr-SmokeRelease-4.x/lucene/build/fakeReleaseTmp/unpack/solr-4.10.0-java7/solr-example.log)...
     [exec]       startup done
     [exec]       test utf8...
     [exec]       index example docs...
     [exec]       run query...
     [exec]       stop server (SIGINT)...
     [exec]   unpack solr-4.10.0-src.tgz...
     [exec]     make sure no JARs/WARs in src dist...
     [exec]     run "ant validate"
     [exec]     run tests w/ Java 7 and testArgs='-Dtests.jettyConnector=Socket  -Dtests.disableHdfs=true'...
     [exec] 
     [exec] command "export JAVA_HOME="/home/hudson/tools/java/latest1.7" PATH="/home/hudson/tools/java/latest1.7/bin:$PATH" JAVACMD="/home/hudson/tools/java/latest1.7/bin/java"; ant clean test -Dtests.slow=false -Dtests.jettyConnector=Socket  -Dtests.disableHdfs=true" failed:
     [exec] Buildfile: /usr/home/hudson/hudson-slave/workspace/Lucene-Solr-SmokeRelease-4.x/lucene/build/fakeReleaseTmp/unpack/solr-4.10.0/solr/build.xml
     [exec]      [echo] Building solr...
     [exec] 
     [exec] clean:
     [exec]    [delete] Deleting directory /usr/home/hudson/hudson-slave/workspace/Lucene-Solr-SmokeRelease-4.x/lucene/build/fakeReleaseTmp/unpack/solr-4.10.0/solr/build
     [exec] 
     [exec] ivy-availability-check:
     [exec]      [echo] Building solr...
     [exec] 
     [exec] ivy-fail:
     [exec] 
     [exec] ivy-configure:
     [exec] [ivy:configure] :: Apache Ivy 2.3.0 - 20130110142753 :: http://ant.apache.org/ivy/ ::
     [exec] [ivy:configure] :: loading settings :: file = /usr/home/hudson/hudson-slave/workspace/Lucene-Solr-SmokeRelease-4.x/lucene/build/fakeReleaseTmp/unpack/solr-4.10.0/lucene/ivy-settings.xml
     [exec] 
     [exec] resolve-groovy:
     [exec] [ivy:cachepath] :: resolving dependencies :: org.codehaus.groovy#groovy-all-caller;working
     [exec] [ivy:cachepath] 	confs: [default]
     [exec] [ivy:cachepath] 	found org.codehaus.groovy#groovy-all;2.3.1 in public
     [exec] [ivy:cachepath] :: resolution report :: resolve 141ms :: artifacts dl 3ms
     [exec] 	---------------------------------------------------------------------
     [exec] 	|                  |            modules            ||   artifacts   |
     [exec] 	|       conf       | number| search|dwnlded|evicted|| number|dwnlded|
     [exec] 	---------------------------------------------------------------------
     [exec] 	|      default     |   1   |   0   |   0   |   0   ||   1   |   0   |
     [exec] 	---------------------------------------------------------------------
     [exec] 
     [exec] -init-totals:
     [exec]     [mkdir] Created dir: /usr/home/hudson/hudson-slave/workspace/Lucene-Solr-SmokeRelease-4.x/lucene/build/fakeReleaseTmp/unpack/solr-4.10.0/solr/build/solr
     [exec] 
     [exec] -clover.load:
     [exec] 
     [exec] test-solr-core:
     [exec]      [echo] Building solr-core...
     [exec] 
     [exec] test:
     [exec]      [echo] Building solr-core...
     [exec] 
     [exec] -clover.disable:
     [exec] 
     [exec] ivy-availability-check:
     [exec]      [echo] Building solr-core...
     [exec] 
     [exec] ivy-fail:
     [exec] 
     [exec] ivy-configure:
     [exec] [ivy:configure] :: loading settings :: file = /usr/home/hudson/hudson-slave/workspace/Lucene-Solr-SmokeRelease-4.x/lucene/build/fakeReleaseTmp/unpack/solr-4.10.0/lucene/ivy-settings.xml
     [exec] 
     [exec] -clover.load:
     [exec] 
     [exec] -clover.classpath:
     [exec] 
     [exec] -clover.setup:
     [exec] 
     [exec] clover:
     [exec] 
     [exec] check-analyzers-icu-uptodate:
     [exec] 
     [exec] jar-analyzers-icu:
     [exec] 
     [exec] -compile-analysis-extras:
     [exec]      [echo] Building solr-analysis-extras...
     [exec] 
     [exec] check-analyzers-icu-uptodate:
     [exec] 
     [exec] jar-analyzers-icu:
     [exec] 
     [exec] compile-solr-core:
     [exec]      [echo] Building solr-core...
     [exec] 
     [exec] compile-solrj:
     [exec]      [echo] Building solr-solrj...
     [exec] 
     [exec] check-lucene-core-uptodate:
     [exec] 
     [exec] jar-lucene-core:
     [exec] 
     [exec] check-analyzers-phonetic-uptodate:
     [exec] 
     [exec] jar-analyzers-phonetic:
     [exec] 
     [exec] check-analyzers-kuromoji-uptodate:
     [exec] 
     [exec] jar-analyzers-kuromoji:
     [exec] 
     [exec] check-codecs-uptodate:
     [exec] 
     [exec] jar-codecs:
     [exec] 
     [exec] check-expressions-uptodate:
     [exec] 
     [exec] jar-expressions:
     [exec] 
     [exec] check-suggest-uptodate:
     [exec] 
     [exec] jar-suggest:
     [exec] 
     [exec] check-highlighter-uptodate:
     [exec] 
     [exec] jar-highlighter:
     [exec] 
     [exec] check-memory-uptodate:
     [exec] 
     [exec] jar-memory:
     [exec] 
     [exec] check-misc-uptodate:
     [exec] 
     [exec] jar-misc:
     [exec] 
     [exec] check-spatial-uptodate:
     [exec] 
     [exec] jar-spatial:
     [exec] 
     [exec] check-grouping-uptodate:
     [exec] 
     [exec] jar-grouping:
     [exec] 
     [exec] check-queries-uptodate:
     [exec] 
     [exec] jar-queries:
     [exec] 
     [exec] check-queryparser-uptodate:
     [exec] 
     [exec] jar-queryparser:
     [exec] 
     [exec] check-join-uptodate:
     [exec] 
     [exec] jar-join:
     [exec] 
     [exec] prep-lucene-jars:
     [exec] 
     [exec] resolve-example:
     [exec]      [echo] Building solr-example...
     [exec] 
     [exec] ivy-availability-check:
     [exec]      [echo] Building solr-example...
     [exec] 
     [exec] ivy-fail:
     [exec] 
     [exec] ivy-fail:
     [exec] 
     [exec] ivy-configure:
     [exec] [ivy:configure] :: loading settings :: file = /usr/home/hudson/hudson-slave/workspace/Lucene-Solr-SmokeRelease-4.x/lucene/build/fakeReleaseTmp/unpack/solr-4.10.0/lucene/ivy-settings.xml
     [exec] 
     [exec] sync-hack:
     [exec] 
     [exec] resolve:
     [exec]      [echo] Building solr-example-DIH...
     [exec] 
     [exec] ivy-availability-check:
     [exec]      [echo] Building solr-example-DIH...
     [exec] 
     [exec] ivy-fail:
     [exec] 
     [exec] ivy-configure:
     [exec] [ivy:configure] :: loading settings :: file = /usr/home/hudson/hudson-slave/workspace/Lucene-Solr-SmokeRelease-4.x/lucene/build/fakeReleaseTmp/unpack/solr-4.10.0/lucene/ivy-settings.xml
     [exec] 
     [exec] resolve:
     [exec] 
     [exec] ivy-availability-check:
     [exec]      [echo] Building solr-solrj...
     [exec] 
     [exec] ivy-fail:
     [exec] 
     [exec] ivy-fail:
     [exec] 
     [exec] ivy-configure:
     [exec] [ivy:configure] :: loading settings :: file = /usr/home/hudson/hudson-slave/workspace/Lucene-Solr-SmokeRelease-4.x/lucene/build/fakeReleaseTmp/unpack/solr-4.10.0/lucene/ivy-settings.xml
     [exec] 
     [exec] resolve:
     [exec] 
     [exec] common.init:
     [exec] 
     [exec] compile-lucene-core:
     [exec] 
     [exec] ivy-availability-check:
     [exec] 
     [exec] ivy-fail:
     [exec] 
     [exec] ivy-configure:
     [exec] [ivy:configure] :: loading settings :: file = /usr/home/hudson/hudson-slave/workspace/Lucene-Solr-SmokeRelease-4.x/lucene/build/fakeReleaseTmp/unpack/solr-4.10.0/lucene/ivy-settings.xml
     [exec] 
     [exec] resolve:
     [exec] 
     [exec] init:
     [exec] 
     [exec] -clover.disable:
     [exec] 
     [exec] -clover.load:
     [exec] 
     [exec] -clover.classpath:
     [exec] 
     [exec] -clover.setup:
     [exec] 
     [exec] clover:
     [exec] 
     [exec] compile-core:
     [exec] 
     [exec] init:
     [exec] 
     [exec] -clover.disable:
     [exec] 
     [exec] -clover.load:
     [exec] 
     [exec] -clover.classpath:
     [exec] 
     [exec] -clover.setup:
     [exec] 
     [exec] clover:
     [exec] 
     [exec] common.compile-core:
     [exec]     [mkdir] Created dir: /usr/home/hudson/hudson-slave/workspace/Lucene-Solr-SmokeRelease-4.x/lucene/build/fakeReleaseTmp/unpack/solr-4.10.0/solr/build/solr-solrj/classes/java
     [exec]     [javac] Compiling 137 source files to /usr/home/hudson/hudson-slave/workspace/Lucene-Solr-SmokeRelease-4.x/lucene/build/fakeReleaseTmp/unpack/solr-4.10.0/solr/build/solr-solrj/classes/java
     [exec]     [javac] Note: Some input files use or override a deprecated API.
     [exec]     [javac] Note: Recompile with -Xlint:deprecation for details.
     [exec]     [javac] Note: Some input files use unchecked or unsafe operations.
     [exec]     [javac] Note: Recompile with -Xlint:unchecked for details.
     [exec] 
     [exec] compile-core:
     [exec] 
     [exec] check-lucene-core-uptodate:
     [exec] 
     [exec] jar-lucene-core:
     [exec] 
     [exec] check-analyzers-phonetic-uptodate:
     [exec] 
     [exec] jar-analyzers-phonetic:
     [exec] 
     [exec] check-analyzers-kuromoji-uptodate:
     [exec] 
     [exec] jar-analyzers-kuromoji:
     [exec] 
     [exec] check-codecs-uptodate:
     [exec] 
     [exec] jar-codecs:
     [exec] 
     [exec] check-expressions-uptodate:
     [exec] 
     [exec] jar-expressions:
     [exec] 
     [exec] check-suggest-uptodate:
     [exec] 
     [exec] jar-suggest:
     [exec] 
     [exec] check-highlighter-uptodate:
     [exec] 
     [exec] jar-highlighter:
     [exec] 
     [exec] check-memory-uptodate:
     [exec] 
     [exec] jar-memory:
     [exec] 
     [exec] check-misc-uptodate:
     [exec] 
     [exec] jar-misc:
     [exec] 
     [exec] check-spatial-uptodate:
     [exec] 
     [exec] jar-spatial:
     [exec] 
     [exec] check-grouping-uptodate:
     [exec] 
     [exec] jar-grouping:
     [exec] 
     [exec] check-queries-uptodate:
     [exec] 
     [exec] jar-queries:
     [exec] 
     [exec] check-queryparser-uptodate:
     [exec] 
     [exec] jar-queryparser:
     [exec] 
     [exec] check-join-uptodate:
     [exec] 
     [exec] jar-join:
     [exec] 
     [exec] prep-lucene-jars:
     [exec] 
     [exec] resolve-example:
     [exec]      [echo] Building solr-example...
     [exec] 
     [exec] ivy-availability-check:
     [exec]      [echo] Building solr-example...
     [exec] 
     [exec] ivy-fail:
     [exec] 
     [exec] ivy-fail:
     [exec] 
     [exec] ivy-configure:
     [exec] [ivy:configure] :: loading settings :: file = /usr/home/hudson/hudson-slave/workspace/Lucene-Solr-SmokeRelease-4.x/lucene/build/fakeReleaseTmp/unpack/solr-4.10.0/lucene/ivy-settings.xml
     [exec] 
     [exec] sync-hack:
     [exec] 
     [exec] resolve:
     [exec]      [echo] Building solr-example-DIH...
     [exec] 
     [exec] ivy-availability-check:
     [exec]      [echo] Building solr-example-DIH...
     [exec] 
     [exec] ivy-fail:
     [exec] 
     [exec] ivy-configure:
     [exec] [ivy:configure] :: loading settings :: file = /usr/home/hudson/hudson-slave/workspace/Lucene-Solr-SmokeRelease-4.x/lucene/build/fakeReleaseTmp/unpack/solr-4.10.0/lucene/ivy-settings.xml
     [exec] 
     [exec] resolve:
     [exec] 
     [exec] ivy-availability-check:
     [exec]      [echo] Building solr-core...
     [exec] 
     [exec] ivy-fail:
     [exec] 
     [exec] ivy-fail:
     [exec] 
     [exec] ivy-configure:
     [exec] [ivy:configure] :: loading settings :: file = /usr/home/hudson/hudson-slave/workspace/Lucene-Solr-SmokeRelease-4.x/lucene/build/fakeReleaseTmp/unpack/solr-4.10.0/lucene/ivy-settings.xml
     [exec] 
     [exec] resolve:
     [exec] 
     [exec] common.init:
     [exec] 
     [exec] compile-lucene-core:
     [exec] 
     [exec] ivy-availability-check:
     [exec] 
     [exec] ivy-fail:
     [exec] 
     [exec] ivy-configure:
     [exec] [ivy:configure] :: loading settings :: file = /usr/home/hudson/hudson-slave/workspace/Lucene-Solr-SmokeRelease-4.x/lucene/build/fakeReleaseTmp/unpack/solr-4.10.0/lucene/ivy-settings.xml
     [exec] 
     [exec] resolve:
     [exec] 
     [exec] init:
     [exec] 
     [exec] -clover.disable:
     [exec] 
     [exec] -clover.load:
     [exec] 
     [exec] -clover.classpath:
     [exec] 
     [exec] -clover.setup:
     [exec] 
     [exec] clover:
     [exec] 
     [exec] compile-core:
     [exec] 
     [exec] init:
     [exec] 
     [exec] -clover.disable:
     [exec] 
     [exec] -clover.load:
     [exec] 
     [exec] -clover.classpath:
     [exec] 
     [exec] -clover.setup:
     [exec] 
     [exec] clover:
     [exec] 
     [exec] common.compile-core:
     [exec]     [mkdir] Created dir: /usr/home/hudson/hudson-slave/workspace/Lucene-Solr-SmokeRelease-4.x/lucene/build/fakeReleaseTmp/unpack/solr-4.10.0/solr/build/solr-core/classes/java
     [exec]     [javac] Compiling 669 source files to /usr/home/hudson/hudson-slave/workspace/Lucene-Solr-SmokeRelease-4.x/lucene/build/fakeReleaseTmp/unpack/solr-4.10.0/solr/build/solr-core/classes/java
     [exec]     [javac] Note: Some input files use or override a deprecated API.
     [exec]     [javac] Note: Recompile with -Xlint:deprecation for details.
     [exec]     [javac] Note: Some input files use unchecked or unsafe operations.
     [exec]     [javac] Note: Recompile with -Xlint:unchecked for details.
     [exec] 
     [exec] common-solr.compile-core:
     [exec] 
     [exec] compile-core:
     [exec] 
     [exec] compile-solrj:
     [exec]      [echo] Building solr-solrj...
     [exec] 
     [exec] check-lucene-core-uptodate:
     [exec] 
     [exec] jar-lucene-core:
     [exec] 
     [exec] check-analyzers-phonetic-uptodate:
     [exec] 
     [exec] jar-analyzers-phonetic:
     [exec] 
     [exec] check-analyzers-kuromoji-uptodate:
     [exec] 
     [exec] jar-analyzers-kuromoji:
     [exec] 
     [exec] check-codecs-uptodate:
     [exec] 
     [exec] jar-codecs:
     [exec] 
     [exec] check-expressions-uptodate:
     [exec] 
     [exec] jar-expressions:
     [exec] 
     [exec] check-suggest-uptodate:
     [exec] 
     [exec] jar-suggest:
     [exec] 
     [exec] check-highlighter-uptodate:
     [exec] 
     [exec] jar-highlighter:
     [exec] 
     [exec] check-memory-uptodate:
     [exec] 
     [exec] jar-memory:
     [exec] 
     [exec] check-misc-uptodate:
     [exec] 
     [exec] jar-misc:
     [exec] 
     [exec] check-spatial-uptodate:
     [exec] 
     [exec] jar-spatial:
     [exec] 
     [exec] check-grouping-uptodate:
     [exec] 
     [exec] jar-grouping:
     [exec] 
     [exec] check-queries-uptodate:
     [exec] 
     [exec] jar-queries:
     [exec] 
     [exec] check-queryparser-uptodate:
     [exec] 
     [exec] jar-queryparser:
     [exec] 
     [exec] check-join-uptodate:
     [exec] 
     [exec] jar-join:
     [exec] 
     [exec] prep-lucene-jars:
     [exec] 
     [exec] resolve-example:
     [exec]      [echo] Building solr-example...
     [exec] 
     [exec] ivy-availability-check:
     [exec]      [echo] Building solr-example...
     [exec] 
     [exec] ivy-fail:
     [exec] 
     [exec] ivy-fail:
     [exec] 
     [exec] ivy-configure:
     [exec] [ivy:configure] :: loading settings :: file = /usr/home/hudson/hudson-slave/workspace/Lucene-Solr-SmokeRelease-4.x/lucene/build/fakeReleaseTmp/unpack/solr-4.10.0/lucene/ivy-settings.xml
     [exec] 
     [exec] sync-hack:
     [exec] 
     [exec] resolve:
     [exec]      [echo] Building solr-example-DIH...
     [exec] 
     [exec] ivy-availability-check:
     [exec]      [echo] Building solr-example-DIH...
     [exec] 
     [exec] ivy-fail:
     [exec] 
     [exec] ivy-configure:
     [exec] [ivy:configure] :: loading settings :: file = /usr/home/hudson/hudson-slave/workspace/Lucene-Solr-SmokeRelease-4.x/lucene/build/fakeReleaseTmp/unpack/solr-4.10.0/lucene/ivy-settings.xml
     [exec] 
     [exec] resolve:
     [exec] 
     [exec] ivy-availability-check:
     [exec]      [echo] Building solr-solrj...
     [exec] 
     [exec] ivy-fail:
     [exec] 
     [exec] ivy-fail:
     [exec] 
     [exec] ivy-configure:
     [exec] [ivy:configure] :: loading settings :: file = /usr/home/hudson/hudson-slave/workspace/Lucene-Solr-SmokeRelease-4.x/lucene/build/fakeReleaseTmp/unpack/solr-4.10.0/lucene/ivy-settings.xml
     [exec] 
     [exec] resolve:
     [exec] 
     [exec] common.init:
     [exec] 
     [exec] compile-lucene-core:
     [exec] 
     [exec] ivy-availability-check:
     [exec] 
     [exec] ivy-fail:
     [exec] 
     [exec] ivy-configure:
     [exec] [ivy:configure] :: loading settings :: file = /usr/home/hudson/hudson-slave/workspace/Lucene-Solr-SmokeRelease-4.x/lucene/build/fakeReleaseTmp/unpack/solr-4.10.0/lucene/ivy-settings.xml
     [exec] 
     [exec] resolve:
     [exec] 
     [exec] init:
     [exec] 
     [exec] -clover.disable:
     [exec] 
     [exec] -clover.load:
     [exec] 
     [exec] -clover.classpath:
     [exec] 
     [exec] -clover.setup:
     [exec] 
     [exec] clover:
     [exec] 
     [exec] compile-core:
     [exec] 
     [exec] init:
     [exec] 
     [exec] -clover.disable:
     [exec] 
     [exec] -clover.load:
     [exec] 
     [exec] -clover.classpath:
     [exec] 
     [exec] -clover.setup:
     [exec] 
     [exec] clover:
     [exec] 
     [exec] common.compile-core:
     [exec] 
     [exec] compile-core:
     [exec] 
     [exec] check-lucene-core-uptodate:
     [exec] 
     [exec] jar-lucene-core:
     [exec] 
     [exec] check-analyzers-phonetic-uptodate:
     [exec] 
     [exec] jar-analyzers-phonetic:
     [exec] 
     [exec] check-analyzers-kuromoji-uptodate:
     [exec] 
     [exec] jar-analyzers-kuromoji:
     [exec] 
     [exec] check-codecs-uptodate:
     [exec] 
     [exec] jar-codecs:
     [exec] 
     [exec] check-expressions-uptodate:
     [exec] 
     [exec] jar-expressions:
     [exec] 
     [exec] check-suggest-uptodate:
     [exec] 
     [exec] jar-suggest:
     [exec] 
     [exec] check-highlighter-uptodate:
     [exec] 
     [exec] jar-highlighter:
     [exec] 
     [exec] check-memory-uptodate:
     [exec] 
     [exec] jar-memory:
     [exec] 
     [exec] check-misc-uptodate:
     [exec] 
     [exec] jar-misc:
     [exec] 
     [exec] check-spatial-uptodate:
     [exec] 
     [exec] jar-spatial:
     [exec] 
     [exec] check-grouping-uptodate:
     [exec] 
     [exec] jar-grouping:
     [exec] 
     [exec] check-queries-uptodate:
     [exec] 
     [exec] jar-queries:
     [exec] 
     [exec] check-queryparser-uptodate:
     [exec] 
     [exec] jar-queryparser:
     [exec] 
     [exec] check-join-uptodate:
     [exec] 
     [exec] jar-join:
     [exec] 
     [exec] prep-lucene-jars:
     [exec] 
     [exec] resolve-example:
     [exec]      [echo] Building solr-example...
     [exec] 
     [exec] ivy-availability-check:
     [exec]      [echo] Building solr-example...
     [exec] 
     [exec] ivy-fail:
     [exec] 
     [exec] ivy-fail:
     [exec] 
     [exec] ivy-configure:
     [exec] [ivy:configure] :: loading settings :: file = /usr/home/hudson/hudson-slave/workspace/Lucene-Solr-SmokeRelease-4.x/lucene/build/fakeReleaseTmp/unpack/solr-4.10.0/lucene/ivy-settings.xml
     [exec] 
     [exec] sync-hack:
     [exec] 
     [exec] resolve:
     [exec]      [echo] Building solr-example-DIH...
     [exec] 
     [exec] ivy-availability-check:
     [exec]      [echo] Building solr-example-DIH...
     [exec] 
     [exec] ivy-fail:
     [exec] 
     [exec] ivy-configure:
     [exec] [ivy:configure] :: loading settings :: file = /usr/home/hudson/hudson-slave/workspace/Lucene-Solr-SmokeRelease-4.x/lucene/build/fakeReleaseTmp/unpack/solr-4.10.0/lucene/ivy-settings.xml
     [exec] 
     [exec] resolve:
     [exec] 
     [exec] ivy-availability-check:
     [exec]      [echo] Building solr-analysis-extras...
     [exec] 
     [exec] ivy-fail:
     [exec] 
     [exec] ivy-fail:
     [exec] 
     [exec] ivy-configure:
     [exec] [ivy:configure] :: loading settings :: file = /usr/home/hudson/hudson-slave/workspace/Lucene-Solr-SmokeRelease-4.x/lucene/build/fakeReleaseTmp/unpack/solr-4.10.0/lucene/ivy-settings.xml
     [exec] 
     [exec] resolve:
     [exec] 
     [exec] common.init:
     [exec] 
     [exec] compile-lucene-core:
     [exec] 
     [exec] ivy-availability-check:
     [exec] 
     [exec] ivy-fail:
     [exec] 
     [exec] ivy-configure:
     [exec] [ivy:configure] :: loading settings :: file = /usr/home/hudson/hudson-slave/workspace/Lucene-Solr-SmokeRelease-4.x/lucene/build/fakeReleaseTmp/unpack/solr-4.10.0/lucene/ivy-settings.xml
     [exec] 
     [exec] resolve:
     [exec] 
     [exec] init:
     [exec] 
     [exec] -clover.disable:
     [exec] 
     [exec] -clover.load:
     [exec] 
     [exec] -clover.classpath:
     [exec] 
     [exec] -clover.setup:
     [exec] 
     [exec] clover:
     [exec] 
     [exec] compile-core:
     [exec] 
     [exec] init:
     [exec] 
     [exec] -clover.disable:
     [exec] 
     [exec] -clover.load:
     [exec] 
     [exec] -clover.classpath:
     [exec] 
     [exec] -clover.setup:
     [exec] 
     [exec] clover:
     [exec] 
     [exec] common.compile-core:
     [exec]     [mkdir] Created dir: /usr/home/hudson/hudson-slave/workspace/Lucene-Solr-SmokeRelease-4.x/lucene/build/fakeReleaseTmp/unpack/solr-4.10.0/solr/build/contrib/solr-analysis-extras/classes/java
     [exec]     [javac] Compiling 1 source file to /usr/home/hudson/hudson-slave/workspace/Lucene-Solr-SmokeRelease-4.x/lucene/build/fakeReleaseTmp/unpack/solr-4.10.0/solr/build/contrib/solr-analysis-extras/classes/java
     [exec]     [javac] Note: /usr/home/hudson/hudson-slave/workspace/Lucene-Solr-SmokeRelease-4.x/lucene/build/fakeReleaseTmp/unpack/solr-4.10.0/solr/contrib/analysis-extras/src/java/org/apache/solr/schema/ICUCollationField.java uses or overrides a deprecated API.
     [exec]     [javac] Note: Recompile with -Xlint:deprecation for details.
     [exec] 
     [exec] common-solr.compile-core:
     [exec] 
     [exec] solr-contrib-build.compile-core:
     [exec] 
     [exec] compile-core:
     [exec] 
     [exec] compile:
     [exec] 
     [exec] compile-solr-test-framework:
     [exec]      [echo] Building solr-test-framework...
     [exec] 
     [exec] ivy-availability-check:
     [exec]      [echo] Building solr-test-framework...
     [exec] 
     [exec] ivy-fail:
     [exec] 
     [exec] ivy-configure:
     [exec] [ivy:configure] :: loading settings :: file = /usr/home/hudson/hudson-slave/workspace/Lucene-Solr-SmokeRelease-4.x/lucene/build/fakeReleaseTmp/unpack/solr-4.10.0/lucene/ivy-settings.xml
     [exec] 
     [exec] resolve:
     [exec] 
     [exec] compile-solr-core:
     [exec]      [echo] Building solr-core...
     [exec] 
     [exec] compile-solrj:
     [exec]      [echo] Building solr-solrj...
     [exec] 
     [exec] check-lucene-core-uptodate:
     [exec] 
     [exec] jar-lucene-core:
     [exec] 
     [exec] check-analyzers-phonetic-uptodate:
     [exec] 
     [exec] jar-analyzers-phonetic:
     [exec] 
     [exec] check-analyzers-kuromoji-uptodate:
     [exec] 
     [exec] jar-analyzers-kuromoji:
     [exec] 
     [exec] check-codecs-uptodate:
     [exec] 
     [exec] jar-codecs:
     [exec] 
     [exec] check-expressions-uptodate:
     [exec] 
     [exec] jar-expressions:
     [exec] 
     [exec] check-suggest-uptodate:
     [exec] 
     [exec] jar-suggest:
     [exec] 
     [exec] check-highlighter-uptodate:
     [exec] 
     [exec] jar-highlighter:
     [exec] 
     [exec] check-memory-uptodate:
     [exec] 
     [exec] jar-memory:
     [exec] 
     [exec] check-misc-uptodate:
     [exec] 
     [exec] jar-misc:
     [exec] 
     [exec] check-spatial-uptodate:
     [exec] 
     [exec] jar-spatial:
     [exec] 
     [exec] check-grouping-uptodate:
     [exec] 
     [exec] jar-grouping:
     [exec] 
     [exec] check-queries-uptodate:
     [exec] 
     [exec] jar-queries:
     [exec] 
     [exec] check-queryparser-uptodate:
     [exec] 
     [exec] jar-queryparser:
     [exec] 
     [exec] check-join-uptodate:
     [exec] 
     [exec] jar-join:
     [exec] 
     [exec] prep-lucene-jars:
     [exec] 
     [exec] resolve-example:
     [exec]      [echo] Building solr-example...
     [exec] 
     [exec] ivy-availability-check:
     [exec]      [echo] Building solr-example...
     [exec] 
     [exec] ivy-fail:
     [exec] 
     [exec] ivy-fail:
     [exec] 
     [exec] ivy-configure:
     [exec] [ivy:configure] :: loading settings :: file = /usr/home/hudson/hudson-slave/workspace/Lucene-Solr-SmokeRelease-4.x/lucene/build/fakeReleaseTmp/unpack/solr-4.10.0/lucene/ivy-settings.xml
     [exec] 
     [exec] sync-hack:
     [exec] 
     [exec] resolve:
     [exec]      [echo] Building solr-example-DIH...
     [exec] 
     [exec] ivy-availability-check:
     [exec]      [echo] Building solr-example-DIH...
     [exec] 
     [exec] ivy-fail:
     [exec] 
     [exec] ivy-configure:
     [exec] [ivy:configure] :: loading settings :: file = /usr/home/hudson/hudson-slave/workspace/Lucene-Solr-SmokeRelease-4.x/lucene/build/fakeReleaseTmp/unpack/solr-4.10.0/lucene/ivy-settings.xml
     [exec] 
     [exec] resolve:
     [exec] 
     [exec] ivy-availability-check:
     [exec]      [echo] Building solr-solrj...
     [exec] 
     [exec] ivy-fail:
     [exec] 
     [exec] ivy-fail:
     [exec] 
     [exec] ivy-configure:
     [exec] [ivy:configure] :: loading settings :: file = /usr/home/hudson/hudson-slave/workspace/Lucene-Solr-SmokeRelease-4.x/lucene/build/fakeReleaseTmp/unpack/solr-4.10.0/lucene/ivy-settings.xml
     [exec] 
     [exec] resolve:
     [exec] 
     [exec] common.init:
     [exec] 
     [exec] compile-lucene-core:
     [exec] 
     [exec] ivy-availability-check:
     [exec] 
     [exec] ivy-fail:
     [exec] 
     [exec] ivy-configure:
     [exec] [ivy:configure] :: loading settings :: file = /usr/home/hudson/hudson-slave/workspace/Lucene-Solr-SmokeRelease-4.x/lucene/build/fakeReleaseTmp/unpack/solr-4.10.0/lucene/ivy-settings.xml
     [exec] 
     [exec] resolve:
     [exec] 
     [exec] init:
     [exec] 
     [exec] -clover.disable:
     [exec] 
     [exec] -clover.load:
     [exec] 
     [exec] -clover.classpath:
     [exec] 
     [exec] -clover.setup:
     [exec] 
     [exec] clover:
     [exec] 
     [exec] compile-core:
     [exec] 
     [exec] init:
     [exec] 
     [exec] -clover.disable:
     [exec] 
     [exec] -clover.load:
     [exec] 
     [exec] -clover.classpath:
     [exec] 
     [exec] -clover.setup:
     [exec] 
     [exec] clover:
     [exec] 
     [exec] common.compile-core:
     [exec] 
     [exec] compile-core:
     [exec] 
     [exec] check-lucene-core-uptodate:
     [exec] 
     [exec] jar-lucene-core:
     [exec] 
     [exec] check-analyzers-phonetic-uptodate:
     [exec] 
     [exec] jar-analyzers-phonetic:
     [exec] 
     [exec] check-analyzers-kuromoji-uptodate:
     [exec] 
     [exec] jar-analyzers-kuromoji:
     [exec] 
     [exec] check-codecs-uptodate:
     [exec] 
     [exec] jar-codecs:
     [exec] 
     [exec] check-expressions-uptodate:
     [exec] 
     [exec] jar-expressions:
     [exec] 
     [exec] check-suggest-uptodate:
     [exec] 
     [exec] jar-suggest:
     [exec] 
     [exec] check-highlighter-uptodate:
     [exec] 
     [exec] jar-highlighter:
     [exec] 
     [exec] check-memory-uptodate:
     [exec] 
     [exec] jar-memory:
     [exec] 
     [exec] check-misc-uptodate:
     [exec] 
     [exec] jar-misc:
     [exec] 
     [exec] check-spatial-uptodate:
     [exec] 
     [exec] jar-spatial:
     [exec] 
     [exec] check-grouping-uptodate:
     [exec] 
     [exec] jar-grouping:
     [exec] 
     [exec] check-queries-uptodate:
     [exec] 
     [exec] jar-queries:
     [exec] 
     [exec] check-queryparser-uptodate:
     [exec] 
     [exec] jar-queryparser:
     [exec] 
     [exec] check-join-uptodate:
     [exec] 
     [exec] jar-join:
     [exec] 
     [exec] prep-lucene-jars:
     [exec] 
     [exec] resolve-example:
     [exec]      [echo] Building solr-example...
     [exec] 
     [exec] ivy-availability-check:
     [exec]      [echo] Building solr-example...
     [exec] 
     [exec] ivy-fail:
     [exec] 
     [exec] ivy-fail:
     [exec] 
     [exec] ivy-configure:
     [exec] [ivy:configure] :: loading settings :: file = /usr/home/hudson/hudson-slave/workspace/Lucene-Solr-SmokeRelease-4.x/lucene/build/fakeReleaseTmp/unpack/solr-4.10.0/lucene/ivy-settings.xml
     [exec] 
     [exec] sync-hack:
     [exec] 
     [exec] resolve:
     [exec]      [echo] Building solr-example-DIH...
     [exec] 
     [exec] ivy-availability-check:
     [exec]      [echo] Building solr-example-DIH...
     [exec] 
     [exec] ivy-fail:
     [exec] 
     [exec] ivy-configure:
     [exec] [ivy:configure] :: loading settings :: file = /usr/home/hudson/hudson-slave/workspace/Lucene-Solr-SmokeRelease-4.x/lucene/build/fakeReleaseTmp/unpack/solr-4.10.0/lucene/ivy-settings.xml
     [exec] 
     [exec] resolve:
     [exec] 
     [exec] ivy-availability-check:
     [exec]      [echo] Building solr-core...
     [exec] 
     [exec] ivy-fail:
     [exec] 
     [exec] ivy-fail:
     [exec] 
     [exec] ivy-configure:
     [exec] [ivy:configure] :: loading settings :: file = /usr/home/hudson/hudson-slave/workspace/Lucene-Solr-SmokeRelease-4.x/lucene/build/fakeReleaseTmp/unpack/solr-4.10.0/lucene/ivy-settings.xml
     [exec] 
     [exec] resolve:
     [exec] 
     [exec] common.init:
     [exec] 
     [exec] compile-lucene-core:
     [exec] 
     [exec] ivy-availability-check:
     [exec] 
     [exec] ivy-fail:
     [exec] 
     [exec] ivy-configure:
     [exec] [ivy:configure] :: loading settings :: file = /usr/home/hudson/hudson-slave/workspace/Lucene-Solr-SmokeRelease-4.x/lucene/build/fakeReleaseTmp/unpack/solr-4.10.0/lucene/ivy-settings.xml
     [exec] 
     [exec] resolve:
     [exec] 
     [exec] init:
     [exec] 
     [exec] -clover.disable:
     [exec] 
     [exec] -clover.load:
     [exec] 
     [exec] -clover.classpath:
     [exec] 
     [exec] -clover.setup:
     [exec] 
     [exec] clover:
     [exec] 
     [exec] compile-core:
     [exec] 
     [exec] init:
     [exec] 
     [exec] -clover.disable:
     [exec] 
     [exec] -clover.load:
     [exec] 
     [exec] -clover.classpath:
     [exec] 
     [exec] -clover.setup:
     [exec] 
     [exec] clover:
     [exec] 
     [exec] common.compile-core:
     [exec] 
     [exec] common-solr.compile-core:
     [exec] 
     [exec] compile-core:
     [exec] 
     [exec] compile-test-framework:
     [exec] 
     [exec] compile-test-framework:
     [exec] 
     [exec] ivy-availability-check:
     [exec] 
     [exec] ivy-fail:
     [exec] 
     [exec] ivy-configure:
     [exec] [ivy:configure] :: loading settings :: file = /usr/home/hudson/hudson-slave/workspace/Lucene-Solr-SmokeRelease-4.x/lucene/build/fakeReleaseTmp/unpack/solr-4.10.0/lucene/ivy-settings.xml
     [exec] 
     [exec] resolve:
     [exec] 
     [exec] init:
     [exec] 
     [exec] compile-lucene-core:
     [exec] 
     [exec] ivy-availability-check:
     [exec] 
     [exec] ivy-fail:
     [exec] 
     [exec] ivy-configure:
     [exec] [ivy:configure] :: loading settings :: file = /usr/home/hudson/hudson-slave/workspace/Lucene-Solr-SmokeRelease-4.x/lucene/build/fakeReleaseTmp/unpack/solr-4.10.0/lucene/ivy-settings.xml
     [exec] 
     [exec] resolve:
     [exec] 
     [exec] init:
     [exec] 
     [exec] -clover.disable:
     [exec] 
     [exec] -clover.load:
     [exec] 
     [exec] -clover.classpath:
     [exec] 
     [exec] -clover.setup:
     [exec] 
     [exec] clover:
     [exec] 
     [exec] compile-core:
     [exec] 
     [exec] compile-codecs:
     [exec]      [echo] Building codecs...
     [exec] 
     [exec] ivy-availability-check:
     [exec]      [echo] Building codecs...
     [exec] 
     [exec] ivy-fail:
     [exec] 
     [exec] ivy-configure:
     [exec] [ivy:configure] :: loading settings :: file = /usr/home/hudson/hudson-slave/workspace/Lucene-Solr-SmokeRelease-4.x/lucene/build/fakeReleaseTmp/unpack/solr-4.10.0/lucene/ivy-settings.xml
     [exec] 
     [exec] resolve:
     [exec] 
     [exec] common.init:
     [exec] 
     [exec] compile-lucene-core:
     [exec] 
     [exec] init:
     [exec] 
     [exec] -clover.disable:
     [exec] 
     [exec] -clover.load:
     [exec] 
     [exec] -clover.classpath:
     [exec] 
     [exec] -clover.setup:
     [exec] 
     [exec] clover:
     [exec] 
     [exec] compile-core:
     [exec] 
     [exec] -clover.disable:
     [exec] 
     [exec] -clover.load:
     [exec] 
     [exec] -clover.classpath:
     [exec] 
     [exec] -clover.setup:
     [exec] 
     [exec] clover:
     [exec] 
     [exec] common.compile-core:
     [exec] 
     [exec] compile-core:
     [exec] 
     [exec] compile-core:
     [exec]     [mkdir] Created dir: /usr/home/hudson/hudson-slave/workspace/Lucene-Solr-SmokeRelease-4.x/lucene/build/fakeReleaseTmp/unpack/solr-4.10.0/solr/build/solr-test-framework/classes/java
     [exec]     [javac] Compiling 33 source files to /usr/home/hudson/hudson-slave/workspace/Lucene-Solr-SmokeRelease-4.x/lucene/build/fakeReleaseTmp/unpack/solr-4.10.0/solr/build/solr-test-framework/classes/java
     [exec]     [javac] Note: Some input files use or override a deprecated API.
     [exec]     [javac] Note: Recompile with -Xlint:deprecation for details.
     [exec]     [javac] Note: Some input files use unchecked or unsafe operations.
     [exec]     [javac] Note: Recompile with -Xlint:unchecked for details.
     [exec] 
     [exec] compile-solrj:
     [exec]      [echo] Building solr-solrj...
     [exec] 
     [exec] check-lucene-core-uptodate:
     [exec] 
     [exec] jar-lucene-core:
     [exec] 
     [exec] check-analyzers-phonetic-uptodate:
     [exec] 
     [exec] jar-analyzers-phonetic:
     [exec] 
     [exec] check-analyzers-kuromoji-uptodate:
     [exec] 
     [exec] jar-analyzers-kuromoji:
     [exec] 
     [exec] check-codecs-uptodate:
     [exec] 
     [exec] jar-codecs:
     [exec] 
     [exec] check-expressions-uptodate:
     [exec] 
     [exec] jar-expressions:
     [exec] 
     [exec] check-suggest-uptodate:
     [exec] 
     [exec] jar-suggest:
     [exec] 
     [exec] check-highlighter-uptodate:
     [exec] 
     [exec] jar-highlighter:
     [exec] 
     [exec] check-memory-uptodate:
     [exec] 
     [exec] jar-memory:
     [exec] 
     [exec] check-misc-uptodate:
     [exec] 
     [exec] jar-misc:
     [exec] 
     [exec] check-spatial-uptodate:
     [exec] 
     [exec] jar-spatial:
     [exec] 
     [exec] check-grouping-uptodate:
     [exec] 
     [exec] jar-grouping:
     [exec] 
     [exec] check-queries-uptodate:
     [exec] 
     [exec] jar-queries:
     [exec] 
     [exec] check-queryparser-uptodate:
     [exec] 
     [exec] jar-queryparser:
     [exec] 
     [exec] check-join-uptodate:
     [exec] 
     [exec] jar-join:
     [exec] 
     [exec] prep-lucene-jars:
     [exec] 
     [exec] resolve-example:
     [exec]      [echo] Building solr-example...
     [exec] 
     [exec] ivy-availability-check:
     [exec]      [echo] Building solr-example...
     [exec] 
     [exec] ivy-fail:
     [exec] 
     [exec] ivy-fail:
     [exec] 
     [exec] ivy-configure:
     [exec] [ivy:configure] :: loading settings :: file = /usr/home/hudson/hudson-slave/workspace/Lucene-Solr-SmokeRelease-4.x/lucene/build/fakeReleaseTmp/unpack/solr-4.10.0/lucene/ivy-settings.xml
     [exec] 
     [exec] sync-hack:
     [exec] 
     [exec] resolve:
     [exec]      [echo] Building solr-example-DIH...
     [exec] 
     [exec] ivy-availability-check:
     [exec]      [echo] Building solr-example-DIH...
     [exec] 
     [exec] ivy-fail:
     [exec] 
     [exec] ivy-configure:
     [exec] [ivy:configure] :: loading settings :: file = /usr/home/hudson/hudson-slave/workspace/Lucene-Solr-SmokeRelease-4.x/lucene/build/fakeReleaseTmp/unpack/solr-4.10.0/lucene/ivy-settings.xml
     [exec] 
     [exec] resolve:
     [exec] 
     [exec] ivy-availability-check:
     [exec]      [echo] Building solr-solrj...
     [exec] 
     [exec] ivy-fail:
     [exec] 
     [exec] ivy-fail:
     [exec] 
     [exec] ivy-configure:
     [exec] [ivy:configure] :: loading settings :: file = /usr/home/hudson/hudson-slave/workspace/Lucene-Solr-SmokeRelease-4.x/lucene/build/fakeReleaseTmp/unpack/solr-4.10.0/lucene/ivy-settings.xml
     [exec] 
     [exec] resolve:
     [exec] 
     [exec] common.init:
     [exec] 
     [exec] compile-lucene-core:
     [exec] 
     [exec] ivy-availability-check:
     [exec] 
     [exec] ivy-fail:
     [exec] 
     [exec] ivy-configure:
     [exec] [ivy:configure] :: loading settings :: file = /usr/home/hudson/hudson-slave/workspace/Lucene-Solr-SmokeRelease-4.x/lucene/build/fakeReleaseTmp/unpack/solr-4.10.0/lucene/ivy-settings.xml
     [exec] 
     [exec] resolve:
     [exec] 
     [exec] init:
     [exec] 
     [exec] -clover.disable:
     [exec] 
     [exec] -clover.load:
     [exec] 
     [exec] -clover.classpath:
     [exec] 
     [exec] -clover.setup:
     [exec] 
     [exec] clover:
     [exec] 
     [exec] compile-core:
     [exec] 
     [exec] init:
     [exec] 
     [exec] -clover.disable:
     [exec] 
     [exec] -clover.load:
     [exec] 
     [exec] -clover.classpath:
     [exec] 
     [exec] -clover.setup:
     [exec] 
     [exec] clover:
     [exec] 
     [exec] common.compile-core:
     [exec] 
     [exec] compile-core:
     [exec] 
     [exec] check-lucene-core-uptodate:
     [exec] 
     [exec] jar-lucene-core:
     [exec] 
     [exec] check-analyzers-phonetic-uptodate:
     [exec] 
     [exec] jar-analyzers-phonetic:
     [exec] 
     [exec] check-analyzers-kuromoji-uptodate:
     [exec] 
     [exec] jar-analyzers-kuromoji:
     [exec] 
     [exec] check-codecs-uptodate:
     [exec] 
     [exec] jar-codecs:
     [exec] 
     [exec] check-expressions-uptodate:
     [exec] 
     [exec] jar-expressions:
     [exec] 
     [exec] check-suggest-uptodate:
     [exec] 
     [exec] jar-suggest:
     [exec] 
     [exec] check-highlighter-uptodate:
     [exec] 
     [exec] jar-highlighter:
     [exec] 
     [exec] check-memory-uptodate:
     [exec] 
     [exec] jar-memory:
     [exec] 
     [exec] check-misc-uptodate:
     [exec] 
     [exec] jar-misc:
     [exec] 
     [exec] check-spatial-uptodate:
     [exec] 
     [exec] jar-spatial:
     [exec] 
     [exec] check-grouping-uptodate:
     [exec] 
     [exec] jar-grouping:
     [exec] 
     [exec] check-queries-uptodate:
     [exec] 
     [exec] jar-queries:
     [exec] 
     [exec] check-queryparser-uptodate:
     [exec] 
     [exec] jar-queryparser:
     [exec] 
     [exec] check-join-uptodate:
     [exec] 
     [exec] jar-join:
     [exec] 
     [exec] prep-lucene-jars:
     [exec] 
     [exec] resolve-example:
     [exec]      [echo] Building solr-example...
     [exec] 
     [exec] ivy-availability-check:
     [exec]      [echo] Building solr-example...
     [exec] 
     [exec] ivy-fail:
     [exec] 
     [exec] ivy-fail:
     [exec] 
     [exec] ivy-configure:
     [exec] [ivy:configure] :: loading settings :: file = /usr/home/hudson/hudson-slave/workspace/Lucene-Solr-SmokeRelease-4.x/lucene/build/fakeReleaseTmp/unpack/solr-4.10.0/lucene/ivy-settings.xml
     [exec] 
     [exec] sync-hack:
     [exec] 
     [exec] resolve:
     [exec]      [echo] Building solr-example-DIH...
     [exec] 
     [exec] ivy-availability-check:
     [exec]      [echo] Building solr-example-DIH...
     [exec] 
     [exec] ivy-fail:
     [exec] 
     [exec] ivy-configure:
     [exec] [ivy:configure] :: loading settings :: file = /usr/home/hudson/hudson-slave/workspace/Lucene-Solr-SmokeRelease-4.x/lucene/build/fakeReleaseTmp/unpack/solr-4.10.0/lucene/ivy-settings.xml
     [exec] 
     [exec] resolve:
     [exec] 
     [exec] ivy-fail:
     [exec] 
     [exec] resolve:
     [exec] 
     [exec] common.init:
     [exec] 
     [exec] compile-lucene-core:
     [exec] 
     [exec] ivy-availability-check:
     [exec] 
     [exec] ivy-fail:
     [exec] 
     [exec] ivy-configure:
     [exec] [ivy:configure] :: loading settings :: file = /usr/home/hudson/hudson-slave/workspace/Lucene-Solr-SmokeRelease-4.x/lucene/build/fakeReleaseTmp/unpack/solr-4.10.0/lucene/ivy-settings.xml
     [exec] 
     [exec] resolve:
     [exec] 
     [exec] init:
     [exec] 
     [exec] -clover.disable:
     [exec] 
     [exec] -clover.load:
     [exec] 
     [exec] -clover.classpath:
     [exec] 
     [exec] -clover.setup:
     [exec] 
     [exec] clover:
     [exec] 
     [exec] compile-core:
     [exec] 
     [exec] init:
     [exec] 
     [exec] common.compile-core:
     [exec] 
     [exec] common-solr.compile-core:
     [exec] 
     [exec] compile-core:
     [exec] 
     [exec] compile-test-framework:
     [exec] 
     [exec] ivy-availability-check:
     [exec] 
     [exec] ivy-fail:
     [exec] 
     [exec] ivy-configure:
     [exec] [ivy:configure] :: loading settings :: file = /usr/home/hudson/hudson-slave/workspace/Lucene-Solr-SmokeRelease-4.x/lucene/build/fakeReleaseTmp/unpack/solr-4.10.0/lucene/ivy-settings.xml
     [exec] 
     [exec] resolve:
     [exec] 
     [exec] init:
     [exec] 
     [exec] compile-lucene-core:
     [exec] 
     [exec] compile-codecs:
     [exec]      [echo] Building codecs...
     [exec] 
     [exec] ivy-availability-check:
     [exec]      [echo] Building codecs...
     [exec] 
     [exec] ivy-fail:
     [exec] 
     [exec] ivy-configure:
     [exec] [ivy:configure] :: loading settings :: file = /usr/home/hudson/hudson-slave/workspace/Lucene-Solr-SmokeRelease-4.x/lucene/build/fakeReleaseTmp/unpack/solr-4.10.0/lucene/ivy-settings.xml
     [exec] 
     [exec] resolve:
     [exec] 
     [exec] common.init:
     [exec] 
     [exec] compile-lucene-core:
     [exec] 
     [exec] init:
     [exec] 
     [exec] -clover.disable:
     [exec] 
     [exec] -clover.load:
     [exec] 
     [exec] -clover.classpath:
     [exec] 
     [exec] -clover.setup:
     [exec] 
     [exec] clover:
     [exec] 
     [exec] compile-core:
     [exec] 
     [exec] -clover.disable:
     [exec] 
     [exec] -clover.load:
     [exec] 
     [exec] -clover.classpath:
     [exec] 
     [exec] -clover.setup:
     [exec] 
     [exec] clover:
     [exec] 
     [exec] common.compile-core:
     [exec] 
     [exec] compile-core:
     [exec] 
     [exec] common.compile-test:
     [exec]     [mkdir] Created dir: /usr/home/hudson/hudson-slave/workspace/Lucene-Solr-SmokeRelease-4.x/lucene/build/fakeReleaseTmp/unpack/solr-4.10.0/solr/build/solr-core/classes/test
     [exec]     [javac] Compiling 446 source files to /usr/home/hudson/hudson-slave/workspace/Lucene-Solr-SmokeRelease-4.x/lucene/build/fakeReleaseTmp/unpack/solr-4.10.0/solr/build/solr-core/classes/test
     [exec]     [javac] Note: Some input files use or override a deprecated API.
     [exec]     [javac] Note: Recompile with -Xlint:deprecation for details.
     [exec]     [javac] Note: Some input files use unchecked or unsafe operations.
     [exec]     [javac] Note: Recompile with -Xlint:unchecked for details.
     [exec]      [copy] Copying 1 file to /usr/home/hudson/hudson-slave/workspace/Lucene-Solr-SmokeRelease-4.x/lucene/build/fakeReleaseTmp/unpack/solr-4.10.0/solr/build/solr-core/classes/test
     [exec] 
     [exec] common-solr.compile-test:
     [exec] 
     [exec] compile-test:
     [exec] 
     [exec] install-junit4-taskdef:
     [exec] 
     [exec] compile-tools:
     [exec] 
     [exec] ivy-availability-check:
     [exec] 
     [exec] ivy-fail:
     [exec] 
     [exec] ivy-configure:
     [exec] [ivy:configure] :: loading settings :: file = /usr/home/hudson/hudson-slave/workspace/Lucene-Solr-SmokeRelease-4.x/lucene/build/fakeReleaseTmp/unpack/solr-4.10.0/lucene/ivy-settings.xml
     [exec] 
     [exec] resolve:
     [exec] 
     [exec] init:
     [exec] 
     [exec] compile-core:
     [exec] 
     [exec] validate:
     [exec] 
     [exec] resolve-groovy:
     [exec] 
     [exec] -init-totals:
     [exec] 
     [exec] -test:
     [exec]     [mkdir] Created dir: /usr/home/hudson/hudson-slave/workspace/Lucene-Solr-SmokeRelease-4.x/lucene/build/fakeReleaseTmp/unpack/solr-4.10.0/solr/build/solr-core/test
     [exec]     [mkdir] Created dir: /usr/home/hudson/hudson-slave/workspace/Lucene-Solr-SmokeRelease-4.x/lucene/build/fakeReleaseTmp/unpack/solr-4.10.0/solr/build/solr-core/test/temp
     [exec]     [mkdir] Created dir: /usr/home/hudson/hudson-slave/workspace/Lucene-Solr-SmokeRelease-4.x/lucene/build/fakeReleaseTmp/unpack/solr-4.10.0/.caches/test-stats/solr-core
     [exec]    [junit4] <JUnit4> says g'day! Master seed: 1BEF15DD8F2428C7
     [exec]    [junit4] Your default console's encoding may not display certain unicode glyphs: US-ASCII
     [exec]    [junit4] Executing 410 suites with 4 JVMs.
     [exec]    [junit4] 
     [exec]    [junit4] Started J1 PID(10949@lucene.zones.apache.org).
     [exec]    [junit4] Started J3 PID(10950@lucene.zones.apache.org).
     [exec]    [junit4] Started J0 PID(10951@lucene.zones.apache.org).
     [exec]    [junit4] Started J2 PID(10952@lucene.zones.apache.org).
     [exec]    [junit4] Suite: org.apache.solr.search.TestDocSet
     [exec]    [junit4] Completed on J3 in 9.78s, 2 tests
     [exec]    [junit4] 
     [exec]    [junit4] Suite: org.apache.solr.spelling.TestSuggestSpellingConverter
     [exec]    [junit4] Completed on J2 in 9.81s, 2 tests
     [exec]    [junit4] 
     [exec]    [junit4] Suite: org.apache.solr.search.similarities.TestSweetSpotSimilarityFactory
     [exec]    [junit4] Completed on J1 in 30.87s, 3 tests
     [exec]    [junit4] 
     [exec]    [junit4] Suite: org.apache.solr.search.similarities.TestNonDefinedSimilarityFactory
     [exec]    [junit4] Completed on J0 in 31.76s, 3 tests
     [exec]    [junit4] 
     [exec]    [junit4] Suite: org.apache.solr.spelling.suggest.TestFileDictionaryLookup
     [exec]    [junit4] Completed on J2 in 26.69s, 1 test
     [exec]    [junit4] 
     [exec]    [junit4] Suite: org.apache.solr.servlet.DirectSolrConnectionTest
     [exec]    [junit4] Completed on J0 in 9.64s, 2 tests
     [exec]    [junit4] 
     [exec]    [junit4] Suite: org.apache.solr.DistributedIntervalFacetingTest
     [exec]    [junit4] IGNOR/A 0.14s J0 | DistributedIntervalFacetingTest.testDistribSearch
     [exec]    [junit4]    > Assumption #1: 'slow' test group is disabled (@Slow())
     [exec]    [junit4] Completed on J0 in 0.26s, 1 test, 1 skipped
     [exec]    [junit4] 
     [exec]    [junit4] Suite: org.apache.solr.update.DirectUpdateHandlerOptimizeTest
     [exec]    [junit4] Completed on J1 in 16.33s, 1 test
     [exec]    [junit4] 
     [exec]    [junit4] Suite: org.apache.solr.spelling.WordBreakSolrSpellCheckerTest
     [exec]    [junit4] Completed on J3 in 37.87s, 3 tests
     [exec]    [junit4] 
     [exec]    [junit4] Suite: org.apache.solr.schema.ExternalFileFieldSortTest
     [exec]    [junit4] Completed on J1 in 3.90s, 1 test
     [exec]    [junit4] 
     [exec]    [junit4] Suite: org.apache.solr.rest.TestManagedResourceStorage
     [exec]    [junit4] IGNOR/A 0.13s J1 | TestManagedResourceStorage.testZkBasedJsonStorage
     [exec]    [junit4]    > Assumption #1: 'slow' test group is disabled (@Slow())
     [exec]    [junit4] IGNOR/A 0.01s J1 | TestManagedResourceStorage.testFileBasedJsonStorage
     [exec]    [junit4]    > Assumption #1: 'slow' test group is disabled (@Slow())
     [exec]    [junit4] Completed on J1 in 0.25s, 2 tests, 2 skipped
     [exec]    [junit4] 
     [exec]    [junit4] Suite: org.apache.solr.cloud.ZkControllerTest
     [exec]    [junit4] IGNOR/A 0.01s J1 | ZkControllerTest.testReadConfigName
     [exec]    [junit4]    > Assumption #1: 'slow' test group is disabled (@Slow())
     [exec]    [junit4] IGNOR/A 0.00s J1 | ZkControllerTest.testUploadToCloud
     [exec]    [junit4]    > Assumption #1: 'slow' test group is disabled (@Slow())
     [exec]    [junit4] IGNOR/A 0.00s J1 | ZkControllerTest.testNodeNameUrlConversion
     [exec]    [junit4]    > Assumption #1: 'slow' test group is disabled (@Slow())
     [exec]    [junit4] IGNOR/A 0.01s J1 | ZkControllerTest.testGetHostName
     [exec]    [junit4]    > Assumption #1: 'slow' test group is disabled (@Slow())
     [exec]    [junit4] Completed on J1 in 0.03s, 4 tests, 4 skipped
     [exec]    [junit4] 
     [exec]    [junit4] Suite: org.apache.solr.highlight.HighlighterMaxOffsetTest
     [exec]    [junit4] Completed on J3 in 3.89s, 6 tests
     [exec]    [junit4] 
     [exec]    [junit4] Suite: org.apache.solr.update.DocumentBuilderTest
     [exec]    [junit4] Completed on J1 in 4.81s, 16 tests
     [exec]    [junit4] 
     [exec]    [junit4] Suite: org.apache.solr.BasicFunctionalityTest
     [exec]    [junit4] Completed on J2 in 19.34s, 23 tests
     [exec]    [junit4] 
     [exec]    [junit4] Suite: org.apache.solr.schema.UUIDFieldTest
     [exec]    [junit4] Completed on J1 in 0.03s, 1 test
     [exec]    [junit4] 
     [exec]    [junit4] Suite: org.apache.solr.handler.admin.InfoHandlerTest
     [exec]    [junit4] Completed on J3 in 5.15s, 2 tests
     [exec]    [junit4] 
     [exec]    [junit4] Suite: org.apache.solr.cloud.ShardSplitTest
     [exec]    [junit4] IGNOR/A 0.15s J3 | ShardSplitTest.testDistribSearch
     [exec]    [junit4]    > Assumption #1: 'slow' test group is disabled (@Slow())
     [exec]    [junit4] Completed on J3 in 0.28s, 1 test, 1 skipped
     [exec]    [junit4] 
     [exec]    [junit4] Suite: org.apache.solr.handler.XsltUpdateRequestHandlerTest
     [exec]    [junit4] Completed on J2 in 2.64s, 2 tests
     [exec]    [junit4] 
     [exec]    [junit4] Suite: org.apache.solr.update.TestUpdate
     [exec]    [junit4] Completed on J2 in 3.01s, 1 test
     [exec]    [junit4] 
     [exec]    [junit4] Suite: org.apache.solr.spelling.suggest.SuggesterTest
     [exec]    [junit4] Completed on J3 in 5.10s, 4 tests
     [exec]    [junit4] 
     [exec]    [junit4] Suite: org.apache.solr.search.TestQueryUtils
     [exec]    [junit4] Completed on J2 in 2.42s, 1 test
     [exec]    [junit4] 
     [exec]    [junit4] Suite: org.apache.solr.search.TestSurroundQueryParser
     [exec]    [junit4] Completed on J2 in 2.87s, 1 test
     [exec]    [junit4] 
     [exec]    [junit4] Suite: org.apache.solr.core.PluginInfoTest
     [exec]    [junit4] Completed on J2 in 0.14s, 9 tests
     [exec]    [junit4] 
     [exec]    [junit4] Suite: org.apache.solr.response.TestCSVResponseWriter
     [exec]    [junit4] Completed on J3 in 6.11s, 2 tests
     [exec]    [junit4] 
     [exec]    [junit4] Suite: org.apache.solr.handler.component.DistributedSuggestComponentTest
     [exec]    [junit4] IGNOR/A 0.00s J3 | DistributedSuggestComponentTest.testDistribSearch
     [exec]    [junit4]    > Assumption #1: 'slow' test group is disabled (@Slow())
     [exec]    [junit4] Completed on J3 in 0.01s, 1 test, 1 skipped
     [exec]    [junit4] 
     [exec]    [junit4] Suite: org.apache.solr.update.processor.UniqFieldsUpdateProcessorFactoryTest
     [exec]    [junit4] Completed on J3 in 2.57s, 1 test
     [exec]    [junit4] 
     [exec]    [junit4] Suite: org.apache.solr.logging.TestLogWatcher
     [exec]    [junit4] Completed on J3 in 0.05s, 1 test
     [exec]    [junit4] 
     [exec]    [junit4] Suite: org.apache.solr.rest.schema.TestSchemaSimilarityResource
     [exec]    [junit4] Completed on J1 in 16.27s, 1 test
     [exec]    [junit4] 
     [exec]    [junit4] Suite: org.apache.solr.handler.component.TermVectorComponentTest
     [exec]    [junit4] Completed on J3 in 2.24s, 3 tests
     [exec]    [junit4] 
     [exec]    [junit4] Suite: org.apache.solr.update.processor.SignatureUpdateProcessorFactoryTest
     [exec]    [junit4] Completed on J1 in 4.31s, 6 tests
     [exec]    [junit4] 
     [exec]    [junit4] Suite: org.apache.solr.search.TestIndexSearcher
     [exec]    [junit4] Completed on J3 in 3.87s, 2 tests
     [exec]    [junit4] 
     [exec]    [junit4] Suite: org.apache.solr.search.TestInitQParser
     [exec]    [junit4] Completed on J1 in 1.86s, 1 test
     [exec]    [junit4] 
     [exec]    [junit4] Suite: org.apache.solr.handler.component.DistributedQueryElevationComponentTest
     [exec]    [junit4] Completed on J0 in 37.17s, 1 test
     [exec]    [junit4] 
     [exec]    [junit4] Suite: org.apache.solr.update.SoftAutoCommitTest
     [exec]    [junit4] IGNOR/A 0.00s J0 | SoftAutoCommitTest.testSoftAndHardCommitMaxTimeRapidAdds
     [exec]    [junit4]    > Assumption #1: 'slow' test group is disabled (@Slow())
     [exec]    [junit4] IGNOR/A 0.00s J0 | SoftAutoCommitTest.testSoftAndHardCommitMaxTimeDelete
     [exec]    [junit4]    > Assumption #1: 'slow' test group is disabled (@Slow())
     [exec]    [junit4] IGNOR/A 0.00s J0 | SoftAutoCommitTest.testSoftAndHardCommitMaxTimeMixedAdds
     [exec]    [junit4]    > Assumption #1: 'slow' test group is disabled (@Slow())
     [exec]    [junit4] Completed on J0 in 0.03s, 3 tests, 3 skipped
     [exec]    [junit4] 
     [exec]    [junit4] Suite: org.apache.solr.search.TestMaxScoreQueryParser
     [exec]    [junit4] Completed on J0 in 4.83s, 6 tests
     [exec]    [junit4] 
     [exec]    [junit4] Suite: org.apache.solr.rest.schema.TestDynamicFieldResource
     [exec]    [junit4] Completed on J2 in 17.21s, 3 tests
     [exec]    [junit4] 
     [exec]    [junit4] Suite: org.apache.solr.schema.TestBinaryField
     [exec]    [junit4] Completed on J1 in 6.37s, 1 test
     [exec]    [junit4] 
     [exec]    [junit4] Suite: org.apache.solr.schema.NumericFieldsTest
     [exec]    [junit4] Completed on J2 in 2.50s, 1 test
     [exec]    [junit4] 
     [exec]    [junit4] Suite: org.apache.solr.TestRandomDVFaceting
     [exec]    [junit4] IGNOR/A 0.17s J2 | TestRandomDVFaceting.testRandomFaceting
     [exec]    [junit4]    > Assumption #1: 'slow' test group is disabled (@Slow())
     [exec]    [junit4] Completed on J2 in 0.33s, 1 test, 1 skipped
     [exec]    [junit4] 
     [exec]    [junit4] Suite: org.apache.solr.request.SimpleFacetsTest
     [exec]    [junit4] Completed on J3 in 9.74s, 32 tests
     [exec]    [junit4] 
     [exec]    [junit4] Suite: org.apache.solr.handler.TestCSVLoader
     [exec]    [junit4] Completed on J3 in 3.28s, 6 tests
     [exec]    [junit4] 
     [exec]    [junit4] Suite: org.apache.solr.spelling.suggest.SuggesterFSTTest
     [exec]    [junit4] Completed on J1 in 6.16s, 4 tests
     [exec]    [junit4] 
     [exec]    [junit4] Suite: org.apache.solr.schema.CurrencyFieldXmlFileTest
     [exec]    [junit4] Completed on J2 in 5.13s, 11 tests, 1 skipped
     [exec]    [junit4] 
     [exec]    [junit4] Suite: org.apache.solr.core.TestJmxMonitoredMap
     [exec]    [junit4] Completed on J2 in 0.83s, 2 tests
     [exec]    [junit4] 
     [exec]    [junit4] Suite: org.apache.solr.analysis.TestReversedWildcardFilterFactory
     [exec]    [junit4] Completed on J2 in 2.34s, 4 tests
     [exec]    [junit4] 
     [exec]    [junit4] Suite: org.apache.solr.schema.CurrencyFieldOpenExchangeTest
     [exec]    [junit4] Completed on J1 in 5.14s, 10 tests, 1 skipped
     [exec]    [junit4] 
     [exec]    [junit4] Suite: org.apache.solr.schema.PolyFieldTest
     [exec]    [junit4] Completed on J2 in 3.29s, 4 tests
     [exec]    [junit4] 
     [exec]    [junit4] Suite: org.apache.solr.servlet.ResponseHeaderTest
     [exec]    [junit4] Completed on J1 in 6.44s, 5 tests
     [exec]    [junit4] 
     [exec]    [junit4] Suite: org.apache.solr.search.TestStressReorder
     [exec]    [junit4] Completed on J0 in 20.34s, 1 test
     [exec]    [junit4] 
     [exec]    [junit4] Suite: org.apache.solr.schema.TestCollationField
     [exec]    [junit4] Completed on J1 in 1.26s, 8 tests
     [exec]    [junit4] 
     [exec]    [junit4] Suite: org.apache.solr.handler.admin.CoreAdminHandlerTest
     [exec]    [junit4] Completed on J3 in 13.57s, 4 tests
     [exec]    [junit4] 
     [exec]    [junit4] Suite: org.apache.solr.rest.schema.TestDefaultSearchFieldResource
     [exec]    [junit4] Completed on J2 in 6.55s, 1 test
     [exec]    [junit4] 
     [exec]    [junit4] Suite: org.apache.solr.TestDistributedSearch
     [exec]    [junit4] IGNOR/A 0.00s J2 | TestDistributedSearch.testDistribSearch
     [exec]    [junit4]    > Assumption #1: 'slow' test group is disabled (@Slow())
     [exec]    [junit4] Completed on J2 in 0.01s, 1 test, 1 skipped
     [exec]    [junit4] 
     [exec]    [junit4] Suite: org.apache.solr.highlight.FastVectorHighlighterTest
     [exec]    [junit4] Completed on J1 in 2.34s, 2 tests
     [exec]    [junit4] 
     [exec]    [junit4] Suite: org.apache.solr.internal.csv.writer.CSVFieldTest
     [exec]    [junit4] Completed on J1 in 0.06s, 2 tests
     [exec]    [junit4] 
     [exec]    [junit4] Suite: org.apache.solr.handler.component.StatsComponentTest
     [exec]    [junit4] Completed on J2 in 6.03s, 8 tests
     [exec]    [junit4] 
     [exec]    [junit4] Suite: org.apache.solr.handler.TestReplicationHandler
     [exec]    [junit4] IGNOR/A 0.00s J2 | TestReplicationHandler.testEmptyCommits
     [exec]    [junit4]    > Assumption #1: 'slow' test group is disabled (@Slow())
     [exec]    [junit4] IGNOR/A 0.00s J2 | TestReplicationHandler.doTestReplicateAfterStartupWithNoActivity
     [exec]    [junit4]    > Assumption #1: 'slow' test group is disabled (@Slow())
     [exec]    [junit4] IGNOR/A 0.00s J2 | TestReplicationHandler.doTestDetails
     [exec]    [junit4]    > Assumption #1: 'slow' test group is disabled (@Slow())
     [exec]    [junit4] IGNOR/A 0.00s J2 | TestReplicationHandler.doTestReplicateAfterStartup
     [exec]    [junit4]    > Assumption #1: 'slow' test group is disabled (@Slow())
     [exec]    [junit4] IGNOR/A 0.00s J2 | TestReplicationHandler.doTestSnapPullWithMasterUrl
     [exec]    [junit4]    > Assumption #1: 'slow' test group is disabled (@Slow())
     [exec]    [junit4] IGNOR/A 0.00s J2 | TestReplicationHandler.doTestIndexAndConfigAliasReplication
     [exec]    [junit4]    > Assumption #1: 'slow' test group is disabled (@Slow())
     [exec]    [junit4] IGNOR/A 0.00s J2 | TestReplicationHandler.doTestReplicateAfterCoreReload
     [exec]    [junit4]    > Assumption #1: 'slow' test group is disabled (@Slow())
     [exec]    [junit4] IGNOR/A 0.00s J2 | TestReplicationHandler.doTestIndexAndConfigReplication
     [exec]    [junit4]    > Assumption #1: 'slow' test group is disabled (@Slow())
     [exec]    [junit4] IGNOR/A 0.00s J2 | TestReplicationHandler.testNoWriter
     [exec]    [junit4]    > Assumption #1: 'slow' test group is disabled (@Slow())
     [exec]    [junit4] IGNOR/A 0.00s J2 | TestReplicationHandler.doTestReplicateAfterWrite2Slave
     [exec]    [junit4]    > Assumption #1: 'slow' test group is disabled (@Slow())
     [exec]    [junit4] IGNOR/A 0.00s J2 | TestReplicationHandler.doTestRepeater
     [exec]    [junit4]    > Assumption #1: 'slow' test group is disabled (@Slow())
     [exec]    [junit4] IGNOR/A 0.00s J2 | TestReplicationHandler.doTestStressReplication
     [exec]    [junit4]    > Assumption #1: 'slow' test group is disabled (@Slow())
     [exec]    [junit4] IGNOR/A 0.00s J2 | TestReplicationHandler.doTestStopPoll
     [exec]    [junit4]    > Assumption #1: 'slow' test group is disabled (@Slow())
     [exec]    [junit4] Completed on J2 in 0.04s, 13 tests, 13 skipped
     [exec]    [junit4] 
     [exec]    [junit4] Suite: org.apache.solr.analysis.TestCharFilters
     [exec]    [junit4] Completed on J2 in 0.78s, 2 tests
     [exec]    [junit4] 
     [exec]    [junit4] Suite: org.apache.solr.rest.schema.TestSerializedLuceneMatchVersion
     [exec]    [junit4] Completed on J1 in 6.30s, 2 tests
     [exec]    [junit4] 
     [exec]    [junit4] Suite: org.apache.solr.cloud.hdfs.HdfsRecoveryZkTest
     [exec]    [junit4] IGNOR/A 0.00s J1 | HdfsRecoveryZkTest.testDistribSearch
     [exec]    [junit4]    > Assumption #1: 'slow' test group is disabled (@Slow())
     [exec]    [junit4] Completed on J1 in 0.01s, 1 test, 1 skipped
     [exec]    [junit4] 
     [exec]    [junit4] Suite: org.apache.solr.search.TestSolr4Spatial2
     [exec]    [junit4] Completed on J1 in 2.69s, 1 test
     [exec]    [junit4] 
     [exec]    [junit4] Suite: org.apache.solr.core.TestLazyCores
     [exec]    [junit4] Completed on J0 in 12.92s, 8 tests
     [exec]    [junit4] 
     [exec]    [junit4] Suite: org.apache.solr.search.TestFieldSortValues
     [exec]    [junit4] Completed on J1 in 1.63s, 1 test
     [exec]    [junit4] 
     [exec]    [junit4] Suite: org.apache.solr.search.TestSolr4Spatial
     [exec]    [junit4] IGNOR/A 0.02s J2 | TestSolr4Spatial.testSortMultiVal {p0=pointvector}
     [exec]    [junit4]    > Assumption #1: Multivalue not supported for this field
     [exec]    [junit4] IGNOR/A 0.01s J2 | TestSolr4Spatial.solr4OldShapeSyntax {p0=pointvector}
     [exec]    [junit4]    > Assumption #1: Mostly just valid for prefix-tree
     [exec]    [junit4] Completed on J2 in 11.47s, 32 tests, 2 skipped
     [exec]    [junit4] 
     [exec]    [junit4] Suite: org.apache.solr.store.hdfs.HdfsDirectoryTest
     [exec]    [junit4] Completed on J2 in 0.04s, 3 tests, 3 skipped
     [exec]    [junit4] 
     [exec]    [junit4] Suite: org.apache.solr.handler.component.TestExpandComponent
     [exec]    [junit4] Completed on J2 in 1.66s, 1 test
     [exec]    [junit4] 
     [exec]    [junit4] Suite: org.apache.solr.rest.schema.TestFieldTypeCollectionResource
     [exec]    [junit4] Completed on J0 in 10.47s, 2 tests
     [exec]    [junit4] 
     [exec]    [junit4] Suite: org.apache.solr.handler.admin.ShowFileRequestHandlerTest
     [exec]    [junit4] Completed on J1 in 12.53s, 4 tests
     [exec]    [junit4] 
     [exec]    [junit4] Suite: org.apache.solr.schema.SchemaVersionSpecificBehaviorTest
     [exec]    [junit4] Completed on J0 in 2.97s, 1 test
     [exec]    [junit4] 
     [exec]    [junit4] Suite: org.apache.solr.TestRandomFaceting
     [exec]    [junit4] IGNOR/A 0.00s J0 | TestRandomFaceting.testRandomFaceting
     [exec]    [junit4]    > Assumption #1: 'slow' test group is disabled (@Slow())
     [exec]    [junit4] Completed on J0 in 0.01s, 1 test, 1 skipped
     [exec]    [junit4] 
     [exec]    [junit4] Suite: org.apache.solr.cloud.OverseerCollectionProcessorTest
     [exec]    [junit4] Completed on J2 in 4.69s, 14 tests
     [exec]    [junit4] 
     [exec]    [junit4] Suite: org.apache.solr.store.blockcache.BlockCacheTest
     [exec]    [junit4] Completed on J1 in 1.08s, 2 tests
     [exec]    [junit4] 
     [exec]    [junit4] Suite: org.apache.solr.update.processor.RegexBoostProcessorTest
     [exec]    [junit4] Completed on J2 in 1.50s, 4 tests
     [exec]    [junit4] 
     [exec]    [junit4] Suite: org.apache.solr.update.processor.PreAnalyzedUpdateProcessorTest
     [exec]    [junit4] Completed on J2 in 4.50s, 2 tests
     [exec]    [junit4] 
     [exec]    [junit4] Suite: org.apache.solr.internal.csv.CharBufferTest
     [exec]    [junit4] Completed on J2 in 0.06s, 13 tests
     [exec]    [junit4] 
     [exec]    [junit4] Suite: org.apache.solr.cloud.hdfs.StressHdfsTest
     [exec]    [junit4] IGNOR/A 0.00s J2 | StressHdfsTest.testDistribSearch
     [exec]    [junit4]    > Assumption #1: 'slow' test group is disabled (@Slow())
     [exec]    [junit4] Completed on J2 in 0.01s, 1 test, 1 skipped
     [exec]    [junit4] 
     [exec]    [junit4] Suite: org.apache.solr.rest.schema.TestSchemaResource
     [exec]    [junit4] Completed on J0 in 6.70s, 3 tests
     [exec]    [junit4] 
     [exec]    [junit4] Suite: org.apache.solr.core.TestSolrIndexConfig
     [exec]    [junit4] Completed on J0 in 2.02s, 2 tests
     [exec]    [junit4] 
     [exec]    [junit4] Suite: org.apache.solr.cloud.CollectionsAPIAsyncDistributedZkTest
     [exec]    [junit4] IGNOR/A 0.00s J0 | CollectionsAPIAsyncDistributedZkTest.testDistribSearch
     [exec]    [junit4]    > Assumption #1: 'slow' test group is disabled (@Slow())
     [exec]    [junit4] Completed on J0 in 0.01s, 1 test, 1 skipped
     [exec]    [junit4] 
     [exec]    [junit4] Suite: org.apache.solr.search.AnalyticsQueryTest
     [exec]    [junit4] Completed on J0 in 1.93s, 1 test
     [exec]    [junit4] 
     [exec]    [junit4] Suite: org.apache.solr.AnalysisAfterCoreReloadTest
     [exec]    [junit4] Completed on J2 in 4.43s, 1 test
     [exec]    [junit4] 
     [exec]    [junit4] Suite: org.apache.solr.core.TestQuerySenderListener
     [exec]    [junit4] Completed on J2 in 1.71s, 3 tests
     [exec]    [junit4] 
     [exec]    [junit4] Suite: org.apache.solr.cloud.LeaderElectionIntegrationTest
     [exec]    [junit4] IGNOR/A 0.00s J2 | LeaderElectionIntegrationTest.testSimpleSliceLeaderElection
     [exec]    [junit4]    > Assumption #1: 'slow' test group is disabled (@Slow())
     [exec]    [junit4] IGNOR/A 0.00s J2 | LeaderElectionIntegrationTest.testLeaderElectionAfterClientTimeout
     [exec]    [junit4]    > Assumption #1: 'slow' test group is disabled (@Slow())
     [exec]    [junit4] Completed on J2 in 0.01s, 2 tests, 2 skipped
     [exec]    [junit4] 
     [exec]    [junit4] Suite: org.apache.solr.rest.schema.TestFieldResource
     [exec]    [junit4] Completed on J0 in 6.32s, 7 tests
     [exec]    [junit4] 
     [exec]    [junit4] Suite: org.apache.solr.TestSolrCoreProperties
     [exec]    [junit4] Completed on J2 in 5.93s, 1 test
     [exec]    [junit4] 
     [exec]    [junit4] Suite: org.apache.solr.spelling.suggest.TestAnalyzeInfixSuggestions
     [exec]    [junit4] Completed on J2 in 1.65s, 2 tests
     [exec]    [junit4] 
     [exec]    [junit4] Suite: org.apache.solr.core.RAMDirectoryFactoryTest
     [exec]    [junit4] Completed on J2 in 0.02s, 1 test
     [exec]    [junit4] 
     [exec]    [junit4] Suite: org.apache.solr.schema.DocValuesTest
     [exec]    [junit4] Completed on J2 in 2.24s, 6 tests
     [exec]    [junit4] 
     [exec]    [junit4] Suite: org.apache.solr.cloud.TestRequestStatusCollectionAPI
     [exec]    [junit4] IGNOR/A 0.00s J2 | TestRequestStatusCollectionAPI.testDistribSearch
     [exec]    [junit4]    > Assumption #1: 'slow' test group is disabled (@Slow())
     [exec]    [junit4] Completed on J2 in 0.01s, 1 test, 1 skipped
     [exec]    [junit4] 
     [exec]    [junit4] Suite: org.apache.solr.search.TestRecovery
     [exec]    [junit4] Completed on J1 in 30.34s, 11 tests
     [exec]    [junit4] 
     [exec]    [junit4] Suite: org.apache.solr.cloud.ClusterStateTest
     [exec]    [junit4] Completed on J1 in 1.77s, 1 test
     [exec]    [junit4] 
     [exec]    [junit4] Suite: org.apache.solr.cloud.DistribCursorPagingTest
     [exec]    [junit4] IGNOR/A 0.00s J1 | DistribCursorPagingTest.testDistribSearch
     [exec]    [junit4]    > Assumption #1: 'slow' test group is disabled (@Slow())
     [exec]    [junit4] Completed on J1 in 0.01s, 1 test, 1 skipped
     [exec]    [junit4] 
     [exec]    [junit4] Suite: org.apache.solr.handler.component.QueryElevationComponentTest
     [exec]    [junit4] Completed on J2 in 10.55s, 8 tests
     [exec]    [junit4] 
     [exec]    [junit4] Suite: org.apache.solr.handler.component.DistributedTermsComponentTest
     [exec]    [junit4] Completed on J3 in 59.44s, 1 test
     [exec]    [junit4] 
     [exec]    [junit4] Suite: org.apache.solr.cloud.TestDistribDocBasedVersion
     [exec]    [junit4] IGNOR/A 0.00s J3 | TestDistribDocBasedVersion.testDistribSearch
     [exec]    [junit4]    > Assumption #1: 'slow' test group is disabled (@Slow())
     [exec]    [junit4] Completed on J3 in 0.01s, 1 test, 1 skipped
     [exec]    [junit4] 
     [exec]    [junit4] Suite: org.apache.solr.handler.admin.CoreMergeIndexesAdminHandlerTest
     [exec]    [junit4] Completed on J1 in 1.61s, 1 test
     [exec]    [junit4] 
     [exec]    [junit4] Suite: org.apache.solr.highlight.HighlighterConfigTest
     [exec]    [junit4] Completed on J2 in 1.42s, 1 test
     [exec]    [junit4] 
     [exec]    [junit4] Suite: org.apache.solr.update.HardAutoCommitTest
     [exec]    [junit4] IGNOR/A 0.00s J2 | HardAutoCommitTest.testCommitWithin
     [exec]    [junit4]    > Assumption #1: 'slow' test group is disabled (@Slow())
     [exec]    [junit4] Completed on J2 in 0.01s, 1 test, 1 skipped
     [exec]    [junit4] 
     [exec]    [junit4] Suite: org.apache.solr.schema.TestCollationFieldDocValues
     [exec]    [junit4] Completed on J3 in 1.87s, 8 tests
     [exec]    [junit4] 
     [exec]    [junit4] Suite: org.apache.solr.core.TestReloadAndDeleteDocs
     [exec]    [junit4] Completed on J2 in 5.34s, 2 tests
     [exec]    [junit4] 
     [exec]    [junit4] Suite: org.apache.solr.internal.csv.CSVStrategyTest
     [exec]    [junit4] Completed on J2 in 0.01s, 5 tests
     [exec]    [junit4] 
     [exec]    [junit4] Suite: org.apache.solr.cloud.BasicDistributedZk2Test
     [exec]    [junit4] IGNOR/A 0.00s J2 | BasicDistributedZk2Test.testDistribSearch
     [exec]    [junit4]    > Assumption #1: 'slow' test group is disabled (@Slow())
     [exec]    [junit4] Completed on J2 in 0.00s, 1 test, 1 skipped
     [exec]    [junit4] 
     [exec]    [junit4] Suite: org.apache.solr.TestHighlightDedupGrouping
     [exec]    [junit4] Completed on J0 in 24.13s, 1 test
     [exec]    [junit4] 
     [exec]    [junit4] Suite: org.apache.solr.update.TestIndexingPerformance
     [exec]    [junit4] Completed on J2 in 1.76s, 1 test
     [exec]    [junit4] 
     [exec]    [junit4] Suite: org.apache.solr.schema.DateFieldTest
     [exec]    [junit4] Completed on J2 in 0.05s, 8 tests, 1 skipped
     [exec]    [junit4] 
     [exec]    [junit4] Suite: org.apache.solr.schema.TestCloudManagedSchema
     [exec]    [junit4] IGNOR/A 0.00s J2 | TestCloudManagedSchema.testDistribSearch
     [exec]    [junit4]    > Assumption #1: 'slow' test group is disabled (@Slow())
     [exec]    [junit4] Completed on J2 in 0.01s, 1 test, 1 skipped
     [exec]    [junit4] 
     [exec]    [junit4] Suite: org.apache.solr.highlight.TestPostingsSolrHighlighter
     [exec]    [junit4] Completed on J0 in 1.59s, 13 tests
     [exec]    [junit4] 
     [exec]    [junit4] Suite: org.apache.solr.search.TestStressLucene
     [exec]    [junit4] Completed on J2 in 2.13s, 1 test
     [exec]    [junit4] 
     [exec]    [junit4] Suite: org.apache.solr.search.similarities.TestDefaultSimilarityFactory
     [exec]    [junit4] Completed on J2 in 0.83s, 2 tests
     [exec]    [junit4] 
     [exec]    [junit4] Suite: org.apache.solr.rest.schema.TestSchemaVersionResource
     [exec]    [junit4] Completed on J3 in 9.71s, 1 test
     [exec]    [junit4] 
     [exec]    [junit4] Suite: org.apache.solr.core.TestSolrXmlPersistor
     [exec]    [junit4] Completed on J3 in 0.41s, 7 tests
     [exec]    [junit4] 
     [exec]    [junit4] Suite: org.apache.solr.schema.MultiTermTest
     [exec]    [junit4] Completed on J2 in 1.29s, 3 tests
     [exec]    [junit4] 
     [exec]    [junit4] Suite: org.apache.solr.handler.component.BadComponentTest
     [exec]    [junit4] Completed on J0 in 3.32s, 1 test
     [exec]    [junit4] 
     [exec]    [junit4] Suite: org.apache.solr.cloud.AsyncMigrateRouteKeyTest
     [exec]    [junit4] IGNOR/A 0.00s J0 | AsyncMigrateRouteKeyTest.testDistribSearch
     [exec]    [junit4]    > Assumption #1: 'slow' test group is disabled (@Slow())
     [exec]    [junit4] Completed on J0 in 0.01s, 1 test, 1 skipped
     [exec]    [junit4] 
     [exec]    [junit4] Suite: org.apache.solr.search.join.BJQParserTest
     [exec]    [junit4] Completed on J3 in 2.38s, 9 tests
     [exec]    [junit4] 
     [exec]    [junit4] Suite: org.apache.solr.search.TestCollapseQParserPlugin
     [exec]    [junit4] Completed on J2 in 1.85s, 2 tests
     [exec]    [junit4] 
     [exec]    [junit4] Suite: org.apache.solr.cloud.hdfs.HdfsCollectionsAPIDistributedZkTest
     [exec]    [junit4] IGNOR/A 0.00s J2 | HdfsCollectionsAPIDistributedZkTest.testDistribSearch
     [exec]    [junit4]    > Assumption #1: 'slow' test group is disabled (@Slow())
     [exec]    [junit4] Completed on J2 in 0.01s, 1 test, 1 skipped
     [exec]    [junit4] 
     [exec]    [junit4] Suite: org.apache.solr.schema.IndexSchemaTest
     [exec]    [junit4] Completed on J2 in 1.63s, 3 tests
     [exec]    [junit4] 
     [exec]    [junit4] Suite: org.apache.solr.schema.TestCloudSchemaless
     [exec]    [junit4] IGNOR/A 0.00s J2 | TestCloudSchemaless.testDistribSearch
     [exec]    [junit4]    > Assumption #1: 'slow' test group is disabled (@Slow())
     [exec]    [junit4] Completed on J2 in 0.01s, 1 test, 1 skipped
     [exec]    [junit4] 
     [exec]    [junit4] Suite: org.apache.solr.cloud.BasicDistributedZkTest
     [exec]    [junit4] IGNOR/A 0.00s J2 | BasicDistributedZkTest.testDistribSearch
     [exec]    [junit4]    > Assumption #1: 'slow' test group is disabled (@Slow())
     [exec]    [junit4] Completed on J2 in 0.00s, 1 test, 1 skipped
     [exec]    [junit4] 
     [exec]    [junit4] Suite: org.apache.solr.cloud.ChaosMonkeySafeLeaderTest
     [exec]    [junit4] IGNOR/A 0.00s J2 | ChaosMonkeySafeLeaderTest.testDistribSearch
     [exec]    [junit4]    > Assumption #1: 'slow' test group is disabled (@Slow())
     [exec]    [junit4] Completed on J2 in 0.00s, 1 test, 1 skipped
     [exec]    [junit4] 
     [exec]    [junit4] Suite: org.apache.solr.cloud.UnloadDistributedZkTest
     [exec]    [junit4] IGNOR/A 0.00s J2 | UnloadDistributedZkTest.testDistribSearch
     [exec]    [junit4]    > Assumption #1: 'slow' test group is disabled (@Slow())
     [exec]    [junit4] Completed on J2 in 0.00s, 1 test, 1 skipped
     [exec]    [junit4] 
     [exec]    [junit4] Suite: org.apache.solr.cloud.SyncSliceTest
     [exec]    [junit4] IGNOR/A 0.00s J2 | SyncSliceTest.testDistribSearch
     [exec]    [junit4]    > Assumption #1: 'slow' test group is disabled (@Slow())
     [exec]    [junit4] Completed on J2 in 0.01s, 1 test, 1 skipped
     [exec]    [junit4] 
     [exec]    [junit4] Suite: org.apache.solr.core.OpenCloseCoreStressTest
     [exec]    [junit4] IGNOR/A 0.00s J2 | OpenCloseCoreStressTest.test10MinutesOld
     [exec]    [junit4]    > Assumption #1: 'nightly' test group is disabled (@Nightly())
     [exec]    [junit4] IGNOR/A 0.00s J2 | OpenCloseCoreStressTest.test15SecondsNew
     [exec]    [junit4]    > Assumption #1: 'slow' test group is disabled (@Slow())
     [exec]    [junit4] IGNOR/A 0.00s J2 | OpenCloseCoreStressTest.test15SecondsOld
     [exec]    [junit4]    > Assumption #1: 'slow' test group is disabled (@Slow())
     [exec]    [junit4] IGNOR/A 0.00s J2 | OpenCloseCoreStressTest.test10MinutesNew
     [exec]    [junit4]    > Assumption #1: 'nightly' test group is disabled (@Nightly())
     [exec]    [junit4] IGNOR/A 0.00s J2 | OpenCloseCoreStressTest.test1HourOld
     [exec]    [junit4]    > Assumption #1: 'weekly' test group is disabled (@Weekly())
     [exec]    [junit4] IGNOR/A 0.00s J2 | OpenCloseCoreStressTest.test1HourNew
     [exec]    [junit4]    > Assumption #1: 'weekly' test group is disabled (@Weekly())
     [exec]    [junit4] Completed on J2 in 0.02s, 6 tests, 6 skipped
     [exec]    [junit4] 
     [exec]    [junit4] Suite: org.apache.solr.schema.DocValuesMissingTest
     [exec]    [junit4] Completed on J3 in 3.15s, 58 tests
     [exec]    [junit4] 
     [exec]    [junit4] Suite: org.apache.solr.cloud.CollectionsAPIDistributedZkTest
     [exec]    [junit4] IGNOR/A 0.00s J3 | CollectionsAPIDistributedZkTest.testDistribSearch
     [exec]    [junit4]    > Assumption #1: 'slow' test group is disabled (@Slow())
     [exec]    [junit4] Completed on J3 in 0.01s, 1 test, 1 skipped
     [exec]    [junit4] 
     [exec]    [junit4] Suite: org.apache.solr.cloud.OverseerRolesTest
     [exec]    [junit4] IGNOR/A 0.00s J3 | OverseerRolesTest.testDistribSearch
     [exec]    [junit4]    > Assumption #1: 'slow' test group is disabled (@Slow())
     [exec]    [junit4] Completed on J3 in 0.01s, 1 test, 1 skipped
     [exec]    [junit4] 
     [exec]    [junit4] Suite: org.apache.solr.cloud.ShardRoutingTest
     [exec]    [junit4] IGNOR/A 0.00s J2 | ShardRoutingTest.testDistribSearch
     [exec]    [junit4]    > Assumption #1: 'slow' test group is disabled (@Slow())
     [exec]    [junit4] Completed on J2 in 0.00s, 1 test, 1 skipped
     [exec]    [junit4] 
     [exec]    [junit4] Suite: org.apache.solr.cloud.RecoveryZkTest
     [exec]    [junit4] IGNOR/A 0.00s J2 | RecoveryZkTest.testDistribSearch
     [exec]    [junit4]    > Assumption #1: 'slow' test group is disabled (@Slow())
     [exec]    [junit4] Completed on J2 in 0.01s, 1 test, 1 skipped
     [exec]    [junit4] 
     [exec]    [junit4] Suite: org.apache.solr.cloud.FullSolrCloudDistribCmdsTest
     [exec]    [junit4] IGNOR/A 0.00s J2 | FullSolrCloudDistribCmdsTest.testDistribSearch
     [exec]    [junit4]    > Assumption #1: 'slow' test group is disabled (@Slow())
     [exec]    [junit4] Completed on J2 in 0.01s, 1 test, 1 skipped
     [exec]    [junit4] 
     [exec]    [junit4] Suite: org.apache.solr.cloud.ClusterStateUpdateTest
     [exec]    [junit4] IGNOR/A 0.00s J2 | ClusterStateUpdateTest.testCoreRegistration
     [exec]    [junit4]    > Assumption #1: 'slow' test group is disabled (@Slow())
     [exec]    [junit4] Completed on J2 in 0.01s, 1 test, 1 skipped
     [exec]    [junit4] 
     [exec]    [junit4] Suite: org.apache.solr.cloud.LeaderElectionTest
     [exec]    [junit4] IGNOR/A 0.00s J2 | LeaderElectionTest.testStressElection
     [exec]    [junit4]    > Assumption #1: 'slow' test group is disabled (@Slow())
     [exec]    [junit4] IGNOR/A 0.00s J2 | LeaderElectionTest.testBasic
     [exec]    [junit4]    > Assumption #1: 'slow' test group is disabled (@Slow())
     [exec]    [junit4] IGNOR/A 0.00s J2 | LeaderElectionTest.testParallelElection
     [exec]    [junit4]    > Assumption #1: 'slow' test group is disabled (@Slow())
     [exec]    [junit4] IGNOR/A 0.00s J2 | LeaderElectionTest.testCancelElection
     [exec]    [junit4]    > Assumption #1: 'slow' test group is disabled (@Slow())
     [exec]    [junit4] IGNOR/A 0.00s J2 | LeaderElectionTest.testElection
     [exec]    [junit4]    > Assumption #1: 'slow' test group is disabled (@Slow())
     [exec]    [junit4] Completed on J2 in 0.02s, 5 tests, 5 skipped
     [exec]    [junit4] 
     [exec]    [junit4] Suite: org.apache.solr.core.TestMergePolicyConfig
     [exec]    [junit4] Completed on J3 in 1.75s, 4 tests
     [exec]    [junit4] 
     [exec]    [junit4] Suite: org.apache.solr.search.TestRangeQuery
     [exec]    [junit4] Completed on J0 in 8.05s, 2 tests
     [exec]    [junit4] 
     [exec]    [junit4] Suite: org.apache.solr.handler.FieldAnalysisRequestHandlerTest
     [exec]    [junit4] Completed on J3 in 1.92s, 4 tests
     [exec]    [junit4] 
     [exec]    [junit4] Suite: org.apache.solr.util.SolrPluginUtilsTest
     [exec]    [junit4] Completed on J3 in 1.86s, 7 tests
     [exec]    [junit4] 
     [exec]    [junit4] Suite: org.apache.solr.spelling.suggest.SuggesterWFSTTest
     [exec]    [junit4] Completed on J0 in 4.45s, 4 tests
     [exec]    [junit4] 
     [exec]    [junit4] Suite: org.apache.solr.internal.csv.CSVParserTest
     [exec]    [junit4] Completed on J0 in 0.13s, 23 tests
     [exec]    [junit4] 
     [exec]    [junit4] Suite: org.apache.solr.handler.component.DistributedQueryComponentCustomSortTest
     [exec]    [junit4] Completed on J1 in 24.84s, 1 test
     [exec]    [junit4] 
     [exec]    [junit4] Suite: org.apache.solr.util.TestNumberUtils
     [exec]    [junit4] Completed on J1 in 0.42s, 1 test
     [exec]    [junit4] 
     [exec]    [junit4] Suite: org.apache.solr.cloud.ZkSolrClientTest
     [exec]    [junit4] Completed on J2 in 13.30s, 6 tests
     [exec]    [junit4] 
     [exec]    [junit4] Suite: org.apache.solr.cloud.SolrXmlInZkTest
     [exec]    [junit4] Completed on J0 in 6.90s, 8 tests
     [exec]    [junit4] 
     [exec]    [junit4] Suite: org.apache.solr.update.processor.ParsingFieldUpdateProcessorsTest
     [exec]    [junit4] Completed on J0 in 5.27s, 33 tests
     [exec]    [junit4] 
     [exec]    [junit4] Suite: org.apache.solr.update.processor.AtomicUpdatesTest
     [exec]    [junit4] Completed on J0 in 2.78s, 4 tests
     [exec]    [junit4] 
     [exec]    [junit4] Suite: org.apache.solr.search.TestStressVersions
     [exec]    [junit4] Completed on J1 in 14.71s, 1 test
     [exec]    [junit4] 
     [exec]    [junit4] Suite: org.apache.solr.request.TestBinaryResponseWriter
     [exec]    [junit4] Completed on J0 in 1.66s, 2 tests
     [exec]    [junit4] 
     [exec]    [junit4] Suite: org.apache.solr.core.TestJmxIntegration
     [exec]    [junit4] Completed on J0 in 1.89s, 3 tests, 1 skipped
     [exec]    [junit4] 
     [exec]    [junit4] Suite: org.apache.solr.update.DirectUpdateHandlerTest
     [exec]    [junit4] Completed on J1 in 5.27s, 6 tests
     [exec]    [junit4] 
     [exec]    [junit4] Suite: org.apache.solr.spelling.SpellingQueryConverterTest
     [exec]    [junit4] Completed on J1 in 0.04s, 5 tests
     [exec]    [junit4] 
     [exec]    [junit4] Suite: org.apache.solr.cloud.TestZkChroot
     [exec]    [junit4] Completed on J2 in 14.86s, 4 tests
     [exec]    [junit4] 
     [exec]    [junit4] Suite: org.apache.solr.ConvertedLegacyTest
     [exec]    [junit4] Completed on J0 in 4.21s, 1 test
     [exec]    [junit4] 
     [exec]    [junit4] Suite: org.apache.solr.core.TestXIncludeConfig
     [exec]    [junit4] Completed on J0 in 0.84s, 1 test
     [exec]    [junit4] 
     [exec]    [junit4] Suite: org.apache.solr.cloud.RollingRestartTest
     [exec]    [junit4] IGNOR/A 0.00s J0 | RollingRestartTest.testDistribSearch
     [exec]    [junit4]    > Assumption #1: 'slow' test group is disabled (@Slow())
     [exec]    [junit4] Completed on J0 in 0.01s, 1 test, 1 skipped
     [exec]    [junit4] 
     [exec]    [junit4] Suite: org.apache.solr.TestTrie
     [exec]    [junit4] Completed on J0 in 2.24s, 8 tests
     [exec]    [junit4] 
     [exec]    [junit4] Suite: org.apache.solr.search.AnalyticsMergeStrategyTest
     [exec]    [junit4] Completed on J3 in 28.77s, 1 test
     [exec]    [junit4] 
     [exec]    [junit4] Suite: org.apache.solr.cloud.ZkCLITest
     [exec]    [junit4] Completed on J2 in 7.99s, 12 tests
     [exec]    [junit4] 
     [exec]    [junit4] Suite: org.apache.solr.spelling.suggest.SuggesterTSTTest
     [exec]    [junit4] Completed on J3 in 2.98s, 4 tests
     [exec]    [junit4] 
     [exec]    [junit4] Suite: org.apache.solr.cloud.ShardRoutingCustomTest
     [exec]    [junit4] IGNOR/A 0.00s J2 | ShardRoutingCustomTest.testDistribSearch
     [exec]    [junit4]    > Assumption #1: 'slow' test group is disabled (@Slow())
     [exec]    [junit4] Completed on J2 in 0.00s, 1 test, 1 skipped
     [exec]    [junit4] 
     [exec]    [junit4] Suite: org.apache.solr.update.AutoCommitTest
     [exec]    [junit4] IGNOR/A 0.00s J2 | AutoCommitTest.testMaxTime
     [exec]    [junit4]    > Assumption #1: 'slow' test group is disabled (@Slow())
     [exec]    [junit4] IGNOR/A 0.00s J2 | AutoCommitTest.testCommitWithin
     [exec]    [junit4]    > Assumption #1: 'slow' test group is disabled (@Slow())
     [exec]    [junit4] IGNOR/A 0.00s J2 | AutoCommitTest.testMaxDocs
     [exec]    [junit4]    > Assumption #1: 'slow' test group is disabled (@Slow())
     [exec]    [junit4] Completed on J2 in 0.01s, 3 tests, 3 skipped
     [exec]    [junit4] 
     [exec]    [junit4] Suite: org.apache.solr.search.TestOverriddenPrefixQueryForCustomFieldType
     [exec]    [junit4] Completed on J3 in 0.80s, 2 tests
     [exec]    [junit4] 
     [exec]    [junit4] Suite: org.apache.solr.spelling.suggest.TestHighFrequencyDictionaryFactory
     [exec]    [junit4] Completed on J3 in 2.18s, 1 test
     [exec]    [junit4] 
     [exec]    [junit4] Suite: org.apache.solr.servlet.CacheHeaderTest
     [exec]    [junit4] Completed on J0 in 6.96s, 5 tests
     [exec]    [junit4] 
     [exec]    [junit4] Suite: org.apache.solr.schema.EnumFieldTest
     [exec]    [junit4] Completed on J3 in 0.83s, 6 tests
     [exec]    [junit4] 
     [exec]    [junit4] Suite: org.apache.solr.core.TestSolrDeletionPolicy2
     [exec]    [junit4] Completed on J0 in 1.74s, 1 test
     [exec]    [junit4] 
     [exec]    [junit4] Suite: org.apache.solr.schema.BadCopyFieldTest
     [exec]    [junit4] Completed on J0 in 0.80s, 5 tests
     [exec]    [junit4] 
     [exec]    [junit4] Suite: org.apache.solr.cloud.hdfs.HdfsWriteToMultipleCollectionsTest
     [exec]    [junit4] IGNOR/A 0.00s J0 | HdfsWriteToMultipleCollectionsTest.testDistribSearch
     [exec]    [junit4]    > Assumption #1: 'slow' test group is disabled (@Slow())
     [exec]    [junit4] Completed on J0 in 0.01s, 1 test, 1 skipped
     [exec]    [junit4] 
     [exec]    [junit4] Suite: org.apache.solr.SolrInfoMBeanTest
     [exec]    [junit4] Completed on J3 in 3.11s, 1 test
     [exec]    [junit4] 
     [exec]    [junit4] Suite: org.apache.solr.util.PrimUtilsTest
     [exec]    [junit4] Completed on J3 in 0.07s, 2 tests
     [exec]    [junit4] 
     [exec]    [junit4] Suite: org.apache.solr.handler.component.TermsComponentTest
     [exec]    [junit4] Completed on J0 in 1.77s, 13 tests
     [exec]    [junit4] 
     [exec]    [junit4] Suite: org.apache.solr.internal.csv.

[...truncated too long message...]

unit4] Completed on J0 in 4.03s, 7 tests
     [exec]    [junit4] 
     [exec]    [junit4] Suite: org.apache.solr.rest.TestManagedResource
     [exec]    [junit4] Completed on J1 in 0.01s, 2 tests, 2 skipped
     [exec]    [junit4] 
     [exec]    [junit4] Suite: org.apache.solr.rest.schema.TestClassNameShortening
     [exec]    [junit4] Completed on J1 in 0.01s, 3 tests, 3 skipped
     [exec]    [junit4] 
     [exec]    [junit4] Suite: org.apache.solr.rest.schema.TestCopyFieldCollectionResource
     [exec]    [junit4] Completed on J1 in 0.01s, 5 tests, 5 skipped
     [exec]    [junit4] 
     [exec]    [junit4] Suite: org.apache.solr.rest.schema.TestFieldTypeResource
     [exec]    [junit4] Completed on J1 in 0.01s, 4 tests, 4 skipped
     [exec]    [junit4] 
     [exec]    [junit4] Suite: org.apache.solr.rest.schema.TestManagedSchemaFieldResource
     [exec]    [junit4] Completed on J1 in 0.02s, 10 tests, 10 skipped
     [exec]    [junit4] 
     [exec]    [junit4] Suite: org.apache.solr.rest.schema.TestSchemaNameResource
     [exec]    [junit4] Completed on J1 in 0.01s, 1 test, 1 skipped
     [exec]    [junit4] 
     [exec]    [junit4] Suite: org.apache.solr.handler.component.DistributedExpandComponentTest
     [exec]    [junit4] Completed on J2 in 24.68s, 1 test
     [exec]    [junit4] 
     [exec]    [junit4] Suite: org.apache.solr.rest.schema.TestSolrQueryParserResource
     [exec]    [junit4] Completed on J1 in 0.01s, 1 test, 1 skipped
     [exec]    [junit4] 
     [exec]    [junit4] Suite: org.apache.solr.schema.ChangedSchemaMergeTest
     [exec]    [junit4] Completed on J1 in 0.01s, 1 test, 1 skipped
     [exec]    [junit4] 
     [exec]    [junit4] Suite: org.apache.solr.schema.TestCloudManagedSchemaConcurrent
     [exec]    [junit4] IGNOR/A 0.00s J1 | TestCloudManagedSchemaConcurrent.testDistribSearch
     [exec]    [junit4]    > Assumption #1: 'slow' test group is disabled (@Slow())
     [exec]    [junit4] Completed on J1 in 0.01s, 1 test, 1 skipped
     [exec]    [junit4] 
     [exec]    [junit4] Suite: org.apache.solr.schema.TestManagedSchema
     [exec]    [junit4] Completed on J1 in 0.01s, 14 tests, 14 skipped
     [exec]    [junit4] 
     [exec]    [junit4] Suite: org.apache.solr.search.MergeStrategyTest
     [exec]    [junit4] Completed on J1 in 0.01s, 1 test, 1 skipped
     [exec]    [junit4] 
     [exec]    [junit4] Suite: org.apache.solr.search.TestComplexPhraseQParserPlugin
     [exec]    [junit4] Completed on J1 in 0.01s, 6 tests, 6 skipped
     [exec]    [junit4] 
     [exec]    [junit4] Suite: org.apache.solr.search.TestCustomSort
     [exec]    [junit4] Completed on J1 in 0.01s, 1 test, 1 skipped
     [exec]    [junit4] 
     [exec]    [junit4] Suite: org.apache.solr.search.TestMissingGroups
     [exec]    [junit4] Completed on J1 in 0.01s, 1 test, 1 skipped
     [exec]    [junit4] 
     [exec]    [junit4] Suite: org.apache.solr.search.TestNoOpRegenerator
     [exec]    [junit4] Completed on J1 in 0.01s, 1 test, 1 skipped
     [exec]    [junit4] 
     [exec]    [junit4] Suite: org.apache.solr.handler.component.DistributedQueryComponentOptimizationTest
     [exec]    [junit4] Completed on J3 in 23.95s, 1 test
     [exec]    [junit4] 
     [exec]    [junit4] Suite: org.apache.solr.search.TestReRankQParserPlugin
     [exec]    [junit4] Completed on J1 in 0.01s, 1 test, 1 skipped
     [exec]    [junit4] 
     [exec]    [junit4] Suite: org.apache.solr.search.TestRecoveryHdfs
     [exec]    [junit4] Completed on J3 in 0.04s, 10 tests, 10 skipped
     [exec]    [junit4] 
     [exec]    [junit4] Suite: org.apache.solr.search.TestSearcherReuse
     [exec]    [junit4] Completed on J1 in 0.01s, 1 test, 1 skipped
     [exec]    [junit4] 
     [exec]    [junit4] Suite: org.apache.solr.search.TestStandardQParsers
     [exec]    [junit4] Completed on J3 in 0.01s, 1 test
     [exec]    [junit4] 
     [exec]    [junit4] Suite: org.apache.solr.search.TestStressUserVersions
     [exec]    [junit4] Completed on J1 in 0.01s, 1 test, 1 skipped
     [exec]    [junit4] 
     [exec]    [junit4] Suite: org.apache.solr.store.blockcache.BlockDirectoryTest
     [exec]    [junit4] Completed on J1 in 0.01s, 4 tests, 4 skipped
     [exec]    [junit4] 
     [exec]    [junit4] Suite: org.apache.solr.store.hdfs.HdfsLockFactoryTest
     [exec]    [junit4] Completed on J1 in 0.01s, 1 test, 1 skipped
     [exec]    [junit4] 
     [exec]    [junit4] Suite: org.apache.solr.update.AddBlockUpdateTest
     [exec]    [junit4] Completed on J1 in 0.01s, 6 tests, 6 skipped
     [exec]    [junit4] 
     [exec]    [junit4] Suite: org.apache.solr.spelling.suggest.TestFreeTextSuggestions
     [exec]    [junit4] Completed on J3 in 0.89s, 1 test
     [exec]    [junit4] 
     [exec]    [junit4] Suite: org.apache.solr.update.AnalysisErrorHandlingTest
     [exec]    [junit4] Completed on J1 in 0.01s, 1 test, 1 skipped
     [exec]    [junit4] 
     [exec]    [junit4] Suite: org.apache.solr.update.TestExceedMaxTermLength
     [exec]    [junit4] Completed on J1 in 0.01s, 2 tests, 2 skipped
     [exec]    [junit4] 
     [exec]    [junit4] Suite: org.apache.solr.update.processor.DocExpirationUpdateProcessorFactoryTest
     [exec]    [junit4] Completed on J1 in 0.01s, 5 tests, 5 skipped
     [exec]    [junit4] 
     [exec]    [junit4] Suite: org.apache.solr.update.processor.UUIDUpdateProcessorFallbackTest
     [exec]    [junit4] Completed on J1 in 0.01s, 1 test, 1 skipped
     [exec]    [junit4] 
     [exec]    [junit4] Suite: org.apache.solr.util.TestRandomMergePolicy
     [exec]    [junit4] Completed on J1 in 0.01s, 2 tests, 2 skipped
     [exec]    [junit4] 
     [exec]    [junit4] Suite: org.apache.solr.rest.TestRestManager
     [exec]    [junit4] Completed on J0 in 6.81s, 5 tests
     [exec]    [junit4] 
     [exec]    [junit4] Suite: org.apache.solr.update.TestDocBasedVersionConstraints
     [exec]    [junit4] Completed on J3 in 4.76s, 6 tests
     [exec]    [junit4] 
     [exec]    [junit4] Suite: org.apache.solr.rest.schema.analysis.TestManagedStopFilterFactory
     [exec]    [junit4] Completed on J2 in 15.75s, 2 tests
     [exec]    [junit4] 
     [exec]    [junit4] 
     [exec]    [junit4] Tests with failures:
     [exec]    [junit4]   - org.apache.solr.handler.TestReplicationHandlerBackup (suite)
     [exec]    [junit4] 
     [exec]    [junit4] 
     [exec]    [junit4] JVM J0:     2.63 ..   413.86 =   411.23s
     [exec]    [junit4] JVM J1:     2.41 ..   413.43 =   411.02s
     [exec]    [junit4] JVM J2:     2.66 ..   424.28 =   421.62s
     [exec]    [junit4] JVM J3:     2.63 ..   417.16 =   414.53s
     [exec]    [junit4] Execution time total: 7 minutes 4 seconds
     [exec]    [junit4] Tests summary: 410 suites, 1711 tests, 2 suite-level errors, 255 ignored (128 assumptions)
     [exec] 
     [exec] BUILD FAILED
     [exec] /usr/home/hudson/hudson-slave/workspace/Lucene-Solr-SmokeRelease-4.x/lucene/build/fakeReleaseTmp/unpack/solr-4.10.0/solr/build.xml:189: The following error occurred while executing this line:
     [exec] /usr/home/hudson/hudson-slave/workspace/Lucene-Solr-SmokeRelease-4.x/lucene/build/fakeReleaseTmp/unpack/solr-4.10.0/solr/common-build.xml:496: The following error occurred while executing this line:
     [exec] /usr/home/hudson/hudson-slave/workspace/Lucene-Solr-SmokeRelease-4.x/lucene/build/fakeReleaseTmp/unpack/solr-4.10.0/lucene/common-build.xml:1299: The following error occurred while executing this line:
     [exec] /usr/home/hudson/hudson-slave/workspace/Lucene-Solr-SmokeRelease-4.x/lucene/build/fakeReleaseTmp/unpack/solr-4.10.0/lucene/common-build.xml:923: There were test failures: 410 suites, 1711 tests, 2 suite-level errors, 255 ignored (128 assumptions)
     [exec] 
     [exec] Total time: 7 minutes 37 seconds
     [exec] 
     [exec] 
     [exec] Traceback (most recent call last):
     [exec]   File "/usr/home/hudson/hudson-slave/workspace/Lucene-Solr-SmokeRelease-4.x/dev-tools/scripts/smokeTestRelease.py", line 1359, in <module>
     [exec]     main()
     [exec]   File "/usr/home/hudson/hudson-slave/workspace/Lucene-Solr-SmokeRelease-4.x/dev-tools/scripts/smokeTestRelease.py", line 1303, in main
     [exec]     smokeTest(baseURL, svnRevision, version, tmpDir, isSigned, testArgs)
     [exec]   File "/usr/home/hudson/hudson-slave/workspace/Lucene-Solr-SmokeRelease-4.x/dev-tools/scripts/smokeTestRelease.py", line 1348, in smokeTest
     [exec]     unpackAndVerify('solr', tmpDir, 'solr-%s-src.tgz' % version, svnRevision, version, testArgs, baseURL)
     [exec]   File "/usr/home/hudson/hudson-slave/workspace/Lucene-Solr-SmokeRelease-4.x/dev-tools/scripts/smokeTestRelease.py", line 637, in unpackAndVerify
     [exec]     verifyUnpacked(project, artifact, unpackPath, svnRevision, version, testArgs, tmpDir, baseURL)
     [exec]   File "/usr/home/hudson/hudson-slave/workspace/Lucene-Solr-SmokeRelease-4.x/dev-tools/scripts/smokeTestRelease.py", line 744, in verifyUnpacked
     [exec]     run('%s; ant clean test -Dtests.slow=false %s' % (javaExe('1.7'), testArgs), '%s/test.log' % unpackPath)
     [exec]   File "/usr/home/hudson/hudson-slave/workspace/Lucene-Solr-SmokeRelease-4.x/dev-tools/scripts/smokeTestRelease.py", line 562, in run
     [exec]     raise RuntimeError('command "%s" failed; see log file %s' % (command, logPath))
     [exec] RuntimeError: command "export JAVA_HOME="/home/hudson/tools/java/latest1.7" PATH="/home/hudson/tools/java/latest1.7/bin:$PATH" JAVACMD="/home/hudson/tools/java/latest1.7/bin/java"; ant clean test -Dtests.slow=false -Dtests.jettyConnector=Socket  -Dtests.disableHdfs=true" failed; see log file /usr/home/hudson/hudson-slave/workspace/Lucene-Solr-SmokeRelease-4.x/lucene/build/fakeReleaseTmp/unpack/solr-4.10.0/test.log

BUILD FAILED
/usr/home/hudson/hudson-slave/workspace/Lucene-Solr-SmokeRelease-4.x/build.xml:394: exec returned: 1

Total time: 55 minutes 17 seconds
Build step 'Invoke Ant' marked build as failure
Email was triggered for: Failure
Sending email for trigger: Failure



Mime
View raw message