lucene-dev mailing list archives

Site index · List index
Message view « Date » · « Thread »
Top « Date » · « Thread »
From Apache Jenkins Server <jenk...@builds.apache.org>
Subject [JENKINS] Lucene-Solr-Tests-4.x-Java7 - Build # 2063 - Failure
Date Tue, 19 Aug 2014 19:01:33 GMT
Build: https://builds.apache.org/job/Lucene-Solr-Tests-4.x-Java7/2063/

6 tests failed.
REGRESSION:  org.apache.solr.client.solrj.SolrExampleBinaryTest.testChildDoctransformer

Error Message:
Expected mime type application/octet-stream but got text/html. <html> <head> <meta http-equiv="Content-Type" content="text/html;charset=ISO-8859-1"/> <title>Error 500 Server Error</title> </head> <body> <h2>HTTP ERROR: 500</h2> <p>Problem accessing /solr/collection1/select. Reason: <pre>    Server Error</pre></p> <hr /><i><small>Powered by Jetty://</small></i>                                                                                                                                                                                                                                                                                                                                                                                                                                                                                                                                                                                                                                                                                                                                                                                                                                                                                                                                                                                                                     </body> </html> 

Stack Trace:
org.apache.solr.client.solrj.impl.HttpSolrServer$RemoteSolrException: Expected mime type application/octet-stream but got text/html. <html>
<head>
<meta http-equiv="Content-Type" content="text/html;charset=ISO-8859-1"/>
<title>Error 500 Server Error</title>
</head>
<body>
<h2>HTTP ERROR: 500</h2>
<p>Problem accessing /solr/collection1/select. Reason:
<pre>    Server Error</pre></p>
<hr /><i><small>Powered by Jetty://</small></i>
                                                
                                                
                                                
                                                
                                                
                                                
                                                
                                                
                                                
                                                
                                                
                                                
                                                
                                                
                                                
                                                
                                                
                                                
                                                
                                                
</body>
</html>

	at __randomizedtesting.SeedInfo.seed([ED0B16967EADF1B1:9ED1090CF2B586B7]:0)
	at org.apache.solr.client.solrj.impl.HttpSolrServer.executeMethod(HttpSolrServer.java:512)
	at org.apache.solr.client.solrj.impl.HttpSolrServer.request(HttpSolrServer.java:210)
	at org.apache.solr.client.solrj.impl.HttpSolrServer.request(HttpSolrServer.java:206)
	at org.apache.solr.client.solrj.request.QueryRequest.process(QueryRequest.java:91)
	at org.apache.solr.client.solrj.SolrServer.query(SolrServer.java:301)
	at org.apache.solr.client.solrj.SolrExampleTests.testChildDoctransformer(SolrExampleTests.java:1373)
	at sun.reflect.NativeMethodAccessorImpl.invoke0(Native Method)
	at sun.reflect.NativeMethodAccessorImpl.invoke(NativeMethodAccessorImpl.java:57)
	at sun.reflect.DelegatingMethodAccessorImpl.invoke(DelegatingMethodAccessorImpl.java:43)
	at java.lang.reflect.Method.invoke(Method.java:606)
	at com.carrotsearch.randomizedtesting.RandomizedRunner.invoke(RandomizedRunner.java:1618)
	at com.carrotsearch.randomizedtesting.RandomizedRunner$6.evaluate(RandomizedRunner.java:827)
	at com.carrotsearch.randomizedtesting.RandomizedRunner$7.evaluate(RandomizedRunner.java:863)
	at com.carrotsearch.randomizedtesting.RandomizedRunner$8.evaluate(RandomizedRunner.java:877)
	at com.carrotsearch.randomizedtesting.rules.SystemPropertiesRestoreRule$1.evaluate(SystemPropertiesRestoreRule.java:53)
	at org.apache.lucene.util.TestRuleSetupTeardownChained$1.evaluate(TestRuleSetupTeardownChained.java:50)
	at org.apache.lucene.util.TestRuleFieldCacheSanity$1.evaluate(TestRuleFieldCacheSanity.java:51)
	at org.apache.lucene.util.AbstractBeforeAfterRule$1.evaluate(AbstractBeforeAfterRule.java:46)
	at com.carrotsearch.randomizedtesting.rules.SystemPropertiesInvariantRule$1.evaluate(SystemPropertiesInvariantRule.java:55)
	at org.apache.lucene.util.TestRuleThreadAndTestName$1.evaluate(TestRuleThreadAndTestName.java:49)
	at org.apache.lucene.util.TestRuleIgnoreAfterMaxFailures$1.evaluate(TestRuleIgnoreAfterMaxFailures.java:65)
	at org.apache.lucene.util.TestRuleMarkFailure$1.evaluate(TestRuleMarkFailure.java:48)
	at com.carrotsearch.randomizedtesting.rules.StatementAdapter.evaluate(StatementAdapter.java:36)
	at com.carrotsearch.randomizedtesting.ThreadLeakControl$StatementRunner.run(ThreadLeakControl.java:365)
	at com.carrotsearch.randomizedtesting.ThreadLeakControl.forkTimeoutingTask(ThreadLeakControl.java:798)
	at com.carrotsearch.randomizedtesting.ThreadLeakControl$3.evaluate(ThreadLeakControl.java:458)
	at com.carrotsearch.randomizedtesting.RandomizedRunner.runSingleTest(RandomizedRunner.java:836)
	at com.carrotsearch.randomizedtesting.RandomizedRunner$3.evaluate(RandomizedRunner.java:738)
	at com.carrotsearch.randomizedtesting.RandomizedRunner$4.evaluate(RandomizedRunner.java:772)
	at com.carrotsearch.randomizedtesting.RandomizedRunner$5.evaluate(RandomizedRunner.java:783)
	at com.carrotsearch.randomizedtesting.rules.StatementAdapter.evaluate(StatementAdapter.java:36)
	at com.carrotsearch.randomizedtesting.rules.SystemPropertiesRestoreRule$1.evaluate(SystemPropertiesRestoreRule.java:53)
	at org.apache.lucene.util.AbstractBeforeAfterRule$1.evaluate(AbstractBeforeAfterRule.java:46)
	at org.apache.lucene.util.TestRuleStoreClassName$1.evaluate(TestRuleStoreClassName.java:42)
	at com.carrotsearch.randomizedtesting.rules.SystemPropertiesInvariantRule$1.evaluate(SystemPropertiesInvariantRule.java:55)
	at com.carrotsearch.randomizedtesting.rules.NoShadowingOrOverridesOnMethodsRule$1.evaluate(NoShadowingOrOverridesOnMethodsRule.java:39)
	at com.carrotsearch.randomizedtesting.rules.NoShadowingOrOverridesOnMethodsRule$1.evaluate(NoShadowingOrOverridesOnMethodsRule.java:39)
	at com.carrotsearch.randomizedtesting.rules.StatementAdapter.evaluate(StatementAdapter.java:36)
	at com.carrotsearch.randomizedtesting.rules.StatementAdapter.evaluate(StatementAdapter.java:36)
	at com.carrotsearch.randomizedtesting.rules.StatementAdapter.evaluate(StatementAdapter.java:36)
	at org.apache.lucene.util.TestRuleAssertionsRequired$1.evaluate(TestRuleAssertionsRequired.java:43)
	at org.apache.lucene.util.TestRuleMarkFailure$1.evaluate(TestRuleMarkFailure.java:48)
	at org.apache.lucene.util.TestRuleIgnoreAfterMaxFailures$1.evaluate(TestRuleIgnoreAfterMaxFailures.java:65)
	at org.apache.lucene.util.TestRuleIgnoreTestSuites$1.evaluate(TestRuleIgnoreTestSuites.java:55)
	at com.carrotsearch.randomizedtesting.rules.StatementAdapter.evaluate(StatementAdapter.java:36)
	at com.carrotsearch.randomizedtesting.ThreadLeakControl$StatementRunner.run(ThreadLeakControl.java:365)
	at java.lang.Thread.run(Thread.java:745)


REGRESSION:  org.apache.solr.client.solrj.SolrExampleXMLTest.testChildDoctransformer

Error Message:
java.lang.AssertionError

Stack Trace:
org.apache.solr.client.solrj.impl.HttpSolrServer$RemoteSolrException: java.lang.AssertionError
	at __randomizedtesting.SeedInfo.seed([ED0B16967EADF1B1:9ED1090CF2B586B7]:0)
	at org.apache.solr.client.solrj.impl.HttpSolrServer.executeMethod(HttpSolrServer.java:550)
	at org.apache.solr.client.solrj.impl.HttpSolrServer.request(HttpSolrServer.java:210)
	at org.apache.solr.client.solrj.impl.HttpSolrServer.request(HttpSolrServer.java:206)
	at org.apache.solr.client.solrj.request.QueryRequest.process(QueryRequest.java:91)
	at org.apache.solr.client.solrj.SolrServer.query(SolrServer.java:301)
	at org.apache.solr.client.solrj.SolrExampleTests.testChildDoctransformer(SolrExampleTests.java:1373)
	at sun.reflect.NativeMethodAccessorImpl.invoke0(Native Method)
	at sun.reflect.NativeMethodAccessorImpl.invoke(NativeMethodAccessorImpl.java:57)
	at sun.reflect.DelegatingMethodAccessorImpl.invoke(DelegatingMethodAccessorImpl.java:43)
	at java.lang.reflect.Method.invoke(Method.java:606)
	at com.carrotsearch.randomizedtesting.RandomizedRunner.invoke(RandomizedRunner.java:1618)
	at com.carrotsearch.randomizedtesting.RandomizedRunner$6.evaluate(RandomizedRunner.java:827)
	at com.carrotsearch.randomizedtesting.RandomizedRunner$7.evaluate(RandomizedRunner.java:863)
	at com.carrotsearch.randomizedtesting.RandomizedRunner$8.evaluate(RandomizedRunner.java:877)
	at com.carrotsearch.randomizedtesting.rules.SystemPropertiesRestoreRule$1.evaluate(SystemPropertiesRestoreRule.java:53)
	at org.apache.lucene.util.TestRuleSetupTeardownChained$1.evaluate(TestRuleSetupTeardownChained.java:50)
	at org.apache.lucene.util.TestRuleFieldCacheSanity$1.evaluate(TestRuleFieldCacheSanity.java:51)
	at org.apache.lucene.util.AbstractBeforeAfterRule$1.evaluate(AbstractBeforeAfterRule.java:46)
	at com.carrotsearch.randomizedtesting.rules.SystemPropertiesInvariantRule$1.evaluate(SystemPropertiesInvariantRule.java:55)
	at org.apache.lucene.util.TestRuleThreadAndTestName$1.evaluate(TestRuleThreadAndTestName.java:49)
	at org.apache.lucene.util.TestRuleIgnoreAfterMaxFailures$1.evaluate(TestRuleIgnoreAfterMaxFailures.java:65)
	at org.apache.lucene.util.TestRuleMarkFailure$1.evaluate(TestRuleMarkFailure.java:48)
	at com.carrotsearch.randomizedtesting.rules.StatementAdapter.evaluate(StatementAdapter.java:36)
	at com.carrotsearch.randomizedtesting.ThreadLeakControl$StatementRunner.run(ThreadLeakControl.java:365)
	at com.carrotsearch.randomizedtesting.ThreadLeakControl.forkTimeoutingTask(ThreadLeakControl.java:798)
	at com.carrotsearch.randomizedtesting.ThreadLeakControl$3.evaluate(ThreadLeakControl.java:458)
	at com.carrotsearch.randomizedtesting.RandomizedRunner.runSingleTest(RandomizedRunner.java:836)
	at com.carrotsearch.randomizedtesting.RandomizedRunner$3.evaluate(RandomizedRunner.java:738)
	at com.carrotsearch.randomizedtesting.RandomizedRunner$4.evaluate(RandomizedRunner.java:772)
	at com.carrotsearch.randomizedtesting.RandomizedRunner$5.evaluate(RandomizedRunner.java:783)
	at com.carrotsearch.randomizedtesting.rules.StatementAdapter.evaluate(StatementAdapter.java:36)
	at com.carrotsearch.randomizedtesting.rules.SystemPropertiesRestoreRule$1.evaluate(SystemPropertiesRestoreRule.java:53)
	at org.apache.lucene.util.AbstractBeforeAfterRule$1.evaluate(AbstractBeforeAfterRule.java:46)
	at org.apache.lucene.util.TestRuleStoreClassName$1.evaluate(TestRuleStoreClassName.java:42)
	at com.carrotsearch.randomizedtesting.rules.SystemPropertiesInvariantRule$1.evaluate(SystemPropertiesInvariantRule.java:55)
	at com.carrotsearch.randomizedtesting.rules.NoShadowingOrOverridesOnMethodsRule$1.evaluate(NoShadowingOrOverridesOnMethodsRule.java:39)
	at com.carrotsearch.randomizedtesting.rules.NoShadowingOrOverridesOnMethodsRule$1.evaluate(NoShadowingOrOverridesOnMethodsRule.java:39)
	at com.carrotsearch.randomizedtesting.rules.StatementAdapter.evaluate(StatementAdapter.java:36)
	at com.carrotsearch.randomizedtesting.rules.StatementAdapter.evaluate(StatementAdapter.java:36)
	at com.carrotsearch.randomizedtesting.rules.StatementAdapter.evaluate(StatementAdapter.java:36)
	at org.apache.lucene.util.TestRuleAssertionsRequired$1.evaluate(TestRuleAssertionsRequired.java:43)
	at org.apache.lucene.util.TestRuleMarkFailure$1.evaluate(TestRuleMarkFailure.java:48)
	at org.apache.lucene.util.TestRuleIgnoreAfterMaxFailures$1.evaluate(TestRuleIgnoreAfterMaxFailures.java:65)
	at org.apache.lucene.util.TestRuleIgnoreTestSuites$1.evaluate(TestRuleIgnoreTestSuites.java:55)
	at com.carrotsearch.randomizedtesting.rules.StatementAdapter.evaluate(StatementAdapter.java:36)
	at com.carrotsearch.randomizedtesting.ThreadLeakControl$StatementRunner.run(ThreadLeakControl.java:365)
	at java.lang.Thread.run(Thread.java:745)


REGRESSION:  org.apache.solr.client.solrj.embedded.SolrExampleEmbeddedTest.testChildDoctransformer

Error Message:


Stack Trace:
java.lang.AssertionError
	at __randomizedtesting.SeedInfo.seed([ED0B16967EADF1B1:9ED1090CF2B586B7]:0)
	at org.apache.lucene.search.join.ToChildBlockJoinQuery$ToChildBlockJoinScorer.advance(ToChildBlockJoinQuery.java:286)
	at org.apache.lucene.search.FilteredQuery$LeapFrogScorer.advanceToNextCommonDoc(FilteredQuery.java:274)
	at org.apache.lucene.search.FilteredQuery$LeapFrogScorer.nextDoc(FilteredQuery.java:286)
	at org.apache.lucene.search.Weight$DefaultBulkScorer.scoreAll(Weight.java:192)
	at org.apache.lucene.search.Weight$DefaultBulkScorer.score(Weight.java:163)
	at org.apache.lucene.search.BulkScorer.score(BulkScorer.java:35)
	at org.apache.lucene.search.IndexSearcher.search(IndexSearcher.java:621)
	at org.apache.lucene.search.IndexSearcher.search(IndexSearcher.java:297)
	at org.apache.solr.search.SolrIndexSearcher.buildAndRunCollectorChain(SolrIndexSearcher.java:209)
	at org.apache.solr.search.SolrIndexSearcher.getDocListNC(SolrIndexSearcher.java:1619)
	at org.apache.solr.search.SolrIndexSearcher.getDocListC(SolrIndexSearcher.java:1433)
	at org.apache.solr.search.SolrIndexSearcher.search(SolrIndexSearcher.java:514)
	at org.apache.solr.search.SolrIndexSearcher.getDocList(SolrIndexSearcher.java:1268)
	at org.apache.solr.response.transform.ChildDocTransformer.transform(ChildDocTransformerFactory.java:144)
	at org.apache.solr.response.BinaryResponseWriter$Resolver.writeResultsBody(BinaryResponseWriter.java:159)
	at org.apache.solr.response.BinaryResponseWriter$Resolver.writeResults(BinaryResponseWriter.java:183)
	at org.apache.solr.response.BinaryResponseWriter$Resolver.resolve(BinaryResponseWriter.java:88)
	at org.apache.solr.common.util.JavaBinCodec.writeVal(JavaBinCodec.java:158)
	at org.apache.solr.common.util.JavaBinCodec.writeNamedList(JavaBinCodec.java:148)
	at org.apache.solr.common.util.JavaBinCodec.writeKnownType(JavaBinCodec.java:242)
	at org.apache.solr.common.util.JavaBinCodec.writeVal(JavaBinCodec.java:153)
	at org.apache.solr.common.util.JavaBinCodec.marshal(JavaBinCodec.java:96)
	at org.apache.solr.response.BinaryResponseWriter.getParsedResponse(BinaryResponseWriter.java:256)
	at org.apache.solr.client.solrj.embedded.EmbeddedSolrServer.getParsedResponse(EmbeddedSolrServer.java:241)
	at org.apache.solr.client.solrj.embedded.EmbeddedSolrServer.request(EmbeddedSolrServer.java:213)
	at org.apache.solr.client.solrj.request.QueryRequest.process(QueryRequest.java:91)
	at org.apache.solr.client.solrj.SolrServer.query(SolrServer.java:301)
	at org.apache.solr.client.solrj.SolrExampleTests.testChildDoctransformer(SolrExampleTests.java:1373)
	at sun.reflect.NativeMethodAccessorImpl.invoke0(Native Method)
	at sun.reflect.NativeMethodAccessorImpl.invoke(NativeMethodAccessorImpl.java:57)
	at sun.reflect.DelegatingMethodAccessorImpl.invoke(DelegatingMethodAccessorImpl.java:43)
	at java.lang.reflect.Method.invoke(Method.java:606)
	at com.carrotsearch.randomizedtesting.RandomizedRunner.invoke(RandomizedRunner.java:1618)
	at com.carrotsearch.randomizedtesting.RandomizedRunner$6.evaluate(RandomizedRunner.java:827)
	at com.carrotsearch.randomizedtesting.RandomizedRunner$7.evaluate(RandomizedRunner.java:863)
	at com.carrotsearch.randomizedtesting.RandomizedRunner$8.evaluate(RandomizedRunner.java:877)
	at com.carrotsearch.randomizedtesting.rules.SystemPropertiesRestoreRule$1.evaluate(SystemPropertiesRestoreRule.java:53)
	at org.apache.lucene.util.TestRuleSetupTeardownChained$1.evaluate(TestRuleSetupTeardownChained.java:50)
	at org.apache.lucene.util.TestRuleFieldCacheSanity$1.evaluate(TestRuleFieldCacheSanity.java:51)
	at org.apache.lucene.util.AbstractBeforeAfterRule$1.evaluate(AbstractBeforeAfterRule.java:46)
	at com.carrotsearch.randomizedtesting.rules.SystemPropertiesInvariantRule$1.evaluate(SystemPropertiesInvariantRule.java:55)
	at org.apache.lucene.util.TestRuleThreadAndTestName$1.evaluate(TestRuleThreadAndTestName.java:49)
	at org.apache.lucene.util.TestRuleIgnoreAfterMaxFailures$1.evaluate(TestRuleIgnoreAfterMaxFailures.java:65)
	at org.apache.lucene.util.TestRuleMarkFailure$1.evaluate(TestRuleMarkFailure.java:48)
	at com.carrotsearch.randomizedtesting.rules.StatementAdapter.evaluate(StatementAdapter.java:36)
	at com.carrotsearch.randomizedtesting.ThreadLeakControl$StatementRunner.run(ThreadLeakControl.java:365)
	at com.carrotsearch.randomizedtesting.ThreadLeakControl.forkTimeoutingTask(ThreadLeakControl.java:798)
	at com.carrotsearch.randomizedtesting.ThreadLeakControl$3.evaluate(ThreadLeakControl.java:458)
	at com.carrotsearch.randomizedtesting.RandomizedRunner.runSingleTest(RandomizedRunner.java:836)
	at com.carrotsearch.randomizedtesting.RandomizedRunner$3.evaluate(RandomizedRunner.java:738)
	at com.carrotsearch.randomizedtesting.RandomizedRunner$4.evaluate(RandomizedRunner.java:772)
	at com.carrotsearch.randomizedtesting.RandomizedRunner$5.evaluate(RandomizedRunner.java:783)
	at com.carrotsearch.randomizedtesting.rules.StatementAdapter.evaluate(StatementAdapter.java:36)
	at com.carrotsearch.randomizedtesting.rules.SystemPropertiesRestoreRule$1.evaluate(SystemPropertiesRestoreRule.java:53)
	at org.apache.lucene.util.AbstractBeforeAfterRule$1.evaluate(AbstractBeforeAfterRule.java:46)
	at org.apache.lucene.util.TestRuleStoreClassName$1.evaluate(TestRuleStoreClassName.java:42)
	at com.carrotsearch.randomizedtesting.rules.SystemPropertiesInvariantRule$1.evaluate(SystemPropertiesInvariantRule.java:55)
	at com.carrotsearch.randomizedtesting.rules.NoShadowingOrOverridesOnMethodsRule$1.evaluate(NoShadowingOrOverridesOnMethodsRule.java:39)
	at com.carrotsearch.randomizedtesting.rules.NoShadowingOrOverridesOnMethodsRule$1.evaluate(NoShadowingOrOverridesOnMethodsRule.java:39)
	at com.carrotsearch.randomizedtesting.rules.StatementAdapter.evaluate(StatementAdapter.java:36)
	at com.carrotsearch.randomizedtesting.rules.StatementAdapter.evaluate(StatementAdapter.java:36)
	at com.carrotsearch.randomizedtesting.rules.StatementAdapter.evaluate(StatementAdapter.java:36)
	at org.apache.lucene.util.TestRuleAssertionsRequired$1.evaluate(TestRuleAssertionsRequired.java:43)
	at org.apache.lucene.util.TestRuleMarkFailure$1.evaluate(TestRuleMarkFailure.java:48)
	at org.apache.lucene.util.TestRuleIgnoreAfterMaxFailures$1.evaluate(TestRuleIgnoreAfterMaxFailures.java:65)
	at org.apache.lucene.util.TestRuleIgnoreTestSuites$1.evaluate(TestRuleIgnoreTestSuites.java:55)
	at com.carrotsearch.randomizedtesting.rules.StatementAdapter.evaluate(StatementAdapter.java:36)
	at com.carrotsearch.randomizedtesting.ThreadLeakControl$StatementRunner.run(ThreadLeakControl.java:365)
	at java.lang.Thread.run(Thread.java:745)


REGRESSION:  org.apache.solr.client.solrj.embedded.SolrExampleJettyTest.testChildDoctransformer

Error Message:
Expected mime type application/octet-stream but got text/html. <html> <head> <meta http-equiv="Content-Type" content="text/html;charset=ISO-8859-1"/> <title>Error 500 Server Error</title> </head> <body> <h2>HTTP ERROR: 500</h2> <p>Problem accessing /solr/collection1/select. Reason: <pre>    Server Error</pre></p> <hr /><i><small>Powered by Jetty://</small></i>                                                                                                                                                                                                                                                                                                                                                                                                                                                                                                                                                                                                                                                                                                                                                                                                                                                                                                                                                                                                                     </body> </html> 

Stack Trace:
org.apache.solr.client.solrj.impl.HttpSolrServer$RemoteSolrException: Expected mime type application/octet-stream but got text/html. <html>
<head>
<meta http-equiv="Content-Type" content="text/html;charset=ISO-8859-1"/>
<title>Error 500 Server Error</title>
</head>
<body>
<h2>HTTP ERROR: 500</h2>
<p>Problem accessing /solr/collection1/select. Reason:
<pre>    Server Error</pre></p>
<hr /><i><small>Powered by Jetty://</small></i>
                                                
                                                
                                                
                                                
                                                
                                                
                                                
                                                
                                                
                                                
                                                
                                                
                                                
                                                
                                                
                                                
                                                
                                                
                                                
                                                
</body>
</html>

	at __randomizedtesting.SeedInfo.seed([ED0B16967EADF1B1:9ED1090CF2B586B7]:0)
	at org.apache.solr.client.solrj.impl.HttpSolrServer.executeMethod(HttpSolrServer.java:512)
	at org.apache.solr.client.solrj.impl.HttpSolrServer.request(HttpSolrServer.java:210)
	at org.apache.solr.client.solrj.impl.HttpSolrServer.request(HttpSolrServer.java:206)
	at org.apache.solr.client.solrj.request.QueryRequest.process(QueryRequest.java:91)
	at org.apache.solr.client.solrj.SolrServer.query(SolrServer.java:301)
	at org.apache.solr.client.solrj.SolrExampleTests.testChildDoctransformer(SolrExampleTests.java:1373)
	at sun.reflect.NativeMethodAccessorImpl.invoke0(Native Method)
	at sun.reflect.NativeMethodAccessorImpl.invoke(NativeMethodAccessorImpl.java:57)
	at sun.reflect.DelegatingMethodAccessorImpl.invoke(DelegatingMethodAccessorImpl.java:43)
	at java.lang.reflect.Method.invoke(Method.java:606)
	at com.carrotsearch.randomizedtesting.RandomizedRunner.invoke(RandomizedRunner.java:1618)
	at com.carrotsearch.randomizedtesting.RandomizedRunner$6.evaluate(RandomizedRunner.java:827)
	at com.carrotsearch.randomizedtesting.RandomizedRunner$7.evaluate(RandomizedRunner.java:863)
	at com.carrotsearch.randomizedtesting.RandomizedRunner$8.evaluate(RandomizedRunner.java:877)
	at com.carrotsearch.randomizedtesting.rules.SystemPropertiesRestoreRule$1.evaluate(SystemPropertiesRestoreRule.java:53)
	at org.apache.lucene.util.TestRuleSetupTeardownChained$1.evaluate(TestRuleSetupTeardownChained.java:50)
	at org.apache.lucene.util.TestRuleFieldCacheSanity$1.evaluate(TestRuleFieldCacheSanity.java:51)
	at org.apache.lucene.util.AbstractBeforeAfterRule$1.evaluate(AbstractBeforeAfterRule.java:46)
	at com.carrotsearch.randomizedtesting.rules.SystemPropertiesInvariantRule$1.evaluate(SystemPropertiesInvariantRule.java:55)
	at org.apache.lucene.util.TestRuleThreadAndTestName$1.evaluate(TestRuleThreadAndTestName.java:49)
	at org.apache.lucene.util.TestRuleIgnoreAfterMaxFailures$1.evaluate(TestRuleIgnoreAfterMaxFailures.java:65)
	at org.apache.lucene.util.TestRuleMarkFailure$1.evaluate(TestRuleMarkFailure.java:48)
	at com.carrotsearch.randomizedtesting.rules.StatementAdapter.evaluate(StatementAdapter.java:36)
	at com.carrotsearch.randomizedtesting.ThreadLeakControl$StatementRunner.run(ThreadLeakControl.java:365)
	at com.carrotsearch.randomizedtesting.ThreadLeakControl.forkTimeoutingTask(ThreadLeakControl.java:798)
	at com.carrotsearch.randomizedtesting.ThreadLeakControl$3.evaluate(ThreadLeakControl.java:458)
	at com.carrotsearch.randomizedtesting.RandomizedRunner.runSingleTest(RandomizedRunner.java:836)
	at com.carrotsearch.randomizedtesting.RandomizedRunner$3.evaluate(RandomizedRunner.java:738)
	at com.carrotsearch.randomizedtesting.RandomizedRunner$4.evaluate(RandomizedRunner.java:772)
	at com.carrotsearch.randomizedtesting.RandomizedRunner$5.evaluate(RandomizedRunner.java:783)
	at com.carrotsearch.randomizedtesting.rules.StatementAdapter.evaluate(StatementAdapter.java:36)
	at com.carrotsearch.randomizedtesting.rules.SystemPropertiesRestoreRule$1.evaluate(SystemPropertiesRestoreRule.java:53)
	at org.apache.lucene.util.AbstractBeforeAfterRule$1.evaluate(AbstractBeforeAfterRule.java:46)
	at org.apache.lucene.util.TestRuleStoreClassName$1.evaluate(TestRuleStoreClassName.java:42)
	at com.carrotsearch.randomizedtesting.rules.SystemPropertiesInvariantRule$1.evaluate(SystemPropertiesInvariantRule.java:55)
	at com.carrotsearch.randomizedtesting.rules.NoShadowingOrOverridesOnMethodsRule$1.evaluate(NoShadowingOrOverridesOnMethodsRule.java:39)
	at com.carrotsearch.randomizedtesting.rules.NoShadowingOrOverridesOnMethodsRule$1.evaluate(NoShadowingOrOverridesOnMethodsRule.java:39)
	at com.carrotsearch.randomizedtesting.rules.StatementAdapter.evaluate(StatementAdapter.java:36)
	at com.carrotsearch.randomizedtesting.rules.StatementAdapter.evaluate(StatementAdapter.java:36)
	at com.carrotsearch.randomizedtesting.rules.StatementAdapter.evaluate(StatementAdapter.java:36)
	at org.apache.lucene.util.TestRuleAssertionsRequired$1.evaluate(TestRuleAssertionsRequired.java:43)
	at org.apache.lucene.util.TestRuleMarkFailure$1.evaluate(TestRuleMarkFailure.java:48)
	at org.apache.lucene.util.TestRuleIgnoreAfterMaxFailures$1.evaluate(TestRuleIgnoreAfterMaxFailures.java:65)
	at org.apache.lucene.util.TestRuleIgnoreTestSuites$1.evaluate(TestRuleIgnoreTestSuites.java:55)
	at com.carrotsearch.randomizedtesting.rules.StatementAdapter.evaluate(StatementAdapter.java:36)
	at com.carrotsearch.randomizedtesting.ThreadLeakControl$StatementRunner.run(ThreadLeakControl.java:365)
	at java.lang.Thread.run(Thread.java:745)


REGRESSION:  org.apache.solr.client.solrj.embedded.SolrExampleStreamingBinaryTest.testChildDoctransformer

Error Message:
Expected mime type application/octet-stream but got text/html. <html> <head> <meta http-equiv="Content-Type" content="text/html;charset=ISO-8859-1"/> <title>Error 500 Server Error</title> </head> <body> <h2>HTTP ERROR: 500</h2> <p>Problem accessing /solr/collection1/select. Reason: <pre>    Server Error</pre></p> <hr /><i><small>Powered by Jetty://</small></i>                                                                                                                                                                                                                                                                                                                                                                                                                                                                                                                                                                                                                                                                                                                                                                                                                                                                                                                                                                                                                     </body> </html> 

Stack Trace:
org.apache.solr.client.solrj.impl.HttpSolrServer$RemoteSolrException: Expected mime type application/octet-stream but got text/html. <html>
<head>
<meta http-equiv="Content-Type" content="text/html;charset=ISO-8859-1"/>
<title>Error 500 Server Error</title>
</head>
<body>
<h2>HTTP ERROR: 500</h2>
<p>Problem accessing /solr/collection1/select. Reason:
<pre>    Server Error</pre></p>
<hr /><i><small>Powered by Jetty://</small></i>
                                                
                                                
                                                
                                                
                                                
                                                
                                                
                                                
                                                
                                                
                                                
                                                
                                                
                                                
                                                
                                                
                                                
                                                
                                                
                                                
</body>
</html>

	at __randomizedtesting.SeedInfo.seed([ED0B16967EADF1B1:9ED1090CF2B586B7]:0)
	at org.apache.solr.client.solrj.impl.HttpSolrServer.executeMethod(HttpSolrServer.java:512)
	at org.apache.solr.client.solrj.impl.HttpSolrServer.request(HttpSolrServer.java:210)
	at org.apache.solr.client.solrj.impl.HttpSolrServer.request(HttpSolrServer.java:206)
	at org.apache.solr.client.solrj.impl.ConcurrentUpdateSolrServer.request(ConcurrentUpdateSolrServer.java:281)
	at org.apache.solr.client.solrj.request.QueryRequest.process(QueryRequest.java:91)
	at org.apache.solr.client.solrj.SolrServer.query(SolrServer.java:301)
	at org.apache.solr.client.solrj.SolrExampleTests.testChildDoctransformer(SolrExampleTests.java:1373)
	at sun.reflect.NativeMethodAccessorImpl.invoke0(Native Method)
	at sun.reflect.NativeMethodAccessorImpl.invoke(NativeMethodAccessorImpl.java:57)
	at sun.reflect.DelegatingMethodAccessorImpl.invoke(DelegatingMethodAccessorImpl.java:43)
	at java.lang.reflect.Method.invoke(Method.java:606)
	at com.carrotsearch.randomizedtesting.RandomizedRunner.invoke(RandomizedRunner.java:1618)
	at com.carrotsearch.randomizedtesting.RandomizedRunner$6.evaluate(RandomizedRunner.java:827)
	at com.carrotsearch.randomizedtesting.RandomizedRunner$7.evaluate(RandomizedRunner.java:863)
	at com.carrotsearch.randomizedtesting.RandomizedRunner$8.evaluate(RandomizedRunner.java:877)
	at com.carrotsearch.randomizedtesting.rules.SystemPropertiesRestoreRule$1.evaluate(SystemPropertiesRestoreRule.java:53)
	at org.apache.lucene.util.TestRuleSetupTeardownChained$1.evaluate(TestRuleSetupTeardownChained.java:50)
	at org.apache.lucene.util.TestRuleFieldCacheSanity$1.evaluate(TestRuleFieldCacheSanity.java:51)
	at org.apache.lucene.util.AbstractBeforeAfterRule$1.evaluate(AbstractBeforeAfterRule.java:46)
	at com.carrotsearch.randomizedtesting.rules.SystemPropertiesInvariantRule$1.evaluate(SystemPropertiesInvariantRule.java:55)
	at org.apache.lucene.util.TestRuleThreadAndTestName$1.evaluate(TestRuleThreadAndTestName.java:49)
	at org.apache.lucene.util.TestRuleIgnoreAfterMaxFailures$1.evaluate(TestRuleIgnoreAfterMaxFailures.java:65)
	at org.apache.lucene.util.TestRuleMarkFailure$1.evaluate(TestRuleMarkFailure.java:48)
	at com.carrotsearch.randomizedtesting.rules.StatementAdapter.evaluate(StatementAdapter.java:36)
	at com.carrotsearch.randomizedtesting.ThreadLeakControl$StatementRunner.run(ThreadLeakControl.java:365)
	at com.carrotsearch.randomizedtesting.ThreadLeakControl.forkTimeoutingTask(ThreadLeakControl.java:798)
	at com.carrotsearch.randomizedtesting.ThreadLeakControl$3.evaluate(ThreadLeakControl.java:458)
	at com.carrotsearch.randomizedtesting.RandomizedRunner.runSingleTest(RandomizedRunner.java:836)
	at com.carrotsearch.randomizedtesting.RandomizedRunner$3.evaluate(RandomizedRunner.java:738)
	at com.carrotsearch.randomizedtesting.RandomizedRunner$4.evaluate(RandomizedRunner.java:772)
	at com.carrotsearch.randomizedtesting.RandomizedRunner$5.evaluate(RandomizedRunner.java:783)
	at com.carrotsearch.randomizedtesting.rules.StatementAdapter.evaluate(StatementAdapter.java:36)
	at com.carrotsearch.randomizedtesting.rules.SystemPropertiesRestoreRule$1.evaluate(SystemPropertiesRestoreRule.java:53)
	at org.apache.lucene.util.AbstractBeforeAfterRule$1.evaluate(AbstractBeforeAfterRule.java:46)
	at org.apache.lucene.util.TestRuleStoreClassName$1.evaluate(TestRuleStoreClassName.java:42)
	at com.carrotsearch.randomizedtesting.rules.SystemPropertiesInvariantRule$1.evaluate(SystemPropertiesInvariantRule.java:55)
	at com.carrotsearch.randomizedtesting.rules.NoShadowingOrOverridesOnMethodsRule$1.evaluate(NoShadowingOrOverridesOnMethodsRule.java:39)
	at com.carrotsearch.randomizedtesting.rules.NoShadowingOrOverridesOnMethodsRule$1.evaluate(NoShadowingOrOverridesOnMethodsRule.java:39)
	at com.carrotsearch.randomizedtesting.rules.StatementAdapter.evaluate(StatementAdapter.java:36)
	at com.carrotsearch.randomizedtesting.rules.StatementAdapter.evaluate(StatementAdapter.java:36)
	at com.carrotsearch.randomizedtesting.rules.StatementAdapter.evaluate(StatementAdapter.java:36)
	at org.apache.lucene.util.TestRuleAssertionsRequired$1.evaluate(TestRuleAssertionsRequired.java:43)
	at org.apache.lucene.util.TestRuleMarkFailure$1.evaluate(TestRuleMarkFailure.java:48)
	at org.apache.lucene.util.TestRuleIgnoreAfterMaxFailures$1.evaluate(TestRuleIgnoreAfterMaxFailures.java:65)
	at org.apache.lucene.util.TestRuleIgnoreTestSuites$1.evaluate(TestRuleIgnoreTestSuites.java:55)
	at com.carrotsearch.randomizedtesting.rules.StatementAdapter.evaluate(StatementAdapter.java:36)
	at com.carrotsearch.randomizedtesting.ThreadLeakControl$StatementRunner.run(ThreadLeakControl.java:365)
	at java.lang.Thread.run(Thread.java:745)


REGRESSION:  org.apache.solr.client.solrj.embedded.SolrExampleStreamingTest.testChildDoctransformer

Error Message:
java.lang.AssertionError

Stack Trace:
org.apache.solr.client.solrj.impl.HttpSolrServer$RemoteSolrException: java.lang.AssertionError
	at __randomizedtesting.SeedInfo.seed([ED0B16967EADF1B1:9ED1090CF2B586B7]:0)
	at org.apache.solr.client.solrj.impl.HttpSolrServer.executeMethod(HttpSolrServer.java:550)
	at org.apache.solr.client.solrj.impl.HttpSolrServer.request(HttpSolrServer.java:210)
	at org.apache.solr.client.solrj.impl.HttpSolrServer.request(HttpSolrServer.java:206)
	at org.apache.solr.client.solrj.impl.ConcurrentUpdateSolrServer.request(ConcurrentUpdateSolrServer.java:281)
	at org.apache.solr.client.solrj.request.QueryRequest.process(QueryRequest.java:91)
	at org.apache.solr.client.solrj.SolrServer.query(SolrServer.java:301)
	at org.apache.solr.client.solrj.SolrExampleTests.testChildDoctransformer(SolrExampleTests.java:1373)
	at sun.reflect.NativeMethodAccessorImpl.invoke0(Native Method)
	at sun.reflect.NativeMethodAccessorImpl.invoke(NativeMethodAccessorImpl.java:57)
	at sun.reflect.DelegatingMethodAccessorImpl.invoke(DelegatingMethodAccessorImpl.java:43)
	at java.lang.reflect.Method.invoke(Method.java:606)
	at com.carrotsearch.randomizedtesting.RandomizedRunner.invoke(RandomizedRunner.java:1618)
	at com.carrotsearch.randomizedtesting.RandomizedRunner$6.evaluate(RandomizedRunner.java:827)
	at com.carrotsearch.randomizedtesting.RandomizedRunner$7.evaluate(RandomizedRunner.java:863)
	at com.carrotsearch.randomizedtesting.RandomizedRunner$8.evaluate(RandomizedRunner.java:877)
	at com.carrotsearch.randomizedtesting.rules.SystemPropertiesRestoreRule$1.evaluate(SystemPropertiesRestoreRule.java:53)
	at org.apache.lucene.util.TestRuleSetupTeardownChained$1.evaluate(TestRuleSetupTeardownChained.java:50)
	at org.apache.lucene.util.TestRuleFieldCacheSanity$1.evaluate(TestRuleFieldCacheSanity.java:51)
	at org.apache.lucene.util.AbstractBeforeAfterRule$1.evaluate(AbstractBeforeAfterRule.java:46)
	at com.carrotsearch.randomizedtesting.rules.SystemPropertiesInvariantRule$1.evaluate(SystemPropertiesInvariantRule.java:55)
	at org.apache.lucene.util.TestRuleThreadAndTestName$1.evaluate(TestRuleThreadAndTestName.java:49)
	at org.apache.lucene.util.TestRuleIgnoreAfterMaxFailures$1.evaluate(TestRuleIgnoreAfterMaxFailures.java:65)
	at org.apache.lucene.util.TestRuleMarkFailure$1.evaluate(TestRuleMarkFailure.java:48)
	at com.carrotsearch.randomizedtesting.rules.StatementAdapter.evaluate(StatementAdapter.java:36)
	at com.carrotsearch.randomizedtesting.ThreadLeakControl$StatementRunner.run(ThreadLeakControl.java:365)
	at com.carrotsearch.randomizedtesting.ThreadLeakControl.forkTimeoutingTask(ThreadLeakControl.java:798)
	at com.carrotsearch.randomizedtesting.ThreadLeakControl$3.evaluate(ThreadLeakControl.java:458)
	at com.carrotsearch.randomizedtesting.RandomizedRunner.runSingleTest(RandomizedRunner.java:836)
	at com.carrotsearch.randomizedtesting.RandomizedRunner$3.evaluate(RandomizedRunner.java:738)
	at com.carrotsearch.randomizedtesting.RandomizedRunner$4.evaluate(RandomizedRunner.java:772)
	at com.carrotsearch.randomizedtesting.RandomizedRunner$5.evaluate(RandomizedRunner.java:783)
	at com.carrotsearch.randomizedtesting.rules.StatementAdapter.evaluate(StatementAdapter.java:36)
	at com.carrotsearch.randomizedtesting.rules.SystemPropertiesRestoreRule$1.evaluate(SystemPropertiesRestoreRule.java:53)
	at org.apache.lucene.util.AbstractBeforeAfterRule$1.evaluate(AbstractBeforeAfterRule.java:46)
	at org.apache.lucene.util.TestRuleStoreClassName$1.evaluate(TestRuleStoreClassName.java:42)
	at com.carrotsearch.randomizedtesting.rules.SystemPropertiesInvariantRule$1.evaluate(SystemPropertiesInvariantRule.java:55)
	at com.carrotsearch.randomizedtesting.rules.NoShadowingOrOverridesOnMethodsRule$1.evaluate(NoShadowingOrOverridesOnMethodsRule.java:39)
	at com.carrotsearch.randomizedtesting.rules.NoShadowingOrOverridesOnMethodsRule$1.evaluate(NoShadowingOrOverridesOnMethodsRule.java:39)
	at com.carrotsearch.randomizedtesting.rules.StatementAdapter.evaluate(StatementAdapter.java:36)
	at com.carrotsearch.randomizedtesting.rules.StatementAdapter.evaluate(StatementAdapter.java:36)
	at com.carrotsearch.randomizedtesting.rules.StatementAdapter.evaluate(StatementAdapter.java:36)
	at org.apache.lucene.util.TestRuleAssertionsRequired$1.evaluate(TestRuleAssertionsRequired.java:43)
	at org.apache.lucene.util.TestRuleMarkFailure$1.evaluate(TestRuleMarkFailure.java:48)
	at org.apache.lucene.util.TestRuleIgnoreAfterMaxFailures$1.evaluate(TestRuleIgnoreAfterMaxFailures.java:65)
	at org.apache.lucene.util.TestRuleIgnoreTestSuites$1.evaluate(TestRuleIgnoreTestSuites.java:55)
	at com.carrotsearch.randomizedtesting.rules.StatementAdapter.evaluate(StatementAdapter.java:36)
	at com.carrotsearch.randomizedtesting.ThreadLeakControl$StatementRunner.run(ThreadLeakControl.java:365)
	at java.lang.Thread.run(Thread.java:745)




Build Log:
[...truncated 12674 lines...]
   [junit4] Suite: org.apache.solr.client.solrj.embedded.SolrExampleStreamingBinaryTest
   [junit4]   2> Creating dataDir: /usr/home/jenkins/jenkins-slave/workspace/Lucene-Solr-Tests-4.x-Java7/solr/build/solr-solrj/test/J1/./solr.client.solrj.embedded.SolrExampleStreamingBinaryTest-ED0B16967EADF1B1-001/init-core-data-001
   [junit4]   2> 38907 T96 oas.SolrTestCaseJ4.initCore ####initCore
   [junit4]   2> 38908 T96 oas.SolrTestCaseJ4.initCore ####initCore end
   [junit4]   2> 38909 T96 oejs.Server.doStart jetty-8.1.10.v20130312
   [junit4]   2> 38914 T96 oejs.AbstractConnector.doStart Started SocketConnector@127.0.0.1:53858
   [junit4]   2> 38915 T96 oass.SolrDispatchFilter.init SolrDispatchFilter.init()
   [junit4]   2> 38916 T96 oasc.SolrResourceLoader.locateSolrHome JNDI not configured for solr (NoInitialContextEx)
   [junit4]   2> 38916 T96 oasc.SolrResourceLoader.locateSolrHome using system property solr.solr.home: /usr/home/jenkins/jenkins-slave/workspace/Lucene-Solr-Tests-4.x-Java7/solr/example/solr
   [junit4]   2> 38917 T96 oasc.SolrResourceLoader.<init> new SolrResourceLoader for directory: '/usr/home/jenkins/jenkins-slave/workspace/Lucene-Solr-Tests-4.x-Java7/solr/example/solr/'
   [junit4]   2> 38960 T96 oasc.ConfigSolr.fromFile Loading container configuration from /usr/home/jenkins/jenkins-slave/workspace/Lucene-Solr-Tests-4.x-Java7/solr/example/solr/solr.xml
   [junit4]   2> 39030 T96 oasc.CorePropertiesLocator.<init> Config-defined core root directory: /usr/home/jenkins/jenkins-slave/workspace/Lucene-Solr-Tests-4.x-Java7/solr/example/solr
   [junit4]   2> 39031 T96 oasc.CoreContainer.<init> New CoreContainer 1186718344
   [junit4]   2> 39032 T96 oasc.CoreContainer.load Loading cores into CoreContainer [instanceDir=/usr/home/jenkins/jenkins-slave/workspace/Lucene-Solr-Tests-4.x-Java7/solr/example/solr/]
   [junit4]   2> 39033 T96 oashc.HttpShardHandlerFactory.getParameter Setting socketTimeout to: 0
   [junit4]   2> 39034 T96 oashc.HttpShardHandlerFactory.getParameter Setting urlScheme to: null
   [junit4]   2> 39034 T96 oashc.HttpShardHandlerFactory.getParameter Setting connTimeout to: 0
   [junit4]   2> 39035 T96 oashc.HttpShardHandlerFactory.getParameter Setting maxConnectionsPerHost to: 20
   [junit4]   2> 39035 T96 oashc.HttpShardHandlerFactory.getParameter Setting corePoolSize to: 0
   [junit4]   2> 39035 T96 oashc.HttpShardHandlerFactory.getParameter Setting maximumPoolSize to: 2147483647
   [junit4]   2> 39036 T96 oashc.HttpShardHandlerFactory.getParameter Setting maxThreadIdleTime to: 5
   [junit4]   2> 39036 T96 oashc.HttpShardHandlerFactory.getParameter Setting sizeOfQueue to: -1
   [junit4]   2> 39037 T96 oashc.HttpShardHandlerFactory.getParameter Setting fairnessPolicy to: false
   [junit4]   2> 39038 T96 oasu.UpdateShardHandler.<init> Creating UpdateShardHandler HTTP client with params: socketTimeout=0&connTimeout=0&retry=false
   [junit4]   2> 39038 T96 oasl.LogWatcher.createWatcher SLF4J impl is org.slf4j.impl.Log4jLoggerFactory
   [junit4]   2> 39039 T96 oasl.LogWatcher.newRegisteredLogWatcher Registering Log Listener [Log4j (org.slf4j.impl.Log4jLoggerFactory)]
   [junit4]   2> 39039 T96 oasc.CoreContainer.load Host Name: 
   [junit4]   2> 39043 T96 oasc.CorePropertiesLocator.discover Looking for core definitions underneath /usr/home/jenkins/jenkins-slave/workspace/Lucene-Solr-Tests-4.x-Java7/solr/example/solr
   [junit4]   2> 39045 T96 oasc.CorePropertiesLocator.discoverUnder Found core collection1 in /usr/home/jenkins/jenkins-slave/workspace/Lucene-Solr-Tests-4.x-Java7/solr/example/solr/collection1/
   [junit4]   2> 39066 T96 oasc.CorePropertiesLocator.discover Found 1 core definitions
   [junit4]   2> 39066 T106 oasc.SolrResourceLoader.<init> new SolrResourceLoader for directory: '/usr/home/jenkins/jenkins-slave/workspace/Lucene-Solr-Tests-4.x-Java7/solr/example/solr/collection1/'
   [junit4]   2> 39141 T106 oasc.SolrConfig.initLibs Adding specified lib dirs to ClassLoader
   [junit4]   2> 39143 T106 oasc.SolrResourceLoader.replaceClassLoader Adding 'file:/usr/home/jenkins/jenkins-slave/workspace/Lucene-Solr-Tests-4.x-Java7/solr/contrib/extraction/lib/apache-mime4j-dom-0.7.2.jar' to classloader
   [junit4]   2> 39144 T106 oasc.SolrResourceLoader.replaceClassLoader Adding 'file:/usr/home/jenkins/jenkins-slave/workspace/Lucene-Solr-Tests-4.x-Java7/solr/contrib/extraction/lib/metadata-extractor-2.6.2.jar' to classloader
   [junit4]   2> 39144 T106 oasc.SolrResourceLoader.replaceClassLoader Adding 'file:/usr/home/jenkins/jenkins-slave/workspace/Lucene-Solr-Tests-4.x-Java7/solr/contrib/extraction/lib/poi-3.10.1.jar' to classloader
   [junit4]   2> 39145 T106 oasc.SolrResourceLoader.replaceClassLoader Adding 'file:/usr/home/jenkins/jenkins-slave/workspace/Lucene-Solr-Tests-4.x-Java7/solr/contrib/extraction/lib/tika-parsers-1.5.jar' to classloader
   [junit4]   2> 39146 T106 oasc.SolrResourceLoader.replaceClassLoader Adding 'file:/usr/home/jenkins/jenkins-slave/workspace/Lucene-Solr-Tests-4.x-Java7/solr/contrib/extraction/lib/xmpcore-5.1.2.jar' to classloader
   [junit4]   2> 39146 T106 oasc.SolrResourceLoader.replaceClassLoader Adding 'file:/usr/home/jenkins/jenkins-slave/workspace/Lucene-Solr-Tests-4.x-Java7/solr/contrib/extraction/lib/tagsoup-1.2.1.jar' to classloader
   [junit4]   2> 39147 T106 oasc.SolrResourceLoader.replaceClassLoader Adding 'file:/usr/home/jenkins/jenkins-slave/workspace/Lucene-Solr-Tests-4.x-Java7/solr/contrib/extraction/lib/bcprov-jdk15-1.45.jar' to classloader
   [junit4]   2> 39148 T106 oasc.SolrResourceLoader.replaceClassLoader Adding 'file:/usr/home/jenkins/jenkins-slave/workspace/Lucene-Solr-Tests-4.x-Java7/solr/contrib/extraction/lib/netcdf-4.2-min.jar' to classloader
   [junit4]   2> 39148 T106 oasc.SolrResourceLoader.replaceClassLoader Adding 'file:/usr/home/jenkins/jenkins-slave/workspace/Lucene-Solr-Tests-4.x-Java7/solr/contrib/extraction/lib/jhighlight-1.0.jar' to classloader
   [junit4]   2> 39149 T106 oasc.SolrResourceLoader.replaceClassLoader Adding 'file:/usr/home/jenkins/jenkins-slave/workspace/Lucene-Solr-Tests-4.x-Java7/solr/contrib/extraction/lib/icu4j-53.1.jar' to classloader
   [junit4]   2> 39150 T106 oasc.SolrResourceLoader.replaceClassLoader Adding 'file:/usr/home/jenkins/jenkins-slave/workspace/Lucene-Solr-Tests-4.x-Java7/solr/contrib/extraction/lib/rome-0.9.jar' to classloader
   [junit4]   2> 39150 T106 oasc.SolrResourceLoader.replaceClassLoader Adding 'file:/usr/home/jenkins/jenkins-slave/workspace/Lucene-Solr-Tests-4.x-Java7/solr/contrib/extraction/lib/poi-ooxml-3.10.1.jar' to classloader
   [junit4]   2> 39151 T106 oasc.SolrResourceLoader.replaceClassLoader Adding 'file:/usr/home/jenkins/jenkins-slave/workspace/Lucene-Solr-Tests-4.x-Java7/solr/contrib/extraction/lib/juniversalchardet-1.0.3.jar' to classloader
   [junit4]   2> 39152 T106 oasc.SolrResourceLoader.replaceClassLoader Adding 'file:/usr/home/jenkins/jenkins-slave/workspace/Lucene-Solr-Tests-4.x-Java7/solr/contrib/extraction/lib/xmlbeans-2.6.0.jar' to classloader
   [junit4]   2> 39152 T106 oasc.SolrResourceLoader.replaceClassLoader Adding 'file:/usr/home/jenkins/jenkins-slave/workspace/Lucene-Solr-Tests-4.x-Java7/solr/contrib/extraction/lib/vorbis-java-tika-0.1.jar' to classloader
   [junit4]   2> 39153 T106 oasc.SolrResourceLoader.replaceClassLoader Adding 'file:/usr/home/jenkins/jenkins-slave/workspace/Lucene-Solr-Tests-4.x-Java7/solr/contrib/extraction/lib/xz-1.4.jar' to classloader
   [junit4]   2> 39154 T106 oasc.SolrResourceLoader.replaceClassLoader Adding 'file:/usr/home/jenkins/jenkins-slave/workspace/Lucene-Solr-Tests-4.x-Java7/solr/contrib/extraction/lib/bcmail-jdk15-1.45.jar' to classloader
   [junit4]   2> 39154 T106 oasc.SolrResourceLoader.replaceClassLoader Adding 'file:/usr/home/jenkins/jenkins-slave/workspace/Lucene-Solr-Tests-4.x-Java7/solr/contrib/extraction/lib/vorbis-java-core-0.1.jar' to classloader
   [junit4]   2> 39155 T106 oasc.SolrResourceLoader.replaceClassLoader Adding 'file:/usr/home/jenkins/jenkins-slave/workspace/Lucene-Solr-Tests-4.x-Java7/solr/contrib/extraction/lib/tika-xmp-1.5.jar' to classloader
   [junit4]   2> 39156 T106 oasc.SolrResourceLoader.replaceClassLoader Adding 'file:/usr/home/jenkins/jenkins-slave/workspace/Lucene-Solr-Tests-4.x-Java7/solr/contrib/extraction/lib/isoparser-1.0-RC-1.jar' to classloader
   [junit4]   2> 39157 T106 oasc.SolrResourceLoader.replaceClassLoader Adding 'file:/usr/home/jenkins/jenkins-slave/workspace/Lucene-Solr-Tests-4.x-Java7/solr/contrib/extraction/lib/xercesImpl-2.9.1.jar' to classloader
   [junit4]   2> 39157 T106 oasc.SolrResourceLoader.replaceClassLoader Adding 'file:/usr/home/jenkins/jenkins-slave/workspace/Lucene-Solr-Tests-4.x-Java7/solr/contrib/extraction/lib/aspectjrt-1.6.11.jar' to classloader
   [junit4]   2> 39158 T106 oasc.SolrResourceLoader.replaceClassLoader Adding 'file:/usr/home/jenkins/jenkins-slave/workspace/Lucene-Solr-Tests-4.x-Java7/solr/contrib/extraction/lib/poi-scratchpad-3.10.1.jar' to classloader
   [junit4]   2> 39159 T106 oasc.SolrResourceLoader.replaceClassLoader Adding 'file:/usr/home/jenkins/jenkins-slave/workspace/Lucene-Solr-Tests-4.x-Java7/solr/contrib/extraction/lib/pdfbox-1.8.4.jar' to classloader
   [junit4]   2> 39159 T106 oasc.SolrResourceLoader.replaceClassLoader Adding 'file:/usr/home/jenkins/jenkins-slave/workspace/Lucene-Solr-Tests-4.x-Java7/solr/contrib/extraction/lib/fontbox-1.8.4.jar' to classloader
   [junit4]   2> 39160 T106 oasc.SolrResourceLoader.replaceClassLoader Adding 'file:/usr/home/jenkins/jenkins-slave/workspace/Lucene-Solr-Tests-4.x-Java7/solr/contrib/extraction/lib/jdom-1.0.jar' to classloader
   [junit4]   2> 39161 T106 oasc.SolrResourceLoader.replaceClassLoader Adding 'file:/usr/home/jenkins/jenkins-slave/workspace/Lucene-Solr-Tests-4.x-Java7/solr/contrib/extraction/lib/jempbox-1.8.4.jar' to classloader
   [junit4]   2> 39161 T106 oasc.SolrResourceLoader.replaceClassLoader Adding 'file:/usr/home/jenkins/jenkins-slave/workspace/Lucene-Solr-Tests-4.x-Java7/solr/contrib/extraction/lib/commons-compress-1.7.jar' to classloader
   [junit4]   2> 39162 T106 oasc.SolrResourceLoader.replaceClassLoader Adding 'file:/usr/home/jenkins/jenkins-slave/workspace/Lucene-Solr-Tests-4.x-Java7/solr/contrib/extraction/lib/dom4j-1.6.1.jar' to classloader
   [junit4]   2> 39163 T106 oasc.SolrResourceLoader.replaceClassLoader Adding 'file:/usr/home/jenkins/jenkins-slave/workspace/Lucene-Solr-Tests-4.x-Java7/solr/contrib/extraction/lib/poi-ooxml-schemas-3.10.1.jar' to classloader
   [junit4]   2> 39163 T106 oasc.SolrResourceLoader.replaceClassLoader Adding 'file:/usr/home/jenkins/jenkins-slave/workspace/Lucene-Solr-Tests-4.x-Java7/solr/contrib/extraction/lib/tika-core-1.5.jar' to classloader
   [junit4]   2> 39164 T106 oasc.SolrResourceLoader.replaceClassLoader Adding 'file:/usr/home/jenkins/jenkins-slave/workspace/Lucene-Solr-Tests-4.x-Java7/solr/contrib/extraction/lib/apache-mime4j-core-0.7.2.jar' to classloader
   [junit4]   2> 39165 T106 oasc.SolrResourceLoader.replaceClassLoader Adding 'file:/usr/home/jenkins/jenkins-slave/workspace/Lucene-Solr-Tests-4.x-Java7/solr/contrib/extraction/lib/boilerpipe-1.1.0.jar' to classloader
   [junit4]   2> 39176 T106 oasc.SolrResourceLoader.addToClassLoader WARN Can't find (or read) directory to add to classloader: ../../../dist/ (resolved as: /usr/home/jenkins/jenkins-slave/workspace/Lucene-Solr-Tests-4.x-Java7/solr/example/solr/collection1/../../../dist).
   [junit4]   2> 39177 T106 oasc.SolrResourceLoader.replaceClassLoader Adding 'file:/usr/home/jenkins/jenkins-slave/workspace/Lucene-Solr-Tests-4.x-Java7/solr/contrib/clustering/lib/jackson-mapper-asl-1.9.13.jar' to classloader
   [junit4]   2> 39178 T106 oasc.SolrResourceLoader.replaceClassLoader Adding 'file:/usr/home/jenkins/jenkins-slave/workspace/Lucene-Solr-Tests-4.x-Java7/solr/contrib/clustering/lib/attributes-binder-1.2.1.jar' to classloader
   [junit4]   2> 39179 T106 oasc.SolrResourceLoader.replaceClassLoader Adding 'file:/usr/home/jenkins/jenkins-slave/workspace/Lucene-Solr-Tests-4.x-Java7/solr/contrib/clustering/lib/mahout-math-0.6.jar' to classloader
   [junit4]   2> 39179 T106 oasc.SolrResourceLoader.replaceClassLoader Adding 'file:/usr/home/jenkins/jenkins-slave/workspace/Lucene-Solr-Tests-4.x-Java7/solr/contrib/clustering/lib/carrot2-mini-3.9.0.jar' to classloader
   [junit4]   2> 39180 T106 oasc.SolrResourceLoader.replaceClassLoader Adding 'file:/usr/home/jenkins/jenkins-slave/workspace/Lucene-Solr-Tests-4.x-Java7/solr/contrib/clustering/lib/jackson-core-asl-1.9.13.jar' to classloader
   [junit4]   2> 39181 T106 oasc.SolrResourceLoader.replaceClassLoader Adding 'file:/usr/home/jenkins/jenkins-slave/workspace/Lucene-Solr-Tests-4.x-Java7/solr/contrib/clustering/lib/simple-xml-2.7.jar' to classloader
   [junit4]   2> 39181 T106 oasc.SolrResourceLoader.replaceClassLoader Adding 'file:/usr/home/jenkins/jenkins-slave/workspace/Lucene-Solr-Tests-4.x-Java7/solr/contrib/clustering/lib/mahout-collections-1.0.jar' to classloader
   [junit4]   2> 39182 T106 oasc.SolrResourceLoader.replaceClassLoader Adding 'file:/usr/home/jenkins/jenkins-slave/workspace/Lucene-Solr-Tests-4.x-Java7/solr/contrib/clustering/lib/hppc-0.5.2.jar' to classloader
   [junit4]   2> 39183 T106 oasc.SolrResourceLoader.addToClassLoader WARN Can't find (or read) directory to add to classloader: ../../../dist/ (resolved as: /usr/home/jenkins/jenkins-slave/workspace/Lucene-Solr-Tests-4.x-Java7/solr/example/solr/collection1/../../../dist).
   [junit4]   2> 39184 T106 oasc.SolrResourceLoader.replaceClassLoader Adding 'file:/usr/home/jenkins/jenkins-slave/workspace/Lucene-Solr-Tests-4.x-Java7/solr/contrib/langid/lib/langdetect-1.1-20120112.jar' to classloader
   [junit4]   2> 39185 T106 oasc.SolrResourceLoader.replaceClassLoader Adding 'file:/usr/home/jenkins/jenkins-slave/workspace/Lucene-Solr-Tests-4.x-Java7/solr/contrib/langid/lib/jsonic-1.2.7.jar' to classloader
   [junit4]   2> 39186 T106 oasc.SolrResourceLoader.addToClassLoader WARN Can't find (or read) directory to add to classloader: ../../../dist/ (resolved as: /usr/home/jenkins/jenkins-slave/workspace/Lucene-Solr-Tests-4.x-Java7/solr/example/solr/collection1/../../../dist).
   [junit4]   2> 39187 T106 oasc.SolrResourceLoader.replaceClassLoader Adding 'file:/usr/home/jenkins/jenkins-slave/workspace/Lucene-Solr-Tests-4.x-Java7/solr/contrib/velocity/lib/velocity-1.7.jar' to classloader
   [junit4]   2> 39188 T106 oasc.SolrResourceLoader.replaceClassLoader Adding 'file:/usr/home/jenkins/jenkins-slave/workspace/Lucene-Solr-Tests-4.x-Java7/solr/contrib/velocity/lib/commons-beanutils-1.8.3.jar' to classloader
   [junit4]   2> 39188 T106 oasc.SolrResourceLoader.replaceClassLoader Adding 'file:/usr/home/jenkins/jenkins-slave/workspace/Lucene-Solr-Tests-4.x-Java7/solr/contrib/velocity/lib/commons-collections-3.2.1.jar' to classloader
   [junit4]   2> 39189 T106 oasc.SolrResourceLoader.replaceClassLoader Adding 'file:/usr/home/jenkins/jenkins-slave/workspace/Lucene-Solr-Tests-4.x-Java7/solr/contrib/velocity/lib/velocity-tools-2.0.jar' to classloader
   [junit4]   2> 39190 T106 oasc.SolrResourceLoader.addToClassLoader WARN Can't find (or read) directory to add to classloader: ../../../dist/ (resolved as: /usr/home/jenkins/jenkins-slave/workspace/Lucene-Solr-Tests-4.x-Java7/solr/example/solr/collection1/../../../dist).
   [junit4]   2> 39296 T106 oasu.SolrIndexConfig.<init> IndexWriter infoStream solr logging is enabled
   [junit4]   2> 39302 T106 oasc.SolrConfig.<init> Using Lucene MatchVersion: 4.10.0
   [junit4]   2> 39400 T106 oasc.SolrConfig.<init> Loaded SolrConfig: solrconfig.xml
   [junit4]   2> 39401 T106 oass.IndexSchema.readSchema Reading Solr Schema from schema.xml
   [junit4]   2> 39507 T106 oass.IndexSchema.readSchema [collection1] Schema name=example
   [junit4]   2> 40180 T106 oass.IndexSchema.readSchema unique key field: id
   [junit4]   2> 40183 T106 oasr.RestManager$Registry.registerManagedResource Registered ManagedResource impl org.apache.solr.rest.schema.analysis.ManagedWordSetResource for path /schema/analysis/stopwords/english
   [junit4]   2> 40184 T106 oasr.RestManager$Registry.registerManagedResource Registered ManagedResource impl org.apache.solr.rest.schema.analysis.ManagedSynonymFilterFactory$SynonymManager for path /schema/analysis/synonyms/english
   [junit4]   2> 40225 T106 oass.FileExchangeRateProvider.reload Reloading exchange rates from file currency.xml
   [junit4]   2> 40236 T106 oass.FileExchangeRateProvider.reload Reloading exchange rates from file currency.xml
   [junit4]   2> 40300 T106 oasc.CoreContainer.create Creating SolrCore 'collection1' using configuration from instancedir /usr/home/jenkins/jenkins-slave/workspace/Lucene-Solr-Tests-4.x-Java7/solr/example/solr/collection1/
   [junit4]   2> 40300 T106 oasc.SolrCore.initDirectoryFactory org.apache.solr.core.MockDirectoryFactory
   [junit4]   2> 40301 T106 oasc.SolrCore.<init> [collection1] Opening new SolrCore at /usr/home/jenkins/jenkins-slave/workspace/Lucene-Solr-Tests-4.x-Java7/solr/example/solr/collection1/, dataDir=/usr/home/jenkins/jenkins-slave/workspace/Lucene-Solr-Tests-4.x-Java7/solr/build/solr-solrj/test/J1/solr.client.solrj.embedded.SolrExampleStreamingBinaryTest-ED0B16967EADF1B1-001/tempDir-001/
   [junit4]   2> 40301 T106 oasc.JmxMonitoredMap.<init> No JMX servers found, not exposing Solr information with JMX.
   [junit4]   2> 40302 T106 oasc.SolrCore.initListeners [collection1] Added SolrEventListener for newSearcher: org.apache.solr.core.QuerySenderListener{queries=[]}
   [junit4]   2> 40302 T106 oasc.SolrCore.initListeners [collection1] Added SolrEventListener for firstSearcher: org.apache.solr.core.QuerySenderListener{queries=[{q=static firstSearcher warming in solrconfig.xml}]}
   [junit4]   2> 40303 T106 oasc.CachingDirectoryFactory.get return new directory for /usr/home/jenkins/jenkins-slave/workspace/Lucene-Solr-Tests-4.x-Java7/solr/build/solr-solrj/test/J1/solr.client.solrj.embedded.SolrExampleStreamingBinaryTest-ED0B16967EADF1B1-001/tempDir-001
   [junit4]   2> 40303 T106 oasc.SolrCore.getNewIndexDir New index directory detected: old=null new=/usr/home/jenkins/jenkins-slave/workspace/Lucene-Solr-Tests-4.x-Java7/solr/build/solr-solrj/test/J1/solr.client.solrj.embedded.SolrExampleStreamingBinaryTest-ED0B16967EADF1B1-001/tempDir-001/index/
   [junit4]   2> 40304 T106 oasc.SolrCore.initIndex WARN [collection1] Solr index directory '/usr/home/jenkins/jenkins-slave/workspace/Lucene-Solr-Tests-4.x-Java7/solr/build/solr-solrj/test/J1/solr.client.solrj.embedded.SolrExampleStreamingBinaryTest-ED0B16967EADF1B1-001/tempDir-001/index' doesn't exist. Creating new index...
   [junit4]   2> 40304 T106 oasc.CachingDirectoryFactory.get return new directory for /usr/home/jenkins/jenkins-slave/workspace/Lucene-Solr-Tests-4.x-Java7/solr/build/solr-solrj/test/J1/solr.client.solrj.embedded.SolrExampleStreamingBinaryTest-ED0B16967EADF1B1-001/tempDir-001/index
   [junit4]   2> 40306 T106 oasu.LoggingInfoStream.message [IFD][coreLoadExecutor-112-thread-1]: init: current segments file is "null"; deletionPolicy=org.apache.solr.core.IndexDeletionPolicyWrapper@37eec123
   [junit4]   2> 40307 T106 oasu.LoggingInfoStream.message [IFD][coreLoadExecutor-112-thread-1]: now checkpoint "" [0 segments ; isCommit = false]
   [junit4]   2> 40307 T106 oasu.LoggingInfoStream.message [IFD][coreLoadExecutor-112-thread-1]: 0 msec to checkpoint
   [junit4]   2> 40308 T106 oasu.LoggingInfoStream.message [IW][coreLoadExecutor-112-thread-1]: init: create=true
   [junit4]   2> 40308 T106 oasu.LoggingInfoStream.message [IW][coreLoadExecutor-112-thread-1]: 
   [junit4]   2> 	dir=MockDirectoryWrapper(RAMDirectory@6984e122 lockFactory=NativeFSLockFactory@/usr/home/jenkins/jenkins-slave/workspace/Lucene-Solr-Tests-4.x-Java7/solr/build/solr-solrj/test/J1/solr.client.solrj.embedded.SolrExampleStreamingBinaryTest-ED0B16967EADF1B1-001/tempDir-001/index)
   [junit4]   2> 	index=
   [junit4]   2> 	version=4.10.0
   [junit4]   2> 	matchVersion=4.10.0
   [junit4]   2> 	analyzer=null
   [junit4]   2> 	ramBufferSizeMB=100.0
   [junit4]   2> 	maxBufferedDocs=-1
   [junit4]   2> 	maxBufferedDeleteTerms=-1
   [junit4]   2> 	mergedSegmentWarmer=null
   [junit4]   2> 	readerTermsIndexDivisor=1
   [junit4]   2> 	termIndexInterval=32
   [junit4]   2> 	delPolicy=org.apache.solr.core.IndexDeletionPolicyWrapper
   [junit4]   2> 	commit=null
   [junit4]   2> 	openMode=CREATE
   [junit4]   2> 	similarity=org.apache.lucene.search.similarities.DefaultSimilarity
   [junit4]   2> 	mergeScheduler=ConcurrentMergeScheduler: maxThreadCount=1, maxMergeCount=2, mergeThreadPriority=-1
   [junit4]   2> 	default WRITE_LOCK_TIMEOUT=1000
   [junit4]   2> 	writeLockTimeout=1000
   [junit4]   2> 	codec=Lucene410
   [junit4]   2> 	infoStream=org.apache.solr.update.LoggingInfoStream
   [junit4]   2> 	mergePolicy=[TieredMergePolicy: maxMergeAtOnce=10, maxMergeAtOnceExplicit=30, maxMergedSegmentMB=5120.0, floorSegmentMB=2.0, forceMergeDeletesPctAllowed=10.0, segmentsPerTier=10.0, maxCFSSegmentSizeMB=8.796093022207999E12, noCFSRatio=0.0
   [junit4]   2> 	indexerThreadPool=org.apache.lucene.index.DocumentsWriterPerThreadPool@1bc9fd85
   [junit4]   2> 	readerPooling=false
   [junit4]   2> 	perThreadHardLimitMB=1945
   [junit4]   2> 	useCompoundFile=false
   [junit4]   2> 	checkIntegrityAtMerge=false
   [junit4]   2> 	writer=org.apache.lucene.util.SetOnce@6a233503
   [junit4]   2> 	
   [junit4]   2> 40309 T106 oasu.LoggingInfoStream.message [IW][coreLoadExecutor-112-thread-1]: now flush at close
   [junit4]   2> 40309 T106 oasu.LoggingInfoStream.message [IW][coreLoadExecutor-112-thread-1]:   start flush: applyAllDeletes=true
   [junit4]   2> 40309 T106 oasu.LoggingInfoStream.message [IW][coreLoadExecutor-112-thread-1]:   index before flush 
   [junit4]   2> 40310 T106 oasu.LoggingInfoStream.message [DW][coreLoadExecutor-112-thread-1]: startFullFlush
   [junit4]   2> 40310 T106 oasu.LoggingInfoStream.message [DW][coreLoadExecutor-112-thread-1]: anyChanges? numDocsInRam=0 deletes=false hasTickets:false pendingChangesInFullFlush: false
   [junit4]   2> 40311 T106 oasu.LoggingInfoStream.message [DW][coreLoadExecutor-112-thread-1]: coreLoadExecutor-112-thread-1 finishFullFlush success=true
   [junit4]   2> 40311 T106 oasu.LoggingInfoStream.message [IW][coreLoadExecutor-112-thread-1]: apply all deletes during flush
   [junit4]   2> 40311 T106 oasu.LoggingInfoStream.message [BD][coreLoadExecutor-112-thread-1]: prune sis=null:  minGen=9223372036854775807 packetCount=0
   [junit4]   2> 40312 T106 oasu.LoggingInfoStream.message [CMS][coreLoadExecutor-112-thread-1]: now merge
   [junit4]   2> 40312 T106 oasu.LoggingInfoStream.message [CMS][coreLoadExecutor-112-thread-1]:   index: 
   [junit4]   2> 40312 T106 oasu.LoggingInfoStream.message [CMS][coreLoadExecutor-112-thread-1]:   no more merges pending; now return
   [junit4]   2> 40313 T106 oasu.LoggingInfoStream.message [IW][coreLoadExecutor-112-thread-1]: waitForMerges
   [junit4]   2> 40313 T106 oasu.LoggingInfoStream.message [IW][coreLoadExecutor-112-thread-1]: waitForMerges done
   [junit4]   2> 40313 T106 oasu.LoggingInfoStream.message [IW][coreLoadExecutor-112-thread-1]: commit: start
   [junit4]   2> 40314 T106 oasu.LoggingInfoStream.message [IW][coreLoadExecutor-112-thread-1]: commit: enter lock
   [junit4]   2> 40314 T106 oasu.LoggingInfoStream.message [IW][coreLoadExecutor-112-thread-1]: commit: now prepare
   [junit4]   2> 40314 T106 oasu.LoggingInfoStream.message [IW][coreLoadExecutor-112-thread-1]: prepareCommit: flush
   [junit4]   2> 40315 T106 oasu.LoggingInfoStream.message [IW][coreLoadExecutor-112-thread-1]:   index before flush 
   [junit4]   2> 40315 T106 oasu.LoggingInfoStream.message [DW][coreLoadExecutor-112-thread-1]: startFullFlush
   [junit4]   2> 40315 T106 oasu.LoggingInfoStream.message [DW][coreLoadExecutor-112-thread-1]: anyChanges? numDocsInRam=0 deletes=false hasTickets:false pendingChangesInFullFlush: false
   [junit4]   2> 40316 T106 oasu.LoggingInfoStream.message [IW][coreLoadExecutor-112-thread-1]: apply all deletes during flush
   [junit4]   2> 40316 T106 oasu.LoggingInfoStream.message [BD][coreLoadExecutor-112-thread-1]: prune sis=null:  minGen=9223372036854775807 packetCount=0
   [junit4]   2> 40316 T106 oasu.LoggingInfoStream.message [DW][coreLoadExecutor-112-thread-1]: coreLoadExecutor-112-thread-1 finishFullFlush success=true
   [junit4]   2> 40317 T106 oasu.LoggingInfoStream.message [IW][coreLoadExecutor-112-thread-1]: startCommit(): start
   [junit4]   2> 40317 T106 oasu.LoggingInfoStream.message [IW][coreLoadExecutor-112-thread-1]: startCommit index= changeCount=1
   [junit4]   2> 40318 T106 oasu.LoggingInfoStream.message [IW][coreLoadExecutor-112-thread-1]: done all syncs: []
   [junit4]   2> 40318 T106 oasu.LoggingInfoStream.message [IW][coreLoadExecutor-112-thread-1]: commit: pendingCommit != null
   [junit4]   2> 40319 T106 oasu.LoggingInfoStream.message [IW][coreLoadExecutor-112-thread-1]: commit: wrote segments file "segments_1"
   [junit4]   2> 40319 T106 oasu.LoggingInfoStream.message [IFD][coreLoadExecutor-112-thread-1]: now checkpoint "" [0 segments ; isCommit = true]
   [junit4]   2> 40319 T106 oasc.SolrDeletionPolicy.onCommit SolrDeletionPolicy.onCommit: commits: num=1
   [junit4]   2> 		commit{dir=MockDirectoryWrapper(RAMDirectory@6984e122 lockFactory=NativeFSLockFactory@/usr/home/jenkins/jenkins-slave/workspace/Lucene-Solr-Tests-4.x-Java7/solr/build/solr-solrj/test/J1/solr.client.solrj.embedded.SolrExampleStreamingBinaryTest-ED0B16967EADF1B1-001/tempDir-001/index),segFN=segments_1,generation=1}
   [junit4]   2> 40320 T106 oasc.SolrDeletionPolicy.updateCommits newest commit generation = 1
   [junit4]   2> 40320 T106 oasu.LoggingInfoStream.message [IFD][coreLoadExecutor-112-thread-1]: 1 msec to checkpoint
   [junit4]   2> 40321 T106 oasu.LoggingInfoStream.message [IW][coreLoadExecutor-112-thread-1]: commit: took 6.2 msec
   [junit4]   2> 40321 T106 oasu.LoggingInfoStream.message [IW][coreLoadExecutor-112-thread-1]: commit: done
   [junit4]   2> 40321 T106 oasu.LoggingInfoStream.message [IW][coreLoadExecutor-112-thread-1]: rollback
   [junit4]   2> 40322 T106 oasu.LoggingInfoStream.message [IW][coreLoadExecutor-112-thread-1]: all running merges have aborted
   [junit4]   2> 40322 T106 oasu.LoggingInfoStream.message [IW][coreLoadExecutor-112-thread-1]: rollback: done finish merges
   [junit4]   2> 40322 T106 oasu.LoggingInfoStream.message [DW][coreLoadExecutor-112-thread-1]: abort
   [junit4]   2> 40323 T106 oasu.LoggingInfoStream.message [DW][coreLoadExecutor-112-thread-1]: done abort; abortedFiles=[] success=true
   [junit4]   2> 40323 T106 oasu.LoggingInfoStream.message [IW][coreLoadExecutor-112-thread-1]: rollback: infos=
   [junit4]   2> 40323 T106 oasu.LoggingInfoStream.message [IFD][coreLoadExecutor-112-thread-1]: now checkpoint "" [0 segments ; isCommit = false]
   [junit4]   2> 40324 T106 oasu.LoggingInfoStream.message [IFD][coreLoadExecutor-112-thread-1]: 0 msec to checkpoint
   [junit4]   2> 40324 T106 oasc.SolrCore.initWriters created json: solr.JSONResponseWriter
   [junit4]   2> 40325 T106 oasc.SolrCore.initWriters adding lazy queryResponseWriter: solr.VelocityResponseWriter
   [junit4]   2> 40325 T106 oasc.SolrCore.initWriters created velocity: solr.VelocityResponseWriter
   [junit4]   2> 40325 T106 oasc.SolrCore.initWriters created xslt: solr.XSLTResponseWriter
   [junit4]   2> 40326 T106 oasr.XSLTResponseWriter.init xsltCacheLifetimeSeconds=5
   [junit4]   2> 40328 T106 oasc.SolrCore.loadUpdateProcessorChains no updateRequestProcessorChain defined as default, creating implicit default
   [junit4]   2> 40328 T106 oasc.RequestHandlers.initHandlersFromConfig created /update: org.apache.solr.handler.UpdateRequestHandler
   [junit4]   2> 40329 T106 oasc.RequestHandlers.initHandlersFromConfig created /update/json: org.apache.solr.handler.UpdateRequestHandler
   [junit4]   2> 40329 T106 oasc.RequestHandlers.initHandlersFromConfig created /update/csv: org.apache.solr.handler.UpdateRequestHandler
   [junit4]   2> 40330 T106 oasc.RequestHandlers.initHandlersFromConfig created /update/json/docs: org.apache.solr.handler.UpdateRequestHandler
   [junit4]   2> 40330 T106 oasc.RequestHandlers.initHandlersFromConfig created /select: solr.SearchHandler
   [junit4]   2> 40331 T106 oasc.RequestHandlers.initHandlersFromConfig created /query: solr.SearchHandler
   [junit4]   2> 40331 T106 oasc.RequestHandlers.initHandlersFromConfig created /get: solr.RealTimeGetHandler
   [junit4]   2> 40331 T106 oasc.RequestHandlers.initHandlersFromConfig created /export: solr.SearchHandler
   [junit4]   2> 40332 T106 oasc.RequestHandlers.initHandlersFromConfig created /browse: solr.SearchHandler
   [junit4]   2> 40332 T106 oasc.RequestHandlers.initHandlersFromConfig WARN Multiple requestHandler registered to the same name: /update ignoring: org.apache.solr.handler.UpdateRequestHandler
   [junit4]   2> 40333 T106 oasc.RequestHandlers.initHandlersFromConfig created /update: solr.UpdateRequestHandler
   [junit4]   2> 40333 T106 oasc.RequestHandlers.initHandlersFromConfig adding lazy requestHandler: solr.extraction.ExtractingRequestHandler
   [junit4]   2> 40333 T106 oasc.RequestHandlers.initHandlersFromConfig created /update/extract: solr.extraction.ExtractingRequestHandler
   [junit4]   2> 40334 T106 oasc.RequestHandlers.initHandlersFromConfig adding lazy requestHandler: solr.FieldAnalysisRequestHandler
   [junit4]   2> 40334 T106 oasc.RequestHandlers.initHandlersFromConfig created /analysis/field: solr.FieldAnalysisRequestHandler
   [junit4]   2> 40334 T106 oasc.RequestHandlers.initHandlersFromConfig adding lazy requestHandler: solr.DocumentAnalysisRequestHandler
   [junit4]   2> 40334 T106 oasc.RequestHandlers.initHandlersFromConfig created /analysis/document: solr.DocumentAnalysisRequestHandler
   [junit4]   2> 40335 T106 oasc.RequestHandlers.initHandlersFromConfig created /admin/: solr.admin.AdminHandlers
   [junit4]   2> 40335 T106 oasc.RequestHandlers.initHandlersFromConfig created /admin/ping: solr.PingRequestHandler
   [junit4]   2> 40336 T106 oasc.RequestHandlers.initHandlersFromConfig created /debug/dump: solr.DumpRequestHandler
   [junit4]   2> 40336 T106 oasc.RequestHandlers.initHandlersFromConfig created /replication: solr.ReplicationHandler
   [junit4]   2> 40337 T106 oasc.RequestHandlers.initHandlersFromConfig adding lazy requestHandler: solr.SearchHandler
   [junit4]   2> 40337 T106 oasc.RequestHandlers.initHandlersFromConfig created /spell: solr.SearchHandler
   [junit4]   2> 40337 T106 oasc.RequestHandlers.initHandlersFromConfig adding lazy requestHandler: solr.SearchHandler
   [junit4]   2> 40338 T106 oasc.RequestHandlers.initHandlersFromConfig created /suggest: solr.SearchHandler
   [junit4]   2> 40338 T106 oasc.RequestHandlers.initHandlersFromConfig adding lazy requestHandler: solr.SearchHandler
   [junit4]   2> 40338 T106 oasc.RequestHandlers.initHandlersFromConfig created /tvrh: solr.SearchHandler
   [junit4]   2> 40338 T106 oasc.RequestHandlers.initHandlersFromConfig adding lazy requestHandler: solr.SearchHandler
   [junit4]   2> 40339 T106 oasc.RequestHandlers.initHandlersFromConfig created /terms: solr.SearchHandler
   [junit4]   2> 40339 T106 oasc.RequestHandlers.initHandlersFromConfig adding lazy requestHandler: solr.SearchHandler
   [junit4]   2> 40339 T106 oasc.RequestHandlers.initHandlersFromConfig created /elevate: solr.SearchHandler
   [junit4]   2> 40356 T106 oashl.XMLLoader.init xsltCacheLifetimeSeconds=60
   [junit4]   2> 40358 T106 oashl.XMLLoader.init xsltCacheLifetimeSeconds=60
   [junit4]   2> 40360 T106 oashl.XMLLoader.init xsltCacheLifetimeSeconds=60
   [junit4]   2> 40362 T106 oashl.XMLLoader.init xsltCacheLifetimeSeconds=60
   [junit4]   2> 40365 T106 oashl.XMLLoader.init xsltCacheLifetimeSeconds=60
   [junit4]   2> 40368 T106 oasu.CommitTracker.<init> Hard AutoCommit: if uncommited for 15000ms; 
   [junit4]   2> 40369 T106 oasu.CommitTracker.<init> Soft AutoCommit: disabled
   [junit4]   2> 40370 T106 oasu.LoggingInfoStream.message [IFD][coreLoadExecutor-112-thread-1]: init: current segments file is "segments_1"; deletionPolicy=org.apache.solr.core.IndexDeletionPolicyWrapper@37eec123
   [junit4]   2> 40370 T106 oasu.LoggingInfoStream.message [IFD][coreLoadExecutor-112-thread-1]: init: load commit "segments_1"
   [junit4]   2> 40370 T106 oasc.SolrDeletionPolicy.onInit SolrDeletionPolicy.onInit: commits: num=1
   [junit4]   2> 		commit{dir=MockDirectoryWrapper(RAMDirectory@6984e122 lockFactory=NativeFSLockFactory@/usr/home/jenkins/jenkins-slave/workspace/Lucene-Solr-Tests-4.x-Java7/solr/build/solr-solrj/test/J1/solr.client.solrj.embedded.SolrExampleStreamingBinaryTest-ED0B16967EADF1B1-001/tempDir-001/index),segFN=segments_1,generation=1}
   [junit4]   2> 40371 T106 oasc.SolrDeletionPolicy.updateCommits newest commit generation = 1
   [junit4]   2> 40371 T106 oasu.LoggingInfoStream.message [IFD][coreLoadExecutor-112-thread-1]: now checkpoint "" [0 segments ; isCommit = false]
   [junit4]   2> 40371 T106 oasu.LoggingInfoStream.message [IFD][coreLoadExecutor-112-thread-1]: 0 msec to checkpoint
   [junit4]   2> 40371 T106 oasu.LoggingInfoStream.message [IW][coreLoadExecutor-112-thread-1]: init: create=false
   [junit4]   2> 40372 T106 oasu.LoggingInfoStream.message [IW][coreLoadExecutor-112-thread-1]: 
   [junit4]   2> 	dir=MockDirectoryWrapper(RAMDirectory@6984e122 lockFactory=NativeFSLockFactory@/usr/home/jenkins/jenkins-slave/workspace/Lucene-Solr-Tests-4.x-Java7/solr/build/solr-solrj/test/J1/solr.client.solrj.embedded.SolrExampleStreamingBinaryTest-ED0B16967EADF1B1-001/tempDir-001/index)
   [junit4]   2> 	index=
   [junit4]   2> 	version=4.10.0
   [junit4]   2> 	matchVersion=4.10.0
   [junit4]   2> 	analyzer=null
   [junit4]   2> 	ramBufferSizeMB=100.0
   [junit4]   2> 	maxBufferedDocs=-1
   [junit4]   2> 	maxBufferedDeleteTerms=-1
   [junit4]   2> 	mergedSegmentWarmer=null
   [junit4]   2> 	readerTermsIndexDivisor=1
   [junit4]   2> 	termIndexInterval=32
   [junit4]   2> 	delPolicy=org.apache.solr.core.IndexDeletionPolicyWrapper
   [junit4]   2> 	commit=null
   [junit4]   2> 	openMode=APPEND
   [junit4]   2> 	similarity=org.apache.lucene.search.similarities.DefaultSimilarity
   [junit4]   2> 	mergeScheduler=ConcurrentMergeScheduler: maxThreadCount=1, maxMergeCount=2, mergeThreadPriority=-1
   [junit4]   2> 	default WRITE_LOCK_TIMEOUT=1000
   [junit4]   2> 	writeLockTimeout=1000
   [junit4]   2> 	codec=Lucene410
   [junit4]   2> 	infoStream=org.apache.solr.update.LoggingInfoStream
   [junit4]   2> 	mergePolicy=[TieredMergePolicy: maxMergeAtOnce=10, maxMergeAtOnceExplicit=30, maxMergedSegmentMB=5120.0, floorSegmentMB=2.0, forceMergeDeletesPctAllowed=10.0, segmentsPerTier=10.0, maxCFSSegmentSizeMB=8.796093022207999E12, noCFSRatio=0.0
   [junit4]   2> 	indexerThreadPool=org.apache.lucene.index.DocumentsWriterPerThreadPool@56dc0ec
   [junit4]   2> 	readerPooling=false
   [junit4]   2> 	perThreadHardLimitMB=1945
   [junit4]   2> 	useCompoundFile=false
   [junit4]   2> 	checkIntegrityAtMerge=false
   [junit4]   2> 	writer=org.apache.lucene.util.SetOnce@6894c8bc
   [junit4]   2> 	
   [junit4]   2> 40372 T106 oasu.LoggingInfoStream.message [IW][coreLoadExecutor-112-thread-1]: flush at getReader
   [junit4]   2> 40372 T106 oasu.LoggingInfoStream.message [DW][coreLoadExecutor-112-thread-1]: startFullFlush
   [junit4]   2> 40373 T106 oasu.LoggingInfoStream.message [DW][coreLoadExecutor-112-thread-1]: anyChanges? numDocsInRam=0 deletes=false hasTickets:false pendingChangesInFullFlush: false
   [junit4]   2> 40373 T106 oasu.LoggingInfoStream.message [IW][coreLoadExecutor-112-thread-1]: apply all deletes during flush
   [junit4]   2> 40373 T106 oasu.LoggingInfoStream.message [BD][coreLoadExecutor-112-thread-1]: prune sis=segments_1:  minGen=9223372036854775807 packetCount=0
   [junit4]   2> 40373 T106 oasu.LoggingInfoStream.message [IW][coreLoadExecutor-112-thread-1]: return reader version=1 reader=StandardDirectoryReader(segments_1:1:nrt)
   [junit4]   2> 40374 T106 oasu.LoggingInfoStream.message [DW][coreLoadExecutor-112-thread-1]: coreLoadExecutor-112-thread-1 finishFullFlush success=true
   [junit4]   2> 40374 T106 oasu.LoggingInfoStream.message [IW][coreLoadExecutor-112-thread-1]: getReader took 2 msec
   [junit4]   2> 40374 T106 oass.SolrIndexSearcher.<init> Opening Searcher@447532fb[collection1] main
   [junit4]   2> 40375 T106 oasr.ManagedResourceStorage.newStorageIO WARN Cannot write to config directory /usr/home/jenkins/jenkins-slave/workspace/Lucene-Solr-Tests-4.x-Java7/solr/example/solr/collection1/conf; switching to use InMemory storage instead.
   [junit4]   2> 40375 T106 oasr.RestManager.init Initializing RestManager with initArgs: {}
   [junit4]   2> 40376 T106 oasr.ManagedResourceStorage.load Reading _rest_managed.json using InMemoryStorage
   [junit4]   2> 40376 T106 oasr.ManagedResource.reloadFromStorage WARN No stored data found for /rest/managed
   [junit4]   2> 40376 T106 oasr.ManagedResourceStorage$JsonStorage.store Saved JSON object to path _rest_managed.json using InMemoryStorage
   [junit4]   2> 40376 T106 oasr.RestManager.init Initializing 2 registered ManagedResources
   [junit4]   2> 40377 T106 oasr.ManagedResourceStorage.load Reading _schema_analysis_stopwords_english.json using InMemoryStorage
   [junit4]   2> 40377 T106 oasr.ManagedResource.reloadFromStorage WARN No stored data found for /schema/analysis/stopwords/english
   [junit4]   2> 40377 T106 oasr.ManagedResourceStorage$JsonStorage.store Saved JSON object to path _schema_analysis_stopwords_english.json using InMemoryStorage
   [junit4]   2> 40377 T106 oasrsa.ManagedWordSetResource.onManagedDataLoadedFromStorage Loaded 0 words for /schema/analysis/stopwords/english
   [junit4]   2> 40378 T106 oasr.ManagedResource.notifyObserversDuringInit Notified 1 observers of /schema/analysis/stopwords/english
   [junit4]   2> 40378 T106 oasr.ManagedResourceStorage.load Reading _schema_analysis_synonyms_english.json using InMemoryStorage
   [junit4]   2> 40378 T106 oasr.ManagedResource.reloadFromStorage WARN No stored data found for /schema/analysis/synonyms/english
   [junit4]   2> 40379 T106 oasrsa.ManagedSynonymFilterFactory$SynonymManager.onManagedDataLoadedFromStorage Loaded 0 synonym mappings for /schema/analysis/synonyms/english
   [junit4]   2> 40379 T106 oasr.ManagedResource.notifyObserversDuringInit Notified 1 observers of /schema/analysis/synonyms/english
   [junit4]   2> 40379 T106 oashc.SpellCheckComponent.inform Initializing spell checkers
   [junit4]   2> 40380 T106 oass.DirectSolrSpellChecker.init init: {name=default,field=text,classname=solr.DirectSolrSpellChecker,distanceMeasure=internal,accuracy=0.5,maxEdits=2,minPrefix=1,maxInspections=5,minQueryLength=4,maxQueryFrequency=0.01}
   [junit4]   2> 40380 T106 oashc.SpellCheckComponent.inform No queryConverter defined, using default converter
   [junit4]   2> 40380 T106 oashc.SuggestComponent.inform Initializing SuggestComponent
   [junit4]   2> 40381 T106 oasss.SolrSuggester.init init: {name=mySuggester,lookupImpl=FuzzyLookupFactory,dictionaryImpl=DocumentDictionaryFactory,field=cat,weightField=price,suggestAnalyzerFieldType=string}
   [junit4]   2> 40381 T106 oasss.SolrSuggester.init Dictionary loaded with params: {name=mySuggester,lookupImpl=FuzzyLookupFactory,dictionaryImpl=DocumentDictionaryFactory,field=cat,weightField=price,suggestAnalyzerFieldType=string}
   [junit4]   2> 40382 T106 oashc.QueryElevationComponent.inform Loading QueryElevation from: /usr/home/jenkins/jenkins-slave/workspace/Lucene-Solr-Tests-4.x-Java7/solr/example/solr/collection1/conf/elevate.xml
   [junit4]   2> 40392 T106 oash.ReplicationHandler.inform Commits will be reserved for  10000
   [junit4]   2> 40392 T107 oasc.QuerySenderListener.newSearcher QuerySenderListener sending requests to Searcher@447532fb[collection1] main{StandardDirectoryReader(segments_1:1:nrt)}
   [junit4]   2> 40392 T106 oasc.CoreContainer.registerCore registering core: collection1
   [junit4]   2> 40393 T96 oass.SolrDispatchFilter.init user.dir=/usr/home/jenkins/jenkins-slave/workspace/Lucene-Solr-Tests-4.x-Java7/solr/build/solr-solrj/test/J1
   [junit4]   2> ASYNC  NEW_CORE C14 name=collection1 org.apache.solr.core.SolrCore@13c470d4
   [junit4]   2> 40394 T107 C14 oasc.SolrCore.execute [collection1] webapp=null path=null params={distrib=false&q=static+firstSearcher+warming+in+solrconfig.xml&event=firstSearcher} hits=0 status=0 QTime=1 
   [junit4]   2> 40394 T96 oass.SolrDispatchFilter.init SolrDispatchFilter.init() done
   [junit4]   2> 40394 T107 oasc.QuerySenderListener.newSearcher QuerySenderListener done.
   [junit4]   2> 40395 T96 oas.SolrJettyTestBase.createJetty Jetty Assigned Port#53858
   [junit4]   2> 40395 T107 oashc.SpellCheckComponent$SpellCheckerListener.newSearcher Loading spell index for spellchecker: default
   [junit4]   2> 40396 T107 oashc.SpellCheckComponent$SpellCheckerListener.newSearcher Loading spell index for spellchecker: wordbreak
   [junit4]   2> 40396 T107 oashc.SuggestComponent$SuggesterListener.newSearcher Loading suggester index for: mySuggester
   [junit4]   2> 40396 T107 oasss.SolrSuggester.reload reload()
   [junit4]   2> 40397 T107 oasss.SolrSuggester.build build()
   [junit4]   2> 40399 T107 oasc.SolrCore.registerSearcher [collection1] Registered new searcher Searcher@447532fb[collection1] main{StandardDirectoryReader(segments_1:1:nrt)}
   [junit4]   2> 40408 T96 oas.SolrTestCaseJ4.setUp ###Starting testStatistics
   [junit4]   2> 40445 T99 C14 oasu.LoggingInfoStream.message [DW][qtp1518191940-99]: anyChanges? numDocsInRam=0 deletes=true hasTickets:false pendingChangesInFullFlush: false
   [junit4]   2> 40445 T99 C14 oasu.LoggingInfoStream.message [IW][qtp1518191940-99]: nrtIsCurrent: infoVersion matches: true; DW changes: true; BD changes: false
   [junit4]   2> 40446 T99 C14 oasu.LoggingInfoStream.message [DW][qtp1518191940-99]: anyChanges? numDocsInRam=0 deletes=true hasTickets:false pendingChangesInFullFlush: false
   [junit4]   2> 40446 T99 C14 oasu.LoggingInfoStream.message [IW][qtp1518191940-99]: flush at getReader
   [junit4]   2> 40446 T99 C14 oasu.LoggingInfoStream.message [DW][qtp1518191940-99]: startFullFlush
   [junit4]   2> 40447 T99 C14 oasu.LoggingInfoStream.message [DW][qtp1518191940-99]: anyChanges? numDocsInRam=0 deletes=true hasTickets:false pendingChangesInFullFlush: false
   [junit4]   2> 40447 T99 C14 oasu.LoggingInfoStream.message [DW][qtp1518191940-99]: qtp1518191940-99: flush naked frozen global deletes
   [junit4]   2> 40448 T99 C14 oasu.LoggingInfoStream.message [BD][qtp1518191940-99]: push deletes  1 deleted queries bytesUsed=64 delGen=2 packetCount=1 totBytesUsed=64
   [junit4]   2> 40448 T99 C14 oasu.LoggingInfoStream.message [DW][qtp1518191940-99]: flush: push buffered updates:  1 deleted queries bytesUsed=64
   [junit4]   2> 40448 T99 C14 oasu.LoggingInfoStream.message [IW][qtp1518191940-99]: apply all deletes during flush
   [junit4]   2> 40449 T99 C14 oasu.LoggingInfoStream.message [BD][qtp1518191940-99]: prune sis=segments_1:  minGen=9223372036854775807 packetCount=1
   [junit4]   2> 40449 T99 C14 oasu.LoggingInfoStream.message [BD][qtp1518191940-99]: pruneDeletes: prune 1 packets; 0 packets remain
   [junit4]   2> 40449 T99 C14 oasu.LoggingInfoStream.message [IW][qtp1518191940-99]: return reader version=1 reader=StandardDirectoryReader(segments_1:1:nrt)
   [junit4]   2> 40450 T99 C14 oasu.LoggingInfoStream.message [DW][qtp1518191940-99]: qtp1518191940-99 finishFullFlush success=true
   [junit4]   2> 40450 T99 C14 oasu.LoggingInfoStream.message [IW][qtp1518191940-99]: getReader took 4 msec
   [junit4]   2> 40451 T99 C14 oasup.LogUpdateProcessor.finish [collection1] webapp=/solr path=/update params={version=2&wt=javabin} {deleteByQuery=*:* (-1476892338857967616)} 0 12
   [junit4]   2> 40455 T99 C14 oasu.DirectUpdateHandler2.commit start commit{,optimize=false,openSearcher=true,waitSearcher=true,expungeDeletes=false,softCommit=false,prepareCommit=false}
   [junit4]   2> 40456 T99 C14 oasu.LoggingInfoStream.message [DW][qtp1518191940-99]: anyChanges? numDocsInRam=0 deletes=false hasTickets:false pendingChangesInFullFlush: false
   [junit4]   2> 40456 T99 C14 oasu.DirectUpdateHandler2.commit No uncommitted changes. Skipping IW.commit.
   [junit4]   2> 40457 T99 C14 oasu.LoggingInfoStream.message [DW][qtp1518191940-99]: anyChanges? numDocsInRam=0 deletes=false hasTickets:false pendingChangesInFullFlush: false
   [junit4]   2> 40457 T99 C14 oasu.LoggingInfoStream.message [IW][qtp1518191940-99]: nrtIsCurrent: infoVersion matches: true; DW changes: false; BD changes: false
   [junit4]   2> 40457 T99 C14 oasu.LoggingInfoStream.message [DW][qtp1518191940-99]: anyChanges? numDocsInRam=0 deletes=false hasTickets:false pendingChangesInFullFlush: false
   [junit4]   2> 40457 T99 C14 oasc.SolrCore.openNewSearcher SolrIndexSearcher has not changed - not re-opening: org.apache.solr.search.SolrIndexSearcher
   [junit4]   2> 40458 T99 C14 oasu.DirectUpdateHandler2.commit end_commit_flush
   [junit4]   2> 40458 T99 C14 oasup.LogUpdateProcessor.finish [collection1] webapp=/solr path=/update params={commit=true&version=2&waitSearcher=true&softCommit=false&wt=javabin} {commit=} 0 3
   [junit4]   2> 40464 T99 C14 oasc.SolrCore.execute [collection1] webapp=/solr path=/select params={version=2&wt=javabin&q=*:*} hits=0 status=0 QTime=1 
   [junit4]   2> 40735 T101 C14 oasup.LogUpdateProcessor.finish [collection1] webapp=/solr path=/update params={version=2&wt=javabin} {add=[doc3 (1476892338906202114), doc6 (1476892338910396417), doc7 (1476892338911444992)]} 0 251
   [junit4]   2> 40735 T103 C14 oasup.LogUpdateProcessor.finish [collection1] webapp=/solr path=/update params={version=2&wt=javabin} {add=[doc2 (1476892338906202113)]} 0 250
   [junit4]   2> 40735 T99 C14 oasup.LogUpdateProcessor.finish [collection1] webapp=/solr path=/update params={version=2&wt=javabin} {add=[doc0 (1476892338906202112)]} 0 251
   [junit4]   2> 40735 T100 C14 oasup.LogUpdateProcessor.finish [collection1] webapp=/solr path=/update params={version=2&wt=javabin} {add=[doc1 (1476892338906202116), doc5 (1476892338910396416), doc8 (1476892338911444993), doc9 (1476892338912493568)]} 0 251
   [junit4]   2> 40735 T102 C14 oasup.LogUpdateProcessor.finish [collection1] webapp=/solr path=/update params={version=2&wt=javabin} {add=[doc4 (1476892338906202115)]} 0 251
   [junit4]   2> 40741 T102 C14 oasu.DirectUpdateHandler2.commit start commit{,optimize=false,openSearcher=true,waitSearcher=true,expungeDeletes=false,softCommit=false,prepareCommit=false}
   [junit4]   2> 40741 T102 C14 oasu.LoggingInfoStream.message [IW][qtp1518191940-102]: commit: start
   [junit4]   2> 40741 T102 C14 oasu.LoggingInfoStream.message [IW][qtp1518191940-102]: commit: enter lock
   [junit4]   2> 40742 T102 C14 oasu.LoggingInfoStream.message [IW][qtp1518191940-102]: commit: now prepare
   [junit4]   2> 40742 T102 C14 oasu.LoggingInfoStream.message [IW][qtp1518191940-102]: prepareCommit: flush
   [junit4]   2> 40742 T102 C14 oasu.LoggingInfoStream.message [IW][qtp1518191940-102]:   index before flush 
   [junit4]   2> 40742 T102 C14 oasu.LoggingInfoStream.message [DW][qtp1518191940-102]: startFullFlush
   [junit4]   2> 40743 T102 C14 oasu.LoggingInfoStream.message [DW][qtp1518191940-102]: anyChanges? numDocsInRam=10 deletes=true hasTickets:false pendingChangesInFullFlush: false
   [junit4]   2> 40743 T102 C14 oasu.LoggingInfoStream.message [DWFC][qtp1518191940-102]: addFlushableState DocumentsWriterPerThread [pendingDeletes=gen=0, segment=_0, aborting=false, numDocsInRAM=1, deleteQueue=DWDQ: [ generation: 2 ]]
   [junit4]   2> 40743 T102 C14 oasu.LoggingInfoStream.message [DWFC][qtp1518191940-102]: addFlushableState DocumentsWriterPerThread [pendingDeletes=gen=0, segment=_2, aborting=false, numDocsInRAM=1, deleteQueue=DWDQ: [ generation: 2 ]]
   [junit4]   2> 40744 T102 C14 oasu.LoggingInfoStream.message [DWFC][qtp1518191940-102]: addFlushableState DocumentsWriterPerThread [pendingDeletes=gen=0 3 deleted terms (unique count=3) bytesUsed=504, segment=_4, aborting=false, numDocsInRAM=3, deleteQueue=DWDQ: [ generation: 2 ]]
   [junit4]   2> 40744 T102 C14 oasu.LoggingInfoStream.message [DWFC][qtp1518191940-102]: addFlushableState DocumentsWriterPerThread [pendingDeletes=gen=0 6 deleted terms (unique count=6) bytesUsed=1008, segment=_3, aborting=false, numDocsInRAM=4, deleteQueue=DWDQ: [ generation: 2 ]]
   [junit4]   2> 40745 T102 C14 oasu.LoggingInfoStream.message [DWFC][qtp1518191940-102]: addFlushableState DocumentsWriterPerThread [pendingDeletes=gen=0, segment=_1, aborting=false, numDocsInRAM=1, deleteQueue=DWDQ: [ generation: 2 ]]
   [junit4]   2> 40745 T102 C14 oasu.LoggingInfoStream.message [DWPT][qtp1518191940-102]: flush postings as segment _0 numDocs=1
   [junit4]   2> 40749 T102 C14 oasu.LoggingInfoStream.message [DWPT][qtp1518191940-102]: new segment has 0 deleted docs
   [junit4]   2> 40749 T102 C14 oasu.LoggingInfoStream.message [DWPT][qtp1518191940-102]: new segment has no vectors; norms; no docValues; prox; freqs
   [junit4]   2> 40749 T102 C14 oasu.LoggingInfoStream.message [DWPT][qtp1518191940-102]: flushedFiles=[_0_Lucene41_0.pos, _0.fdt, _0_Lucene41_0.doc, _0.fnm, _0_Lucene41_0.tip, _0.nvd, _0_Lucene41_0.tim, _0.nvm, _0.fdx]
   [junit4]   2> 40750 T102 C14 oasu.LoggingInfoStream.message [DWPT][qtp1518191940-102]: flushed codec=Lucene410
   [junit4]   2> 40750 T102 C14 oasu.LoggingInfoStream.message [DWPT][qtp1518191940-102]: flushed: segment=_0 ramUsed=0.08 MB newFlushedSize(includes docstores)=0.001 MB docs/MB=763.712
   [junit4]   2> 40751 T102 C14 oasu.LoggingInfoStream.message [DWPT][qtp1518191940-102]: flush postings as segment _2 numDocs=1
   [junit4]   2> 40754 T102 C14 oasu.LoggingInfoStream.message [DWPT][qtp1518191940-102]: new segment has 0 deleted docs
   [junit4]   2> 40755 T102 C14 oasu.LoggingInfoStream.message [DWPT][qtp1518191940-102]: new segment has no vectors; norms; no docValues; prox; freqs
   [junit4]   2> 40755 T102 C14 oasu.LoggingInfoStream.message [DWPT][qtp1518191940-102]: flushedFiles=[_2.nvm, _2_Lucene41_0.tip, _2.nvd, _2.fdx, _2_Lucene41_0.tim, _2_Lucene41_0.doc, _2.fdt, _2.fnm, _2_Lucene41_0.pos]
   [junit4]   2> 40755 T102 C14 oasu.LoggingInfoStream.message [DWPT][qtp1518191940-102]: flushed codec=Lucene410
   [junit4]   2> 40756 T102 C14 oasu.LoggingInfoStream.message [DWPT][qtp1518191940-102]: flushed: seg

[...truncated too long message...]

ampleEmbeddedTest-seed#[ED0B16967EADF1B1]-worker]:   index before flush 
   [junit4]   2> 190845 T295 C104 oasu.LoggingInfoStream.message [DW][SUITE-SolrExampleEmbeddedTest-seed#[ED0B16967EADF1B1]-worker]: startFullFlush
   [junit4]   2> 190845 T295 C104 oasu.LoggingInfoStream.message [DW][SUITE-SolrExampleEmbeddedTest-seed#[ED0B16967EADF1B1]-worker]: anyChanges? numDocsInRam=0 deletes=false hasTickets:false pendingChangesInFullFlush: false
   [junit4]   2> 190846 T295 C104 oasu.LoggingInfoStream.message [DW][SUITE-SolrExampleEmbeddedTest-seed#[ED0B16967EADF1B1]-worker]: SUITE-SolrExampleEmbeddedTest-seed#[ED0B16967EADF1B1]-worker finishFullFlush success=true
   [junit4]   2> 190846 T295 C104 oasu.LoggingInfoStream.message [IW][SUITE-SolrExampleEmbeddedTest-seed#[ED0B16967EADF1B1]-worker]: apply all deletes during flush
   [junit4]   2> 190846 T295 C104 oasu.LoggingInfoStream.message [BD][SUITE-SolrExampleEmbeddedTest-seed#[ED0B16967EADF1B1]-worker]: prune sis=segments_1u:  minGen=9223372036854775807 packetCount=0
   [junit4]   2> 190847 T295 C104 oasu.LoggingInfoStream.message [CMS][SUITE-SolrExampleEmbeddedTest-seed#[ED0B16967EADF1B1]-worker]: now merge
   [junit4]   2> 190847 T295 C104 oasu.LoggingInfoStream.message [CMS][SUITE-SolrExampleEmbeddedTest-seed#[ED0B16967EADF1B1]-worker]:   index: 
   [junit4]   2> 190847 T295 C104 oasu.LoggingInfoStream.message [CMS][SUITE-SolrExampleEmbeddedTest-seed#[ED0B16967EADF1B1]-worker]:   no more merges pending; now return
   [junit4]   2> 190847 T295 C104 oasu.LoggingInfoStream.message [IW][SUITE-SolrExampleEmbeddedTest-seed#[ED0B16967EADF1B1]-worker]: waitForMerges
   [junit4]   2> 190848 T295 C104 oasu.LoggingInfoStream.message [IW][SUITE-SolrExampleEmbeddedTest-seed#[ED0B16967EADF1B1]-worker]: waitForMerges done
   [junit4]   2> 190848 T295 C104 oasu.LoggingInfoStream.message [IW][SUITE-SolrExampleEmbeddedTest-seed#[ED0B16967EADF1B1]-worker]: commit: start
   [junit4]   2> 190848 T295 C104 oasu.LoggingInfoStream.message [IW][SUITE-SolrExampleEmbeddedTest-seed#[ED0B16967EADF1B1]-worker]: commit: enter lock
   [junit4]   2> 190848 T295 C104 oasu.LoggingInfoStream.message [IW][SUITE-SolrExampleEmbeddedTest-seed#[ED0B16967EADF1B1]-worker]: commit: now prepare
   [junit4]   2> 190849 T295 C104 oasu.LoggingInfoStream.message [IW][SUITE-SolrExampleEmbeddedTest-seed#[ED0B16967EADF1B1]-worker]: prepareCommit: flush
   [junit4]   2> 190849 T295 C104 oasu.LoggingInfoStream.message [IW][SUITE-SolrExampleEmbeddedTest-seed#[ED0B16967EADF1B1]-worker]:   index before flush 
   [junit4]   2> 190849 T295 C104 oasu.LoggingInfoStream.message [DW][SUITE-SolrExampleEmbeddedTest-seed#[ED0B16967EADF1B1]-worker]: startFullFlush
   [junit4]   2> 190849 T295 C104 oasu.LoggingInfoStream.message [DW][SUITE-SolrExampleEmbeddedTest-seed#[ED0B16967EADF1B1]-worker]: anyChanges? numDocsInRam=0 deletes=false hasTickets:false pendingChangesInFullFlush: false
   [junit4]   2> 190850 T295 C104 oasu.LoggingInfoStream.message [IW][SUITE-SolrExampleEmbeddedTest-seed#[ED0B16967EADF1B1]-worker]: apply all deletes during flush
   [junit4]   2> 190850 T295 C104 oasu.LoggingInfoStream.message [BD][SUITE-SolrExampleEmbeddedTest-seed#[ED0B16967EADF1B1]-worker]: prune sis=segments_1u:  minGen=9223372036854775807 packetCount=0
   [junit4]   2> 190850 T295 C104 oasu.LoggingInfoStream.message [DW][SUITE-SolrExampleEmbeddedTest-seed#[ED0B16967EADF1B1]-worker]: SUITE-SolrExampleEmbeddedTest-seed#[ED0B16967EADF1B1]-worker finishFullFlush success=true
   [junit4]   2> 190850 T295 C104 oasu.LoggingInfoStream.message [IW][SUITE-SolrExampleEmbeddedTest-seed#[ED0B16967EADF1B1]-worker]: startCommit(): start
   [junit4]   2> 190851 T295 C104 oasu.LoggingInfoStream.message [IW][SUITE-SolrExampleEmbeddedTest-seed#[ED0B16967EADF1B1]-worker]:   skip startCommit(): no changes pending
   [junit4]   2> 190851 T295 C104 oasu.LoggingInfoStream.message [IW][SUITE-SolrExampleEmbeddedTest-seed#[ED0B16967EADF1B1]-worker]: commit: pendingCommit == null; skip
   [junit4]   2> 190851 T295 C104 oasu.LoggingInfoStream.message [IW][SUITE-SolrExampleEmbeddedTest-seed#[ED0B16967EADF1B1]-worker]: commit: done
   [junit4]   2> 190851 T295 C104 oasu.LoggingInfoStream.message [IW][SUITE-SolrExampleEmbeddedTest-seed#[ED0B16967EADF1B1]-worker]: rollback
   [junit4]   2> 190852 T295 C104 oasu.LoggingInfoStream.message [IW][SUITE-SolrExampleEmbeddedTest-seed#[ED0B16967EADF1B1]-worker]: all running merges have aborted
   [junit4]   2> 190852 T295 C104 oasu.LoggingInfoStream.message [IW][SUITE-SolrExampleEmbeddedTest-seed#[ED0B16967EADF1B1]-worker]: rollback: done finish merges
   [junit4]   2> 190852 T295 C104 oasu.LoggingInfoStream.message [DW][SUITE-SolrExampleEmbeddedTest-seed#[ED0B16967EADF1B1]-worker]: abort
   [junit4]   2> 190853 T295 C104 oasu.LoggingInfoStream.message [DW][SUITE-SolrExampleEmbeddedTest-seed#[ED0B16967EADF1B1]-worker]: done abort; abortedFiles=[] success=true
   [junit4]   2> 190853 T295 C104 oasu.LoggingInfoStream.message [IW][SUITE-SolrExampleEmbeddedTest-seed#[ED0B16967EADF1B1]-worker]: rollback: infos=
   [junit4]   2> 190853 T295 C104 oasu.LoggingInfoStream.message [IFD][SUITE-SolrExampleEmbeddedTest-seed#[ED0B16967EADF1B1]-worker]: now checkpoint "" [0 segments ; isCommit = false]
   [junit4]   2> 190853 T295 C104 oasu.LoggingInfoStream.message [IFD][SUITE-SolrExampleEmbeddedTest-seed#[ED0B16967EADF1B1]-worker]: 0 msec to checkpoint
   [junit4]   2> 190854 T295 oasc.SolrCore.closeSearcher [collection1] Closing main searcher on request.
   [junit4]   2> 190855 T295 oasc.CachingDirectoryFactory.close Closing MockDirectoryFactory - 2 directories currently being tracked
   [junit4]   2> 190855 T295 oasc.CachingDirectoryFactory.closeCacheValue looking to close /usr/home/jenkins/jenkins-slave/workspace/Lucene-Solr-Tests-4.x-Java7/solr/build/solr-solrj/test/J0/./solr.client.solrj.embedded.SolrExampleEmbeddedTest-ED0B16967EADF1B1-001/init-core-data-001 [CachedDir<<refCount=0;path=/usr/home/jenkins/jenkins-slave/workspace/Lucene-Solr-Tests-4.x-Java7/solr/build/solr-solrj/test/J0/./solr.client.solrj.embedded.SolrExampleEmbeddedTest-ED0B16967EADF1B1-001/init-core-data-001;done=false>>]
   [junit4]   2> 190855 T295 oasc.CachingDirectoryFactory.close Closing directory: /usr/home/jenkins/jenkins-slave/workspace/Lucene-Solr-Tests-4.x-Java7/solr/build/solr-solrj/test/J0/./solr.client.solrj.embedded.SolrExampleEmbeddedTest-ED0B16967EADF1B1-001/init-core-data-001
   [junit4]   2> 190856 T295 oasc.CachingDirectoryFactory.closeCacheValue looking to close /usr/home/jenkins/jenkins-slave/workspace/Lucene-Solr-Tests-4.x-Java7/solr/build/solr-solrj/test/J0/./solr.client.solrj.embedded.SolrExampleEmbeddedTest-ED0B16967EADF1B1-001/init-core-data-001/index [CachedDir<<refCount=0;path=/usr/home/jenkins/jenkins-slave/workspace/Lucene-Solr-Tests-4.x-Java7/solr/build/solr-solrj/test/J0/./solr.client.solrj.embedded.SolrExampleEmbeddedTest-ED0B16967EADF1B1-001/init-core-data-001/index;done=false>>]
   [junit4]   2> 190856 T295 oasc.CachingDirectoryFactory.close Closing directory: /usr/home/jenkins/jenkins-slave/workspace/Lucene-Solr-Tests-4.x-Java7/solr/build/solr-solrj/test/J0/./solr.client.solrj.embedded.SolrExampleEmbeddedTest-ED0B16967EADF1B1-001/init-core-data-001/index
   [junit4]   2> 190856 T295 oas.SolrTestCaseJ4.deleteCore ###deleteCore
   [junit4]   2> 190857 T295 oasc.CoreContainer.shutdown Shutting down CoreContainer instance=92143837
   [junit4]   2> NOTE: leaving temporary files on disk at: /usr/home/jenkins/jenkins-slave/workspace/Lucene-Solr-Tests-4.x-Java7/solr/build/solr-solrj/test/J0/./solr.client.solrj.embedded.SolrExampleEmbeddedTest-ED0B16967EADF1B1-001
   [junit4]   2> NOTE: test params are: codec=Lucene41, sim=DefaultSimilarity, locale=ko, timezone=Africa/Kinshasa
   [junit4]   2> NOTE: FreeBSD 9.1-RELEASE-p3 amd64/Oracle Corporation 1.7.0_60 (64-bit)/cpus=16,threads=1,free=46004632,total=114294784
   [junit4]   2> NOTE: All tests run in this JVM: [TestSpellCheckResponse, TermsResponseTest, AnlysisResponseBaseTest, SolrQueryTest, TestLBHttpSolrServer, FacetFieldTest, TestJsonRecordReader, ConcurrentUpdateSolrServerTest, LargeVolumeJettyTest, SolrExceptionTest, NamedListTest, QueryResponseTest, TestCoreAdmin, SolrExampleBinaryTest, SolrExampleXMLTest, SolrExampleEmbeddedTest]
   [junit4] Completed on J0 in 8.81s, 27 tests, 1 failure <<< FAILURES!

[...truncated 72 lines...]
BUILD FAILED
/usr/home/jenkins/jenkins-slave/workspace/Lucene-Solr-Tests-4.x-Java7/build.xml:474: The following error occurred while executing this line:
/usr/home/jenkins/jenkins-slave/workspace/Lucene-Solr-Tests-4.x-Java7/build.xml:454: The following error occurred while executing this line:
/usr/home/jenkins/jenkins-slave/workspace/Lucene-Solr-Tests-4.x-Java7/build.xml:45: The following error occurred while executing this line:
/usr/home/jenkins/jenkins-slave/workspace/Lucene-Solr-Tests-4.x-Java7/extra-targets.xml:37: The following error occurred while executing this line:
/usr/home/jenkins/jenkins-slave/workspace/Lucene-Solr-Tests-4.x-Java7/solr/build.xml:202: The following error occurred while executing this line:
/usr/home/jenkins/jenkins-slave/workspace/Lucene-Solr-Tests-4.x-Java7/solr/common-build.xml:496: The following error occurred while executing this line:
/usr/home/jenkins/jenkins-slave/workspace/Lucene-Solr-Tests-4.x-Java7/lucene/common-build.xml:1351: The following error occurred while executing this line:
/usr/home/jenkins/jenkins-slave/workspace/Lucene-Solr-Tests-4.x-Java7/lucene/common-build.xml:966: There were test failures: 52 suites, 302 tests, 5 errors, 1 failure

Total time: 132 minutes 13 seconds
Build step 'Invoke Ant' marked build as failure
Archiving artifacts
Sending artifact delta relative to Lucene-Solr-Tests-4.x-Java7 #2062
Archived 3 artifacts
Archive block size is 32768
Received 0 blocks and 11312727 bytes
Compression is 0.0%
Took 3.1 sec
Recording test results
Email was triggered for: Failure
Sending email for trigger: Failure



Mime
View raw message